BDSM
type: Concept
is replaced by: homoit0000442
issued: 2019-05-14
modified: 2024-02-01
replaces: BDSM
comment: Erotic preference and form of personal relationship involving the consensual use of restraint, intense sensory stimulation, and fantasy power roleplay.
comment: Preferencia erótica y forma de relación personal que implica el uso consentido de la restricción, la estimulación sensorial intensa y el juego de roles de poder fantasioso.
broader: https://homosaurus.org/v3/homoit0001267
broader: https://homosaurus.org/v3/homoit0001299
change note: Version 3.7.0
has top concept: Sex (Act)
in scheme: v3
narrower: https://homosaurus.org/v3/homoit0000036
related: https://homosaurus.org/v3/homoit0000022
related: https://homosaurus.org/v3/homoit0000093
related: https://homosaurus.org/v3/homoit0000103
related: https://homosaurus.org/v3/homoit0000252
related: https://homosaurus.org/v3/homoit0000302
related: https://homosaurus.org/v3/homoit0000442
related: https://homosaurus.org/v3/homoit0000609
related: https://homosaurus.org/v3/homoit0000999
related: https://homosaurus.org/v3/homoit0001018
related: https://homosaurus.org/v3/homoit0001133
related: https://homosaurus.org/v3/homoit0001295
related: https://homosaurus.org/v3/homoit0001318
related: https://homosaurus.org/v3/homoit0001353
related: https://homosaurus.org/v3/homoit0001376
related: https://homosaurus.org/v3/homoit0001503
related: https://homosaurus.org/v3/homoit0003130
related: https://homosaurus.org/v3/homoit0003131

Being in love
type: Concept
is replaced by: homoit0000894
issued: 2019-05-14
modified: 2022-10-13
replaces: beingInLove
broader: https://homosaurus.org/v3/homoit0000894
change note: Version 3.7.0
has top concept: Theories
in scheme: v3
related: https://homosaurus.org/v3/homoit0001237

Bisexual theology
type: Concept
is replaced by: homoit0001218
issued: 2019-05-14
modified: 2022-08-22
replaces: bisexualTheology
broader: LGBTQ+ theology
change note: Version 3.7.0
has top concept: LGBTQ+ theology
in scheme: v3

Party drugs
type: Concept
is replaced by: homoit0001235
issued: 2019-05-14
modified: 2022-12-21
replaces: partyDrugs
alternative label: Club drugs
broader: https://homosaurus.org/v3/homoit0000380
change note: Version 3.7.0
has top concept: Substance use in LGBTQ+ communities
in scheme: v3
related: https://homosaurus.org/v3/homoit0002289

Cocaine
type: Concept
is replaced by: homoit0000380
issued: 2019-05-14
modified: 2022-08-22
replaces: cocaine
broader: https://homosaurus.org/v3/homoit0001235
change note: Version 3.7.0
has top concept: Substance use in LGBTQ+ communities
in scheme: v3
related: https://homosaurus.org/v3/homoit0002226

Crystal meth
type: Concept
is replaced by: homoit0000380
issued: 2019-05-14
modified: 2022-08-15
replaces: crystalMeth
alternative label: Tina
broader: https://homosaurus.org/v3/homoit0001235
change note: Version 3.7.0
has top concept: Substance use in LGBTQ+ communities
in scheme: v3
related: https://homosaurus.org/v3/homoit0002226

Drug abuse
type: Concept
is replaced by: homoit0002226
issued: 2019-05-14
modified: 2022-12-16
replaces: drugAbuse
alternative label: Drug addiction
alternative label: Drug dependence
broader: https://homosaurus.org/v3/homoit0002226
change note: Version 3.7.0
has top concept: Substance abuse
in scheme: v3
narrower: https://homosaurus.org/v3/homoit0002226
related: https://homosaurus.org/v3/homoit0000379
related: https://homosaurus.org/v3/homoit0000380
related: https://homosaurus.org/v3/homoit0001235

MDMA
type: Concept
is replaced by: homoit0000380
issued: 2019-05-14
modified: 2022-08-15
replaces: MDMA
comment: A type of methamphetamine commonly referred to as ecstasy or molly
alternative label: Ecstacy
alternative label: Molly
alternative label: XTC
broader: https://homosaurus.org/v3/homoit0001235
change note: Version 3.7.0
has top concept: Substance use in LGBTQ+ communities
in scheme: v3

Ephebophilia
type: Concept
is replaced by: homoit0000442
issued: 2019-05-14
modified: 2022-11-17
replaces: ephebophilia
comment: Sexual preference for young adults between the ages of 16 and 20
broader: https://homosaurus.org/v3/homoit0000442
broader: https://homosaurus.org/v3/homoit0001300
change note: Version 3.7.0
has top concept: Eroticism
in scheme: v3
narrower: https://homosaurus.org/v3/homoit0000442
related: https://homosaurus.org/v3/homoit0000442
related: https://homosaurus.org/v3/homoit0000663
related: https://homosaurus.org/v3/homoit0001520
related: https://homosaurus.org/v3/homoit0001521

Eurogames
type: Concept
is replaced by: homoit0000949
issued: 2019-05-14
modified: 2022-08-22
replaces: eurogames
comment: The most important gay and lesbian sporting event in Europe, hosted by license of the European Gay and Lesbian Sport Federation (EGLSF)
broader: https://homosaurus.org/v3/homoit0000949
change note: Version 3.7.0
has top concept: LGBTQ+ events
in scheme: v3

Europride
type: Concept
is replaced by: homoit0000861
issued: 2019-05-14
modified: 2022-10-04
replaces: europride
comment: A pan-European international event dedicated to LGBTQ+ pride that is hosted by a different European city each year
broader: https://homosaurus.org/v3/homoit0000522
change note: Version 3.7.0
has top concept: LGBTQ+ pride
in scheme: v3

Female prostitution
type: Concept
is replaced by: homoit0000433
issued: 2019-05-14
modified: 2025-01-28
replaces: femaleProstitution
broader: Prostitution
change note: Version 3.7.0
has top concept: Sex industry
in scheme: v3

Gay and lesbian youth
type: Concept
is replaced by: homoit0000544
issued: 2019-05-14
modified: 2022-06-27
replaces: gayAndLesbianYouth
comment: Younger gay men and lesbians, typically between the ages of childhood and adulthood or adolescence
alternative label: Lesbian and gay youth
broader: https://homosaurus.org/v3/homoit0001215
broader: https://homosaurus.org/v3/homoit0001521
change note: Version 3.7.0
has top concept: LGBTQ+ people
in scheme: v3
narrower: https://homosaurus.org/v3/homoit0000479
narrower: https://homosaurus.org/v3/homoit0000743
narrower: https://homosaurus.org/v3/homoit0001145
narrower: https://homosaurus.org/v3/homoit0001479

Gay Games
type: Concept
is replaced by: homoit0000949
issued: 2019-05-14
modified: 2022-08-15
replaces: gayGames
comment: An international sport and cultural event held by the Federation of Gay Games since 1982 that promotes acceptance of LGBTQ+ people and features LGBTQ+ athletes, artists, and other individuals
broader: https://homosaurus.org/v3/homoit0000949
change note: Version 3.7.0
has top concept: LGBTQ+ events
in scheme: v3
related: https://homosaurus.org/v3/homoit0000949

Gay theology
type: Concept
is replaced by: homoit0001218
issued: 2019-05-14
modified: 2022-08-22
replaces: gayTheology
broader: LGBTQ+ theology
change note: Version 3.7.0
has top concept: LGBTQ+ theology
in scheme: v3

Gerontophilia
type: Concept
is replaced by: homoit0000442
issued: 2019-05-14
modified: 2022-11-17
replaces: gerontophilia
broader: https://homosaurus.org/v3/homoit0000442
broader: https://homosaurus.org/v3/homoit0001300
change note: Version 3.7.0
has top concept: Eroticism
in scheme: v3
related: https://homosaurus.org/v3/homoit0000393
related: https://homosaurus.org/v3/homoit0000663

Hebephilia
type: Concept
is replaced by: homoit0000442
issued: 2019-05-14
modified: 2022-08-22
replaces: hebephilia
comment: Refers to a primary or exclusive sexual interest in individuals in the early years of puberty (generally ages 11-14, though onset of puberty may vary)
broader: https://homosaurus.org/v3/homoit0000442
broader: https://homosaurus.org/v3/homoit0001300
change note: Version 3.7.0
has top concept: Eroticism
in scheme: v3
narrower: https://homosaurus.org/v3/homoit0000442
related: https://homosaurus.org/v3/homoit0000663

Lesbian prostitution
type: Concept
is replaced by: homoit0000768
issued: 2019-05-14
modified: 2025-01-28
replaces: lesbianProstitution
broader: Prostitution
change note: Version 3.7.0
has top concept: Sex industry
in scheme: v3
preferred label: Prostitución lesbiana

Lesbian religious groups
type: Concept
is replaced by: homoit0000530
issued: 2019-05-14
modified: 2022-08-22
replaces: lesbianReligiousGroups
broader: https://homosaurus.org/v3/homoit0000753
change note: Version 3.7.0
has top concept: Social movements
in scheme: v3

Lesbian theology
type: Concept
is replaced by: homoit0001218
issued: 2019-05-14
modified: 2022-08-22
replaces: lesbianTheology
broader: LGBTQ+ theology
change note: Version 3.7.0
has top concept: LGBTQ+ theology
in scheme: v3

LGBTQ+ African religions
type: Concept
is replaced by: homoit0000928
issued: 2019-05-14
modified: 2022-08-15
replaces: LGBTQAfricanReligions
alternative label: LGBTQ African religions
broader: https://homosaurus.org/v3/homoit0000928
change note: Version 3.7.0
has top concept: LGBTQ+ religious people
in scheme: v3

LGBTQ+ Native American religions
type: Concept
is replaced by: homoit0000928
issued: 2019-05-14
modified: 2022-11-17
replaces: LGBTQNativeAmericanReligions
alternative label: LGBTQ American Indian religions
alternative label: LGBTQ Native American religions
broader: https://homosaurus.org/v3/homoit0000928
change note: Version 3.7.0
has top concept: LGBTQ+ religious people
in scheme: v3
related: https://homosaurus.org/v3/homoit0001037

LGBTQ+ Asian religions
type: Concept
is replaced by: homoit0000928
issued: 2019-05-14
modified: 2022-08-15
replaces: LGBTQAsianReligions
alternative label: LGBTQ Asian religions
broader: https://homosaurus.org/v3/homoit0000928
change note: Version 3.7.0
has top concept: LGBTQ+ religious people
in scheme: v3
narrower: https://homosaurus.org/v3/homoit0000225
narrower: https://homosaurus.org/v3/homoit0000300
narrower: https://homosaurus.org/v3/homoit0000512
narrower: https://homosaurus.org/v3/homoit0000633
narrower: https://homosaurus.org/v3/homoit0000940
narrower: https://homosaurus.org/v3/homoit0000955
narrower: https://homosaurus.org/v3/homoit0001032

LGBTQ+ Judaism
type: Concept
is replaced by: homoit0000682
issued: 2019-05-14
modified: 2022-10-04
replaces: LGBTQJudaism
comment: Jewish religion and culture as practiced by LGBTQ+ people
alternative label: LGBTQ Judaism
broader: https://homosaurus.org/v3/homoit0000928
change note: Version 3.7.0
has top concept: LGBTQ+ religious people
in scheme: v3
narrower: https://homosaurus.org/v3/homoit0000046
related: https://homosaurus.org/v3/homoit0000682

LGBTQ+ museums
type: Concept
is replaced by: homoit0001030
issued: 2019-05-14
modified: 2023-06-30
replaces: LGBTQMuseums
alternative label: LGBTQ museums
broader: https://homosaurus.org/v3/homoit0001755
change note: Version 3.7.0
has top concept: LGBTQ+ cultural heritage institutions
in scheme: v3
narrower: https://homosaurus.org/v3/homoit0002799
narrower: https://homosaurus.org/v3/homoit0002917

LGBTQ+ people with physical disabilities
type: Concept
is replaced by: homoit0001854
issued: 2019-05-14
modified: 2022-08-22
replaces: LGBTQPeopleWithPhysicalDisabilities
alternative label: People with physical disabilities (LGBTQ)
alternative label: LGBTQ people with physical disabilities
broader: https://homosaurus.org/v3/homoit0000915
change note: Version 3.7.0
has top concept: LGBTQ+ people
in scheme: v3
narrower: LGBTQ+ deaf people
narrower: LGBTQ+ people with visual disabilities

Male prostitution
type: Concept
is replaced by: homoit0000236
issued: 2019-05-14
modified: 2025-01-28
replaces: maleProstitution
broader: Prostitution
change note: Version 3.7.0
has top concept: Sex industry
in scheme: v3

Metropolitan Community Church
type: Concept
is replaced by: homoit0000530
issued: 2019-05-14
modified: 2022-08-15
replaces: metropolitanCommunityChurch
comment: Christian church founded in 1968 by Troy Perry as a welcoming spiritual gathering place for LGBT Christians; MCC is now an international denomination
alternative label: MCC
broader: https://homosaurus.org/v3/homoit0000530
change note: Version 3.7.0
has top concept: LGBTQ+-affirming religious groups
in scheme: v3
related: https://homosaurus.org/v3/homoit0001137

Namban
type: Concept
is replaced by: homoit0000322
issued: 2019-05-14
modified: 2022-11-10
replaces: namban
broader: https://homosaurus.org/v3/homoit0000322
change note: Version 3.7.0
has top concept: Gender
in scheme: v3

Outgames
type: Concept
is replaced by: homoit0000949
issued: 2019-05-14
modified: 2022-08-15
replaces: outgames
comment: A sporting and cultural event open to anyone regardless of sexual identity or qualifying standards that is intended to bring together athletes and artists from around the globe, many from countries where homosexuality remains illegal; separate from the Gay Games
broader: https://homosaurus.org/v3/homoit0000949
change note: Version 3.7.0
has top concept: LGBTQ+ events
in scheme: v3

Prostitution
type: Concept
is replaced by: homoit0001276
issued: 2019-05-14
modified: 2025-01-28
replaces: prostitution
broader: https://homosaurus.org/v3/homoit0001276
broader: https://homosaurus.org/v3/homoit0001299
change note: Version 3.7.0
has top concept: Sex industry
in scheme: v3
narrower: Transgender prostitution
related: https://homosaurus.org/v3/homoit0000278

Sydney Gay and Lesbian Mardi Gras
type: Concept
is replaced by: homoit0000861
issued: 2019-05-14
modified: 2022-10-04
replaces: sydneyGayAndLesbianMardiGras
comment: Annual gay pride parade and festival in Sydney, Australia
broader: https://homosaurus.org/v3/homoit0000522
change note: Version 3.7.0
has top concept: LGBTQ+ pride
in scheme: v3

Transgender theology
type: Concept
is replaced by: homoit0001218
issued: 2019-05-14
modified: 2022-08-22
replaces: transgenderTheology
broader: LGBTQ+ theology
change note: Version 3.7.0
has top concept: LGBTQ+ theology
in scheme: v3

Vaginoplasty
type: Concept
is replaced by: homoit0001851
issued: 2019-05-14
modified: 2022-08-15
replaces: vaginoplasty
broader: https://homosaurus.org/v3/homoit0000561
broader: https://homosaurus.org/v3/homoit0000584
change note: Version 3.7.0
has top concept: Medical care
in scheme: v3
related: https://homosaurus.org/v3/homoit0001485
related: https://homosaurus.org/v3/homoit0001848

Zenani
type: Concept
is replaced by: homoit0001523
issued: 2019-05-14
modified: 2022-12-13
replaces: zenani
comment: Urdu word for effeminate people.
broader: https://homosaurus.org/v3/homoit0000322
change note: Version 3.7.0
has top concept: Gender
in scheme: v3

Adult Children of Alcoholics
type: Concept
is replaced by: homoit0001551
issued: 2020-06-02
modified: 2022-08-15
replaces: adultChildrenOfAlcoholics
comment: A twelve step program based in the U.S. that treats alcoholism as a disease and aims to address its impact on the adult lives of children of alcoholics; may be used in reference to LGBTQ+ members of ACA or LGBTQ+-focused chapters of ACA
alternative label: ACA
alternative label: ACOA
broader: https://homosaurus.org/v3/homoit0001551
change note: Version 3.7.0
has top concept: Recovery groups
in scheme: v3
related: https://homosaurus.org/v3/homoit0001540
related: https://homosaurus.org/v3/homoit0000256
related: https://homosaurus.org/v3/homoit0002227

Alcoholics Anonymous
type: Concept
is replaced by: homoit0001551
issued: 2020-06-02
modified: 2022-08-15
replaces: alcoholicsAnonymous
comment: An international organization aimed toward supporting alcoholics in sobriety through a twelve-step program; may be used in reference to LGBTQ+ individuals in AA or LGBTQ+ chapters of AA
alternative label: AA
broader: https://homosaurus.org/v3/homoit0001551
change note: Version 3.7.0
has top concept: Recovery groups
in scheme: v3
related: https://homosaurus.org/v3/homoit0001540
related: https://homosaurus.org/v3/homoit0002227

Cocaine addiction
type: Concept
is replaced by: homoit0002226
issued: 2020-06-02
modified: 2022-12-16
replaces: cocaineAddiction
comment: Dependence upon cocaine or crack; characterized by the experience of withdrawal symptoms upon cessation.
alternative label: Cocaine abuse
alternative label: Cocaine misuse
alternative label: Cocaine use disorder
alternative label: Crack abuse
alternative label: Crack addiction
broader: https://homosaurus.org/v3/homoit0002226
change note: Version 3.7.0
has top concept: Substance abuse
in scheme: v3
related: https://homosaurus.org/v3/homoit0002227
related: https://homosaurus.org/v3/homoit0001551

Cocaine Anonymous
type: Concept
is replaced by: homoit0001551
issued: 2020-06-02
modified: 2022-08-15
replaces: cocaineAnonymous
alternative label: CA
broader: https://homosaurus.org/v3/homoit0001551
change note: Version 3.7.0
has top concept: Recovery groups
in scheme: v3
related: https://homosaurus.org/v3/homoit0002226
related: https://homosaurus.org/v3/homoit0002227

Crystal Meth Anonymous
type: Concept
is replaced by: homoit0001551
issued: 2020-06-02
modified: 2022-08-15
replaces: crystalMethAnonymous
alternative label: CMA
broader: https://homosaurus.org/v3/homoit0001551
change note: Version 3.7.0
has top concept: Recovery groups
in scheme: v3
related: https://homosaurus.org/v3/homoit0002226
related: https://homosaurus.org/v3/homoit0002227

LGBTQ+ partners of alcoholics
type: Concept
is replaced by: homoit0001083
issued: 2020-06-03
modified: 2022-08-15
replaces: LGBTQPartnersOfAlcoholics
alternative label: LGBTQ partners of alcoholics
broader: https://homosaurus.org/v3/homoit0000915
broader: https://homosaurus.org/v3/homoit0001083
change note: Version 3.7.0
has top concept: LGBTQ+ people
in scheme: v3
related: https://homosaurus.org/v3/homoit0001540
related: https://homosaurus.org/v3/homoit0002227

LGBTQ+ people in Adult Children of Alcoholics
type: Concept
is replaced by: homoit0002227
issued: 2020-06-03
modified: 2022-12-16
replaces: LGBTQPeopleInAdultChildrenOfAlcoholics
alternative label: LGBTQ people in Adult Children of Alcoholics
broader: https://homosaurus.org/v3/homoit0000915
change note: Version 3.7.0
has top concept: LGBTQ+ people
in scheme: v3

LGBTQ+ people in Al-Anon
type: Concept
is replaced by: homoit0002227
issued: 2020-06-03
modified: 2022-12-16
replaces: LGBTQPeopleInAlAnon
alternative label: LGBTQ people in Al-Anon
broader: https://homosaurus.org/v3/homoit0000915
change note: Version 3.7.0
has top concept: LGBTQ+ people
in scheme: v3

LGBTQ+ people in Alcoholics Anonymous
type: Concept
is replaced by: homoit0002227
issued: 2020-06-03
modified: 2022-12-16
replaces: LGBTQPeopleInAlcoholicsAnonymous
alternative label: LGBTQ people in AA
alternative label: LGBTQ people in Alcoholics Anonymous
broader: https://homosaurus.org/v3/homoit0000915
change note: Version 3.7.0
has top concept: LGBTQ+ people
in scheme: v3
related: https://homosaurus.org/v3/homoit0001540

LGBTQ+ people in Cocaine Anonymous
type: Concept
is replaced by: homoit0002227
issued: 2020-06-03
modified: 2022-12-16
replaces: LGBTQPeopleInCocaineAnonymous
alternative label: LGBTQ people in CA
alternative label: LGBTQ people in Cocaine Anonymous
broader: https://homosaurus.org/v3/homoit0000915
change note: Version 3.7.0
has top concept: LGBTQ+ people
in scheme: v3

LGBTQ+ people in Crystal Meth Anonymous
type: Concept
is replaced by: homoit0002227
issued: 2020-06-03
modified: 2022-12-16
replaces: LGBTQPeopleInCrystalMethAnonymous
alternative label: LGBTQ people in CMA
alternative label: LGBTQ people in Crystal Meth Anonymous
broader: https://homosaurus.org/v3/homoit0000915
change note: Version 3.7.0
has top concept: LGBTQ+ people
in scheme: v3
related: https://homosaurus.org/v3/homoit0002226

LGBTQ+ people in Narcotics Anonymous
type: Concept
is replaced by: homoit0002227
issued: 2020-06-03
modified: 2022-12-16
replaces: LGBTQPeopleInNarcoticsAnonymous
alternative label: LGBTQ people in NA
alternative label: LGBTQ people in Narcotics Anonymous
broader: https://homosaurus.org/v3/homoit0000915
change note: Version 3.7.0
has top concept: LGBTQ+ people
in scheme: v3

LGBTQ+ step work
type: Concept
is replaced by: homoit0002227
issued: 2020-06-03
modified: 2022-12-16
replaces: LGBTQStepWork
alternative label: LGBTQ step work
broader: https://homosaurus.org/v3/homoit0001551
change note: Version 3.7.0
has top concept: Health care for LGBTQ+ people
in scheme: v3

Narcotics Anonymous
type: Concept
is replaced by: homoit0001551
issued: 2020-06-03
modified: 2022-08-15
replaces: narcoticsAnonymous
alternative label: NA
broader: https://homosaurus.org/v3/homoit0001551
change note: Version 3.7.0
has top concept: Recovery groups
in scheme: v3
related: https://homosaurus.org/v3/homoit0002226
related: https://homosaurus.org/v3/homoit0002227

Asexual fiction
type: Concept
is replaced by: homoit0001754
issued: 2023-03-23
modified: 2023-10-27
comment: Written works describing imagined events or people; use in reference to fictional works focusing on asexual characters or themes.
broader: https://homosaurus.org/v3/homoit0000443
change note: Version 3.7.0
has top concept: Subcultures
in scheme: v3
related: https://homosaurus.org/v3/homoit0000139
related: https://homosaurus.org/v3/homoit0000157
related: https://homosaurus.org/v3/homoit0001726
related: https://homosaurus.org/v3/homoit0001747
related: https://homosaurus.org/v3/homoit0001751
related: https://homosaurus.org/v3/homoit0001752
related: https://homosaurus.org/v3/homoit0001753
related: https://homosaurus.org/v3/homoit0002150
related: https://homosaurus.org/v3/homoit0002535

Asexual history
type: Concept
is replaced by: homoit0002267
issued: 2023-03-24
modified: 2023-10-27
comment: Past events or accounts of the past concerning asexual people, or people who might be perceived as asexual if they were alive today.
broader: https://homosaurus.org/v3/homoit0002260
change note: Version 3.7.0
has top concept: LGBTQ+ history
in scheme: v3

Müllerian duct variations
type: Concept
is replaced by: homoit0002865
issued: 2023-06-28
modified: 2024-01-30
comment: People with XX chromosomes can have a broad range of variations in how their Müllerian ducts (which typically form the uterus, fallopian tubes, cervix, and upper portion of the vagina) develop. They might have a variation that causes their uterus to develop with a different shape than typical, or to be doubled. Others may have vaginal variations such as a “hemivagina” (where one side of the vagina is obstructed, which can sometimes block menstrual blood from exiting), or a band of tissue dividing the vaginal canal (known as a vaginal septum). Müllerian duct variations usually don’t cause someone to have any variations in their ovaries or hormone production.
alternative label: MRKH
alternative label: Müllerian agenesis
alternative label: Müllerian duct anomalies
broader: https://homosaurus.org/v3/homoit0000669
change note: Version 3.7.0
has top concept: Sex (Body)
in scheme: v3

Two-Spirit children
type: Concept
is replaced by: homoit0002688
issued: 2024-06-10
modified: 2025-01-28
comment: Two-Spirit people who have not yet reached the age of adolescence.
alternative label: 2S children
alternative label: Two Spirit children
alternative label: Two Spirited children
alternative label: Two-Spirited children
broader: https://homosaurus.org/v3/homoit0000255
change note: Version 3.7.0
has top concept: Family members
in scheme: v3
narrower: https://homosaurus.org/v3/homoit0003241
narrower: https://homosaurus.org/v3/homoit0003244
related: https://homosaurus.org/v3/homoit0000256

5-alpha reductase deficiency
type: Concept
issued: 2019-05-14
modified: 2025-02-23
replaces: 5AlphaReductaseDeficiency
comment: People with 5-alpha reductase deficiency, abbreviated as 5-ARD, have XY chromosomes, testes, and typical levels of testosterone, but their bodies do not have the enzyme responsible for converting testosterone to the more powerful androgen dihydrotestosterone (DHT). This affects how an individual's external sex characteristics develop, and people born with 5-ARD often have genital differences that are noticed at birth. In adolescence, people with 5-ARD typically develop some features associated with testosterone puberty, and they may experience genital growth at this point.
alternative label: 5-ARD
broader: https://homosaurus.org/v3/homoit0000669
change note: Version 3.7.0
has top concept: Sex (Body)
in scheme: v3

Aboriginal Australian LGBTQ+ people
type: Concept
issued: 2019-05-14
modified: 2025-02-23
replaces: LGBTQAboriginalPeople
comment: LGBTQ+ people who belong to one or more of the various Indigenous peoples of Australia; do not use to refer to the Indigenous people of the Torres Strait Islands, who are considered ethnically and culturally distinct. Only use to describe people who identify as Aboriginal Australian.
alternative label: Aboriginal people (LGBTQ)
alternative label: Aboriginal Australian people (LGBTQ)
alternative label: LGBTQ+ Aboriginal Australian people
alternative label: LGBTQ+ Aboriginal Australians
alternative label: LGBTQ+ Aboriginal people
alternative label: LGBTQ+ Aboriginals
broader: https://homosaurus.org/v3/homoit0000886
change note: Version 3.7.0
has top concept: LGBTQ+ people
in scheme: v3
narrower: https://homosaurus.org/v3/homoit0001974
narrower: https://homosaurus.org/v3/homoit0001975
narrower: https://homosaurus.org/v3/homoit0001976
narrower: https://homosaurus.org/v3/homoit0001977
narrower: https://homosaurus.org/v3/homoit0001978
narrower: https://homosaurus.org/v3/homoit0001979
narrower: https://homosaurus.org/v3/homoit0002892
narrower: https://homosaurus.org/v3/homoit0003393
related: https://homosaurus.org/v3/homoit0001314
related: https://homosaurus.org/v3/homoit0001809
related: https://homosaurus.org/v3/homoit0001810

Acault
type: Concept
issued: 2019-05-14
modified: 2025-02-23
replaces: acault
comment: A commonly mistranslated Burmese term for people assigned male at birth who exhibit feminine behaviors while serving as spiritual mediums; there is some question over the legitimacy of term.
broader: https://homosaurus.org/v3/homoit0000322
change note: Version 3.7.0
has top concept: Gender
in scheme: v3

Asexuality
type: Concept
issued: 2019-05-14
modified: 2025-02-23
replaces: asexuality
comment: A sexual orientation generally characterized by a lack of sexual attraction or desire.
alternative label: Ace
broader: https://homosaurus.org/v3/homoit0001298
change note: Version 3.7.0
has top concept: Sexual orientation
in scheme: v3
related: https://homosaurus.org/v3/homoit0000067
related: https://homosaurus.org/v3/homoit0000071
related: https://homosaurus.org/v3/homoit0000807
related: https://homosaurus.org/v3/homoit0000882
related: https://homosaurus.org/v3/homoit0001282
related: https://homosaurus.org/v3/homoit0001493
related: https://homosaurus.org/v3/homoit0001535
related: https://homosaurus.org/v3/homoit0001644

HIV/AIDS
type: Concept
issued: 2019-05-14
modified: 2025-02-23
replaces: HIVAIDS
comment: Abbreviation for human immunodeficiency virus (HIV) and acquired immunodeficiency syndrome (AIDS).
alternative label: Acquired immune deficiency syndrome
alternative label: AIDS
alternative label: Acquired immunodeficiency syndrome
alternative label: HIV
alternative label: Human immunodeficiency virus
broader: https://homosaurus.org/v3/homoit0001308
change note: Version 3.7.0
has top concept: STDs
in scheme: v3
narrower: https://homosaurus.org/v3/homoit0000033
narrower: https://homosaurus.org/v3/homoit0001980
related: https://homosaurus.org/v3/homoit0000024
related: https://homosaurus.org/v3/homoit0000025
related: https://homosaurus.org/v3/homoit0000026
related: https://homosaurus.org/v3/homoit0000027
related: https://homosaurus.org/v3/homoit0000028
related: https://homosaurus.org/v3/homoit0000029
related: https://homosaurus.org/v3/homoit0000030
related: https://homosaurus.org/v3/homoit0000031
related: https://homosaurus.org/v3/homoit0000032
related: https://homosaurus.org/v3/homoit0000034
related: https://homosaurus.org/v3/homoit0000226
related: https://homosaurus.org/v3/homoit0000634
related: https://homosaurus.org/v3/homoit0000635
related: https://homosaurus.org/v3/homoit0000636
related: https://homosaurus.org/v3/homoit0000637
related: https://homosaurus.org/v3/homoit0000639
related: https://homosaurus.org/v3/homoit0000640
related: https://homosaurus.org/v3/homoit0000686
related: https://homosaurus.org/v3/homoit0001091
related: https://homosaurus.org/v3/homoit0001130
related: https://homosaurus.org/v3/homoit0001981
related: https://homosaurus.org/v3/homoit0003129

LGBTQ+ activists
type: Concept
issued: 2019-05-14
modified: 2025-02-23
replaces: activistsLGBTQ
comment: LGBTQ+ people who organize or campaign for social, cultural, political, or economic goals and change.
alternative label: Political activists (LGBTQ)
alternative label: Activists (LGBTQ)
broader: https://homosaurus.org/v3/homoit0000915
change note: Version 3.7.0
has top concept: LGBTQ+ people
in scheme: v3
narrower: https://homosaurus.org/v3/homoit0000024
narrower: https://homosaurus.org/v3/homoit0000175
narrower: https://homosaurus.org/v3/homoit0000518
narrower: https://homosaurus.org/v3/homoit0000763
narrower: https://homosaurus.org/v3/homoit0001198
narrower: https://homosaurus.org/v3/homoit0001434
narrower: https://homosaurus.org/v3/homoit0002803
narrower: https://homosaurus.org/v3/homoit0002933
related: https://homosaurus.org/v3/homoit0000006
related: https://homosaurus.org/v3/homoit0001905
related: https://homosaurus.org/v3/homoit0002657

LGBTQ+ actors
type: Concept
issued: 2019-05-14
modified: 2025-02-23
replaces: LGBTQActors
comment: LGBTQ+ people who act in stage plays, movies, television shows, broadcasts, or other productions.
alternative label: Actors (LGBTQ)
alternative label: Actresses (LGBTQ)
alternative label: LGBTQ actors
broader: https://homosaurus.org/v3/homoit0000915
change note: Version 3.7.0
has top concept: LGBTQ+ people
in scheme: v3
narrower: https://homosaurus.org/v3/homoit0003798
related: https://homosaurus.org/v3/homoit0000816
related: https://homosaurus.org/v3/homoit0002142

Adoptive parenthood
type: Concept
issued: 2019-05-14
modified: 2025-02-23
replaces: adoptiveParenthood
comment: The experience of being an adoptive parent to a child or children. An adoptive parent is the person or persons who become permanent parents through adoption with all the responsibilities therein.
broader: https://homosaurus.org/v3/homoit0000914
change note: Version 3.7.0
has top concept: LGBTQ+ parenthood
in scheme: v3
related: https://homosaurus.org/v3/homoit0000451
related: https://homosaurus.org/v3/homoit0000809

Adoptive parents
type: Concept
issued: 2019-05-14
modified: 2025-02-23
replaces: adoptiveParents
comment: People who have adopted children, either legally or through a social/cultural practice.
broader: https://homosaurus.org/v3/homoit0002372
change note: Version 3.7.0
has top concept: Family members
in scheme: v3
related: https://homosaurus.org/v3/homoit0000121
related: https://homosaurus.org/v3/homoit0000451
related: https://homosaurus.org/v3/homoit0000809
related: https://homosaurus.org/v3/homoit0000812

Sex shops
type: Concept
issued: 2019-05-14
modified: 2025-02-23
replaces: sexShops
comment: Retailers that sell products related to sex and sexual entertainment, including sex toys, lingerie, pornography, and other related products.
alternative label: Adult entertainment stores
alternative label: Adult shops
alternative label: Adult stores
alternative label: Erotic shops
alternative label: Erotic stores
alternative label: Porn stores
alternative label: Porn shops
alternative label: Sex stores
alternative label: Adult entertainment shops
broader: https://homosaurus.org/v3/homoit0000011
change note: Version 3.7.0
has top concept: Sex industry
in scheme: v3
related: https://homosaurus.org/v3/homoit0001266

LGBTQ+ porn films
type: Concept
issued: 2019-05-14
modified: 2025-02-23
replaces: pornFilmsLGBTQ
comment: Erotic or sexually explicit films featuring LGBTQ+ people.
alternative label: Adult films (LGBTQ)
alternative label: Porn videos (LGBTQ)
alternative label: X-rated films (LGBTQ)
alternative label: Porn films (LGBTQ)
broader: https://homosaurus.org/v3/homoit0002579
broader: https://homosaurus.org/v3/homoit0003802
change note: Version 3.7.0
has top concept: Subcultures
in scheme: v3
narrower: https://homosaurus.org/v3/homoit0000176
narrower: https://homosaurus.org/v3/homoit0000520
narrower: https://homosaurus.org/v3/homoit0000765
narrower: https://homosaurus.org/v3/homoit0001199
narrower: https://homosaurus.org/v3/homoit0001435
narrower: https://homosaurus.org/v3/homoit0002559
narrower: https://homosaurus.org/v3/homoit0002573
related: https://homosaurus.org/v3/homoit0000014
related: https://homosaurus.org/v3/homoit0000869
related: https://homosaurus.org/v3/homoit0001126
related: https://homosaurus.org/v3/homoit0002544
related: https://homosaurus.org/v3/homoit0002555
related: https://homosaurus.org/v3/homoit0002634
related: https://homosaurus.org/v3/homoit0003798

Sex cinemas
type: Concept
issued: 2019-05-14
modified: 2025-02-23
replaces: sexCinemas
comment: Movie theatres that primarily show pornographic films. Patrons engaging in nudity and public masturbation or sex may be explicitly permitted by the theatre or merely tolerated.
alternative label: Adult movie theatres
alternative label: Adult cinemas
alternative label: Adult movie theaters
alternative label: Erotic cinemas
alternative label: Erotic theaters
alternative label: Erotic theatres
alternative label: Sex theaters
alternative label: Sex theatres
broader: https://homosaurus.org/v3/homoit0000011
change note: Version 3.7.0
has top concept: Sex industry
in scheme: v3
related: https://homosaurus.org/v3/homoit0000013

African American LGBTQ+ people
type: Concept
issued: 2019-05-14
modified: 2025-02-23
replaces: africanAmericansLGBTQ
comment: African American people who are also LGBTQ+; do not use for people of color broadly; follow the individual's preference for African American or Black whenever possible.
alternative label: African Americans (LGBTQ)
alternative label: LGBTQ+ African American people
alternative label: LGBTQ+ African Americans
broader: https://homosaurus.org/v3/homoit0000208
change note: Version 3.7.0
has top concept: LGBTQ+ people
in scheme: v3
narrower: https://homosaurus.org/v3/homoit0000123
narrower: https://homosaurus.org/v3/homoit0000365
narrower: https://homosaurus.org/v3/homoit0000463
narrower: https://homosaurus.org/v3/homoit0000714
narrower: https://homosaurus.org/v3/homoit0001151
narrower: https://homosaurus.org/v3/homoit0001384
narrower: https://homosaurus.org/v3/homoit0002335
narrower: https://homosaurus.org/v3/homoit0002935
narrower: https://homosaurus.org/v3/homoit0003558
related: https://homosaurus.org/v3/homoit0000095
related: https://homosaurus.org/v3/homoit0001254
related: https://homosaurus.org/v3/homoit0002333

Afro-Canadian LGBTQ+ people
type: Concept
issued: 2019-05-14
modified: 2025-02-23
replaces: afroCanadiansLGBTQ
comment: LGBTQ+ people of African descent born in Canada or LGBTQ+ people born in African countries who live in or have a strong connection to Canada; use for individuals who self-identity as Afro-Canadian.
alternative label: Afro-Canadian people (LGBTQ)
alternative label: Afro-Canadians (LGBTQ)
alternative label: LGBTQ+ Afro-Canadian people
alternative label: LGBTQ+ Afro-Canadians
broader: https://homosaurus.org/v3/homoit0000208
change note: Version 3.7.0
has top concept: LGBTQ+ people
in scheme: v3
narrower: https://homosaurus.org/v3/homoit0000124
narrower: https://homosaurus.org/v3/homoit0000464
narrower: https://homosaurus.org/v3/homoit0000715
narrower: https://homosaurus.org/v3/homoit0001152
narrower: https://homosaurus.org/v3/homoit0001385
narrower: https://homosaurus.org/v3/homoit0002893
narrower: https://homosaurus.org/v3/homoit0002957

Afro-Caribbean LGBTQ+ people
type: Concept
issued: 2019-05-14
modified: 2025-02-23
replaces: afroCaribbeansLGBTQ
comment: LGBTQ+ people of African descent born in the Caribbean or LGBTQ+ people born in African countries who live in or have a strong connection to the Caribbean. Only use for individuals who self-identify as Afro-Caribbean.
alternative label: Afro-Caribbean people (LGBTQ)
alternative label: Afro-Caribbeans (LGBTQ)
alternative label: LGBTQ+ Afro-Caribbean people
alternative label: LGBTQ+ Afro-Caribbeans
broader: https://homosaurus.org/v3/homoit0000208
change note: Version 3.7.0
has top concept: LGBTQ+ people
in scheme: v3
narrower: https://homosaurus.org/v3/homoit0000125
narrower: https://homosaurus.org/v3/homoit0000465
narrower: https://homosaurus.org/v3/homoit0000716
narrower: https://homosaurus.org/v3/homoit0001153
narrower: https://homosaurus.org/v3/homoit0001386
narrower: https://homosaurus.org/v3/homoit0002894
narrower: https://homosaurus.org/v3/homoit0002958

Afro-European LGBTQ+ people
type: Concept
issued: 2019-05-14
modified: 2025-02-23
replaces: afroEuropeansLGBTQ
comment: LGBTQ+ people of African descent born in European countries or LGBTQ+ people born in African countries who live in or have a strong connection to Europe. Only use for individuals who self-identify as Afro-European.
alternative label: Afro-European people (LGBTQ)
alternative label: Afro-Europeans (LGBTQ)
alternative label: LGBTQ+ Afro-European people
alternative label: LGBTQ+ Afro-Europeans
broader: https://homosaurus.org/v3/homoit0000208
change note: Version 3.7.0
has top concept: LGBTQ+ people
in scheme: v3
narrower: https://homosaurus.org/v3/homoit0000126
narrower: https://homosaurus.org/v3/homoit0000466
narrower: https://homosaurus.org/v3/homoit0000717
narrower: https://homosaurus.org/v3/homoit0001154
narrower: https://homosaurus.org/v3/homoit0001387
narrower: https://homosaurus.org/v3/homoit0002896
narrower: https://homosaurus.org/v3/homoit0002959

Afro-Latin American LGBTQ+ people
type: Concept
issued: 2019-05-14
modified: 2025-02-23
replaces: afroLatinAmericansLGBTQ
comment: LGBTQ+ people of African descent born in Latin American countries or LGBTQ+ people born in African countries who live in or have a strong connection to Latin America. Only use for individuals who self-identify as Afro-Latin American.
alternative label: Afro-Latin American people (LGBTQ)
alternative label: Afro-Latin Americans (LGBTQ)
alternative label: LGBTQ+ Afro-Latin American people
alternative label: LGBTQ+ Afro-Latin Americans
broader: https://homosaurus.org/v3/homoit0000208
broader: https://homosaurus.org/v3/homoit0000253
change note: Version 3.7.0
has top concept: LGBTQ+ people
in scheme: v3
narrower: https://homosaurus.org/v3/homoit0000127
narrower: https://homosaurus.org/v3/homoit0000467
narrower: https://homosaurus.org/v3/homoit0000718
narrower: https://homosaurus.org/v3/homoit0001155
narrower: https://homosaurus.org/v3/homoit0001388
narrower: https://homosaurus.org/v3/homoit0002898
narrower: https://homosaurus.org/v3/homoit0002960

Age of consent
type: Concept
issued: 2019-05-14
modified: 2025-02-23
replaces: ageOfConsent
comment: The age at which a person is considered legally competent to consent to sexual acts. The age of consent varies depending on the country, state, or culture.
broader: https://homosaurus.org/v3/homoit0000302
change note: Version 3.7.0
has top concept: Consent
in scheme: v3
related: https://homosaurus.org/v3/homoit0000663
related: https://homosaurus.org/v3/homoit0001289
related: https://homosaurus.org/v3/homoit0002215

Agender people
type: Concept
issued: 2019-05-14
modified: 2025-02-23
replaces: agenderPeople
comment: People who identify as not having a gender, or being genderless.
broader: https://homosaurus.org/v3/homoit0001378
broader: https://homosaurus.org/v3/homoit0001817
change note: Version 3.7.0
has top concept: LGBTQ+ people
in scheme: v3
related: https://homosaurus.org/v3/homoit0000571
related: https://homosaurus.org/v3/homoit0001048
related: https://homosaurus.org/v3/homoit0001927

Age play
type: Concept
issued: 2019-05-14
modified: 2025-02-23
replaces: ageplay
comment: The act of roleplaying as people of different ages, usually as children, for fun or erotic enjoyment.
alternative label: ABDL
alternative label: Ageplay
alternative label: Infantilism
broader: https://homosaurus.org/v3/homoit0001242
change note: Version 3.7.0
has top concept: Sex (Act)
in scheme: v3
related: https://homosaurus.org/v3/homoit0000442
related: https://homosaurus.org/v3/homoit0003052
related: https://homosaurus.org/v3/homoit0003062

Agî
type: Concept
issued: 2019-05-14
modified: 2025-02-23
replaces: agi
comment: Filipino word that translates to both hermaphrodite and a gay slur.
alternative label: Agi
broader: https://homosaurus.org/v3/homoit0000322
broader: https://homosaurus.org/v3/homoit0001560
change note: Version 3.7.0
has top concept: Gender
in scheme: v3
related: https://homosaurus.org/v3/homoit0000091

AIDS activists
type: Concept
issued: 2019-05-14
modified: 2025-02-23
replaces: AIDSActivists
comment: People who campaign for social and political change for people affected by HIV/AIDS.
broader: https://homosaurus.org/v3/homoit0000007
change note: Version 3.7.0
has top concept: LGBTQ+ people
in scheme: v3
related: https://homosaurus.org/v3/homoit0000005
related: https://homosaurus.org/v3/homoit0000030
related: https://homosaurus.org/v3/homoit0001026

AIDS information centers
type: Concept
issued: 2019-05-14
modified: 2025-02-23
replaces: AIDSInformationCentres
comment: Institutions dedicated to education, prevention, and treatment of HIV/AIDS; AIDS information centers often provide services like HIV counseling and testing services.
broader: https://homosaurus.org/v3/homoit0000660
change note: Version 3.7.0
has top concept: LGBTQ+ centers
in scheme: v3
preferred label: AIDS information centres
related: https://homosaurus.org/v3/homoit0000005

AIDS education
type: Concept
issued: 2019-05-14
modified: 2025-02-23
replaces: AIDSEducation
comment: Instruction about HIV/AIDS, including topics like the history of the AIDS epidemic, contraction, prevention, and treatment.
broader: https://homosaurus.org/v3/homoit0000661
change note: Version 3.7.0
has top concept: Information provision
in scheme: v3
related: https://homosaurus.org/v3/homoit0000005
related: https://homosaurus.org/v3/homoit0001251
related: https://homosaurus.org/v3/homoit0001271
related: https://homosaurus.org/v3/homoit0001294

AIDS memorial quilts
type: Concept
issued: 2019-05-14
modified: 2025-02-23
replaces: AIDSMemorialQuilts
comment: Quilts created to celebrate the lives of people who have died of AIDS-related causes, bring awareness to the AIDS epidemic, and provide support and healing for those affected. The term is often used to refer to the NAMES Project AIDS Memorial Quilt started by Cleve Jones in 1985.
broader: https://homosaurus.org/v3/homoit0000029
change note: Version 3.7.0
has top concept: Medical care
in scheme: v3
related: https://homosaurus.org/v3/homoit0000005
related: https://homosaurus.org/v3/homoit0000901

AIDS memorials
type: Concept
issued: 2019-05-14
modified: 2025-02-23
replaces: AIDSMemorials
comment: Projects and events celebrating the lives of people who have died of AIDS-related causes.
broader: https://homosaurus.org/v3/homoit0001004
change note: Version 3.7.0
has top concept: Medical care
in scheme: v3
narrower: https://homosaurus.org/v3/homoit0000028
related: https://homosaurus.org/v3/homoit0000005
related: https://homosaurus.org/v3/homoit0000901

AIDS periodicals
type: Concept
issued: 2019-05-14
modified: 2025-02-23
replaces: AIDSPeriodicals
comment: Print or digital publications published periodically and created by or for people with AIDS.
broader: https://homosaurus.org/v3/homoit0001830
change note: Version 3.7.0
has top concept: LGBTQ+ periodicals
in scheme: v3
related: https://homosaurus.org/v3/homoit0000005
related: https://homosaurus.org/v3/homoit0000030
related: https://homosaurus.org/v3/homoit0001132

ARC (AIDS-Related Complex)
type: Concept
issued: 2019-05-14
modified: 2025-02-23
replaces: ARC
comment: Abbreviation for AIDS-related complex, a term used early in the AIDS epidemic to describe people with symptomatic HIV infections who have not been formally diagnosed with AIDS. Since 2000, clinical use of the term has been largely discontinued.
alternative label: AIDS Related Complex
alternative label: ARC
broader: https://homosaurus.org/v3/homoit0000005
change note: Version 3.7.0
has top concept: STDs
in scheme: v3
related: https://homosaurus.org/v3/homoit0000686

Red ribbons (AIDS)
type: Concept
issued: 2019-05-14
modified: 2025-02-23
replaces: redRibbons
comment: Red ribbon that acts as an international symbol for HIV and AIDS awareness; first adopted in the early 1990s for the Red Ribbon Project.
alternative label: AIDS ribbons
alternative label: Red ribbons
broader: https://homosaurus.org/v3/homoit0000954
change note: Version 3.7.0
has top concept: LGBTQ+ symbols
in scheme: v3
related: https://homosaurus.org/v3/homoit0000005
related: https://homosaurus.org/v3/homoit0000025

Akava'ine
type: Concept
issued: 2019-05-14
modified: 2025-02-23
replaces: akavaine
comment: A Cook Islands Māori word referring to transgender people of Māori descent from the Cook Islands.
broader: https://homosaurus.org/v3/homoit0000322
broader: https://homosaurus.org/v3/homoit0002653
change note: Version 3.7.0
has top concept: Gender
in scheme: v3

Sadomasochism
type: Concept
issued: 2019-05-14
modified: 2025-02-23
replaces: SM
comment: Eroticization of pain and intense sensation.
alternative label: Algolagnia
alternative label: S&M
alternative label: SM
alternative label: Sexual Torture
broader: https://homosaurus.org/v3/homoit0000442
broader: https://homosaurus.org/v3/homoit0001300
change note: Version 3.7.0
has top concept: Eroticism
in scheme: v3
narrower: https://homosaurus.org/v3/homoit0000997
narrower: https://homosaurus.org/v3/homoit0001250
narrower: https://homosaurus.org/v3/homoit0003110
narrower: https://homosaurus.org/v3/homoit0003130
narrower: https://homosaurus.org/v3/homoit0003131
related: https://homosaurus.org/v3/homoit0001295
related: https://homosaurus.org/v3/homoit0001318
related: https://homosaurus.org/v3/homoit0001319
related: https://homosaurus.org/v3/homoit0003084
related: https://homosaurus.org/v3/homoit0003116
related: https://homosaurus.org/v3/homoit0003141

Ali
type: Concept
issued: 2019-05-14
modified: 2025-02-23
replaces: ali
comment: Tamil slur for effeminate gay man; directly translates to hermaphrodite.
broader: https://homosaurus.org/v3/homoit0000322
broader: https://homosaurus.org/v3/homoit0001560
change note: Version 3.7.0
has top concept: Gender
in scheme: v3

Allies
type: Concept
issued: 2019-05-14
modified: 2025-02-23
replaces: allies
comment: Individuals of a privileged social identity who support, stand in solidarity with, and work to advance the interests of marginalized groups they do not belong to.
broader: https://homosaurus.org/v3/homoit0000627
change note: Version 3.7.0
has top concept: Heterosexuals
in scheme: v3
related: https://homosaurus.org/v3/homoit0000006
related: https://homosaurus.org/v3/homoit0000538
related: https://homosaurus.org/v3/homoit0000873
related: https://homosaurus.org/v3/homoit0003195
related: https://homosaurus.org/v3/homoit0003693

Alyha
type: Concept
issued: 2019-05-14
modified: 2025-02-23
replaces: alyha
comment: In Native American Mohave tribes, people assigned male at birth who exhibit feminine traits and could become socially female, often serving as healers.
broader: https://homosaurus.org/v3/homoit0000322
change note: Version 3.7.0
has top concept: Gender
in scheme: v3
related: https://homosaurus.org/v3/homoit0000654
related: https://homosaurus.org/v3/homoit0001480

Amazons
type: Concept
issued: 2019-05-14
modified: 2025-02-23
replaces: amazons
comment: Nation of all-female warriors in Greek mythology and Classical antiquity; from the Early Modern period, their name has become a term for woman warriors in general as well as a cultural symbol invoked in lesbian communities.
broader: https://homosaurus.org/v3/homoit0001509
change note: Version 3.7.0
has top concept: Gender
in scheme: v3
related: https://homosaurus.org/v3/homoit0000556

Anal beads
type: Concept
issued: 2019-05-14
modified: 2025-02-23
replaces: analBeads
comment: A sex toy used in anal play that consists of multiple attached spheres (or balls) that are continuously inserted through the anus into the rectum and then removed with varying speeds.
broader: https://homosaurus.org/v3/homoit0001266
change note: Version 3.7.0
has top concept: Sex accessories
in scheme: v3
related: https://homosaurus.org/v3/homoit0000081

Anal fisting
type: Concept
issued: 2019-05-14
modified: 2025-02-23
replaces: analFisting
comment: Sexual practice of inserting a fist into an anus.
broader: https://homosaurus.org/v3/homoit0000043
broader: https://homosaurus.org/v3/homoit0000445
change note: Version 3.7.0
has top concept: Sex (Act)
in scheme: v3
related: https://homosaurus.org/v3/homoit0000049
related: https://homosaurus.org/v3/homoit0000081
related: https://homosaurus.org/v3/homoit0001486

Anal sex
type: Concept
issued: 2019-05-14
modified: 2025-02-23
replaces: analSex
comment: Sexual activity involving penetration of the anus.
broader: https://homosaurus.org/v3/homoit0000081
broader: https://homosaurus.org/v3/homoit0001267
broader: https://homosaurus.org/v3/homoit0001299
change note: Version 3.7.0
has top concept: Sex (Act)
in scheme: v3
narrower: https://homosaurus.org/v3/homoit0000042
narrower: https://homosaurus.org/v3/homoit0000076
related: https://homosaurus.org/v3/homoit0000049
related: https://homosaurus.org/v3/homoit0000233
related: https://homosaurus.org/v3/homoit0003124

Androgen insensitivity syndrome
type: Concept
issued: 2019-05-14
modified: 2025-02-23
replaces: androgenInsensitivitySyndrome
comment: People born with AIS have XY chromosomes and testes, and their bodies have varying levels of insensitivity to androgens (including testosterone). This means that their cells do not respond typically to the testosterone that they produce. Like other variations in sex characteristics, AIS is a spectrum, with the subcategories of complete (CAIS), partial (PAIS), and mild androgen insensitivity (MAIS). The term "male androgen insensitivity syndrome" should not be used to describe this variation because many people with AIS are women.
alternative label: AIS
alternative label: Goldberg-Maxwell syndrome
alternative label: Male androgen insensitivity syndrome
broader: https://homosaurus.org/v3/homoit0000669
change note: Version 3.7.0
has top concept: Sex (Body)
in scheme: v3
narrower: https://homosaurus.org/v3/homoit0001079
narrower: https://homosaurus.org/v3/homoit0002830
narrower: https://homosaurus.org/v3/homoit0002866

Androgynous people
type: Concept
issued: 2019-05-14
modified: 2025-02-23
replaces: androgynousPeople
comment: People who have a non-binary gender that includes masculine and feminine traits.
broader: https://homosaurus.org/v3/homoit0001378
broader: https://homosaurus.org/v3/homoit0001817
change note: Version 3.7.0
has top concept: LGBTQ+ people
in scheme: v3
related: https://homosaurus.org/v3/homoit0000047
related: https://homosaurus.org/v3/homoit0001048

Androgynos
type: Concept
issued: 2019-05-14
modified: 2025-02-23
replaces: androgynos
comment: Israeli term used in Rabbinical literature to describe both an intersex mythological creature and refer to a legal condition.
broader: https://homosaurus.org/v3/homoit0000322
change note: Version 3.7.0
has top concept: Gender
in scheme: v3
related: https://homosaurus.org/v3/homoit0000618

Androgyny
type: Concept
issued: 2019-05-14
modified: 2025-02-23
replaces: androgyny
comment: The combination of masculine and feminine characteristics.
broader: https://homosaurus.org/v3/homoit0000568
change note: Version 3.7.0
has top concept: Gender
in scheme: v3
related: https://homosaurus.org/v3/homoit0000045
related: https://homosaurus.org/v3/homoit0000389
related: https://homosaurus.org/v3/homoit0000562
related: https://homosaurus.org/v3/homoit0000577
related: https://homosaurus.org/v3/homoit0000995
related: https://homosaurus.org/v3/homoit0001756

LGBTQ+ Anglicans
type: Concept
issued: 2019-05-14
modified: 2025-02-23
replaces: LGBTQAnglicans
comment: LGBTQ+ people who are Anglican.
alternative label: Anglicans (LGBTQ)
alternative label: LGBTQ Church of England
alternative label: LGBTQ Episcopalians
alternative label: LGBTQ Anglicans
broader: https://homosaurus.org/v3/homoit0001137
change note: Version 3.7.0
has top concept: LGBTQ+ religious people
in scheme: v3

Rimming
type: Concept
issued: 2019-05-14
modified: 2025-02-23
replaces: rimming
comment: Sexual stimulation of the anus by the tongue or mouth.
alternative label: Analingus
broader: https://homosaurus.org/v3/homoit0000081
broader: https://homosaurus.org/v3/homoit0000969
broader: https://homosaurus.org/v3/homoit0001267
broader: https://homosaurus.org/v3/homoit0001299
change note: Version 3.7.0
has top concept: Sex (Act)
in scheme: v3
related: https://homosaurus.org/v3/homoit0000042
related: https://homosaurus.org/v3/homoit0000043
related: https://homosaurus.org/v3/homoit0000593

Anonymous sex
type: Concept
issued: 2019-05-14
modified: 2025-02-23
replaces: anonymousSex
comment: Sexual encounters between two or more people who do not know one another, typically with no expectation of future communication or interaction.
broader: https://homosaurus.org/v3/homoit0001299
change note: Version 3.7.0
has top concept: Sexual practices
in scheme: v3
related: https://homosaurus.org/v3/homoit0000242
related: https://homosaurus.org/v3/homoit0000309
related: https://homosaurus.org/v3/homoit0000319
related: https://homosaurus.org/v3/homoit0000974
related: https://homosaurus.org/v3/homoit0001302
related: https://homosaurus.org/v3/homoit0001306
related: https://homosaurus.org/v3/homoit0001357

Anti-bisexual discrimination
type: Concept
issued: 2019-05-14
modified: 2025-02-23
replaces: antiBisexualDiscrimination
comment: The unjust or prejudicial treatment of bisexual people due to their sexual identity; may include the denial of legal rights, employment, and housing.
broader: https://homosaurus.org/v3/homoit0000356
change note: Version 3.7.0
has top concept: LGBTQ+ discrimination
in scheme: v3
related: https://homosaurus.org/v3/homoit0000117

Anti-bisexual violence
type: Concept
issued: 2019-05-14
modified: 2025-02-23
replaces: antiBisexualViolence
comment: Behavior involving physical force intended to harm or kill bisexual people on the basis of their identity.
broader: https://homosaurus.org/v3/homoit0000059
change note: Version 3.7.0
has top concept: Anti-LGBTQ+ violence
in scheme: v3
related: https://homosaurus.org/v3/homoit0000109
related: https://homosaurus.org/v3/homoit0000117

Anti-discrimination law
type: Concept
issued: 2019-05-14
modified: 2025-02-23
replaces: anti-discriminationLaw
comment: Legislation designed to prevent employment, housing, education, and other forms of discrimination against protected groups of people.
broader: https://homosaurus.org/v3/homoit0000702
change note: Version 3.7.0
has top concept: Law
in scheme: v3
related: https://homosaurus.org/v3/homoit0000356
related: https://homosaurus.org/v3/homoit0001141

Anti-gay discrimination
type: Concept
issued: 2019-05-14
modified: 2025-02-23
replaces: antiGayDiscrimination
comment: The unjust or prejudicial treatment of gay men due to their sexual identity; may include the denial of legal rights, employment, and housing.
broader: https://homosaurus.org/v3/homoit0000356
change note: Version 3.7.0
has top concept: LGBTQ+ discrimination
in scheme: v3
related: https://homosaurus.org/v3/homoit0000646

Anti-gay violence
type: Concept
issued: 2019-05-14
modified: 2025-02-23
replaces: anti-gayViolence
comment: Behavior involving physical force intended to harm or kill gay men on the basis of their identity.
alternative label: Gay bashing
broader: https://homosaurus.org/v3/homoit0000059
change note: Version 3.7.0
has top concept: Anti-LGBTQ+ violence
in scheme: v3
narrower: https://homosaurus.org/v3/homoit0000449
related: https://homosaurus.org/v3/homoit0000109
related: https://homosaurus.org/v3/homoit0000646

Anti-lesbian discrimination
type: Concept
issued: 2019-05-14
modified: 2025-02-23
replaces: antiLesbianDiscrimination
comment: The unjust or prejudicial treatment of lesbians due to their sexual identity; may include the denial of legal rights, employment, and housing.
broader: https://homosaurus.org/v3/homoit0000356
change note: Version 3.7.0
has top concept: LGBTQ+ discrimination
in scheme: v3
related: https://homosaurus.org/v3/homoit0000803

Anti-lesbian violence
type: Concept
issued: 2019-05-14
modified: 2025-02-23
replaces: anti-lesbianViolence
comment: Behavior involving physical force intended to harm or kill lesbians on the basis of their identity.
alternative label: Lesbian bashing
broader: https://homosaurus.org/v3/homoit0000059
change note: Version 3.7.0
has top concept: Anti-LGBTQ+ violence
in scheme: v3
related: https://homosaurus.org/v3/homoit0000109
related: https://homosaurus.org/v3/homoit0000556
related: https://homosaurus.org/v3/homoit0000803

Anti-queer discrimination
type: Concept
issued: 2019-05-14
modified: 2025-02-23
replaces: antiQueerDiscrimination
comment: The unjust or prejudicial treatment of queer people due to their identity; may include the denial of legal rights, employment, and housing.
broader: https://homosaurus.org/v3/homoit0000356
change note: Version 3.7.0
has top concept: LGBTQ+ discrimination
in scheme: v3
related: https://homosaurus.org/v3/homoit0001229

Anti-queer violence
type: Concept
issued: 2019-05-14
modified: 2025-02-23
replaces: antiQueerViolence
comment: Behavior involving physical force intended to harm or kill queer people on the basis of their identity.
broader: https://homosaurus.org/v3/homoit0000059
change note: Version 3.7.0
has top concept: Anti-LGBTQ+ violence
in scheme: v3
related: https://homosaurus.org/v3/homoit0000109
related: https://homosaurus.org/v3/homoit0001229

Anti-transgender discrimination
type: Concept
issued: 2019-05-14
modified: 2025-02-23
replaces: antiTransgenderDiscrimination
comment: The unjust or prejudicial treatment of transgender people (or others perceived to be transgressing gender norms) due to their gender identity and/or expression; may include the denial of legal rights, employment, and housing.
broader: https://homosaurus.org/v3/homoit0000356
change note: Version 3.7.0
has top concept: LGBTQ+ discrimination
in scheme: v3
narrower: https://homosaurus.org/v3/homoit0000336
narrower: https://homosaurus.org/v3/homoit0001819
related: https://homosaurus.org/v3/homoit0001006
related: https://homosaurus.org/v3/homoit0001139
related: https://homosaurus.org/v3/homoit0001140
related: https://homosaurus.org/v3/homoit0001141
related: https://homosaurus.org/v3/homoit0001467
related: https://homosaurus.org/v3/homoit0001516
related: https://homosaurus.org/v3/homoit0001892
related: https://homosaurus.org/v3/homoit0001903
related: https://homosaurus.org/v3/homoit0003158
related: https://homosaurus.org/v3/homoit0003499
related: https://homosaurus.org/v3/homoit0003737

Anti-transgender violence
type: Concept
issued: 2019-05-14
modified: 2025-02-23
replaces: anti-transgenderViolence
comment: Behavior involving physical force intended to harm or kill transgender people on the basis of their identity.
broader: https://homosaurus.org/v3/homoit0000059
change note: Version 3.7.0
has top concept: Anti-LGBTQ+ violence
in scheme: v3
related: https://homosaurus.org/v3/homoit0000109
related: https://homosaurus.org/v3/homoit0001467

Aphallia
type: Concept
issued: 2019-05-14
modified: 2025-02-23
replaces: aphallia
comment: People with aphallia have XY chromosomes, testes, and are born without a penis. They produce typical levels of testosterone, and they develop secondary sex characteristics associated with a typical testosterone puberty during adolescence.
alternative label: Penile agenesis
broader: https://homosaurus.org/v3/homoit0000669
change note: Version 3.7.0
has top concept: Sex (Body)
in scheme: v3

Aravani
type: Concept
issued: 2019-05-14
modified: 2025-02-23
replaces: aravani
comment: Indian term for people who identify as women trapped in male bodies; many prefer other terms, such as hijra or thirunangai.
alternative label: Aruvani
broader: https://homosaurus.org/v3/homoit0000322
change note: Version 3.7.0
has top concept: Gender
in scheme: v3
related: https://homosaurus.org/v3/homoit0000632
related: https://homosaurus.org/v3/homoit0001370

LGBTQ+ archives
type: Concept
issued: 2019-05-14
modified: 2025-02-23
replaces: archivesLGBTQ
comment: Collections of records and materials relating to LGBTQ+ people or LGBTQ+ communities; can include a variety of organizations and institutions from community to government archives.
alternative label: LGBTQ archives
alternative label: Archives (LGBTQ)
broader: https://homosaurus.org/v3/homoit0001755
change note: Version 3.7.0
has top concept: LGBTQ+ cultural heritage institutions
in scheme: v3
narrower: https://homosaurus.org/v3/homoit0000128
narrower: https://homosaurus.org/v3/homoit0000469
narrower: https://homosaurus.org/v3/homoit0000719
narrower: https://homosaurus.org/v3/homoit0001156
narrower: https://homosaurus.org/v3/homoit0001389
narrower: https://homosaurus.org/v3/homoit0002759
narrower: https://homosaurus.org/v3/homoit0002776
narrower: https://homosaurus.org/v3/homoit0003608
related: https://homosaurus.org/v3/homoit0000968
related: https://homosaurus.org/v3/homoit0002677

Aromantic people
type: Concept
issued: 2019-05-14
modified: 2025-02-23
replaces: aromanticPeople
comment: Individuals who do not generally experience romantic attraction or desire.
broader: https://homosaurus.org/v3/homoit0001829
change note: Version 3.7.0
has top concept: Romantic minorities
in scheme: v3
related: https://homosaurus.org/v3/homoit0000004
related: https://homosaurus.org/v3/homoit0001237
related: https://homosaurus.org/v3/homoit0001532
related: https://homosaurus.org/v3/homoit0001644
related: https://homosaurus.org/v3/homoit0001757
related: https://homosaurus.org/v3/homoit0001761
related: https://homosaurus.org/v3/homoit0001765
related: https://homosaurus.org/v3/homoit0001823
related: https://homosaurus.org/v3/homoit0001824
related: https://homosaurus.org/v3/homoit0001825
related: https://homosaurus.org/v3/homoit0001826
related: https://homosaurus.org/v3/homoit0001827
related: https://homosaurus.org/v3/homoit0002145

Arrests of LGBTQ+ people
type: Concept
issued: 2019-05-14
modified: 2025-02-23
replaces: arrestsOfLGBTQPeople
comment: Apprehension and detention of LGBTQ+ people by an institution or authority in order to deprive them of their freedom of movement.
alternative label: Arrests of LGBTQ people
broader: https://homosaurus.org/v3/homoit0000348
broader: https://homosaurus.org/v3/homoit0002373
change note: Version 3.7.0
has top concept: Detention of LGBTQ+ people
in scheme: v3
related: https://homosaurus.org/v3/homoit0000835
related: https://homosaurus.org/v3/homoit0001108
related: https://homosaurus.org/v3/homoit0001120

Insemination
type: Concept
issued: 2019-05-14
modified: 2025-02-23
replaces: insemination
comment: The act of using sperm to induce pregnancy by natural or artificial means, especially in the context of LGBTQ+ family planning with sperm donors.
alternative label: Fertilisation
alternative label: Fertilization
broader: https://homosaurus.org/v3/homoit0000843
change note: Version 3.7.0
has top concept: LGBTQ+ family planning
in scheme: v3
narrower: https://homosaurus.org/v3/homoit0001265
narrower: https://homosaurus.org/v3/homoit0002617
narrower: https://homosaurus.org/v3/homoit0002620
related: https://homosaurus.org/v3/homoit0001336
related: https://homosaurus.org/v3/homoit0002618

LGBTQ+ artists
type: Concept
issued: 2019-05-14
modified: 2025-02-23
replaces: artistsLGBTQ
comment: LGBTQ+ people who practice any of various creative arts.
alternative label: Artists (LGBTQ)
broader: https://homosaurus.org/v3/homoit0000915
change note: Version 3.7.0
has top concept: LGBTQ+ people
in scheme: v3
narrower: https://homosaurus.org/v3/homoit0000129
narrower: https://homosaurus.org/v3/homoit0000470
narrower: https://homosaurus.org/v3/homoit0000720
narrower: https://homosaurus.org/v3/homoit0001157
narrower: https://homosaurus.org/v3/homoit0001390
narrower: https://homosaurus.org/v3/homoit0002760
narrower: https://homosaurus.org/v3/homoit0002777
narrower: https://homosaurus.org/v3/homoit0003446
narrower: https://homosaurus.org/v3/homoit0003511
narrower: https://homosaurus.org/v3/homoit0003845
narrower: https://homosaurus.org/v3/homoit0003846
narrower: https://homosaurus.org/v3/homoit0003847
narrower: https://homosaurus.org/v3/homoit0003848
related: https://homosaurus.org/v3/homoit0000816
related: https://homosaurus.org/v3/homoit0001755
related: https://homosaurus.org/v3/homoit0002678

Asexual people
type: Concept
issued: 2019-05-14
modified: 2025-02-23
replaces: asexualPeople
comment: Individuals who generally do not experience sexual attraction or desire; do not use to describe individuals practicing celibacy or abstinence for religious or cultural reasons.
alternative label: Aces
broader: https://homosaurus.org/v3/homoit0001297
change note: Version 3.7.0
has top concept: Sexual minorities
in scheme: v3
narrower: https://homosaurus.org/v3/homoit0002292
narrower: https://homosaurus.org/v3/homoit0002761
narrower: https://homosaurus.org/v3/homoit0002905
narrower: https://homosaurus.org/v3/homoit0003034
related: https://homosaurus.org/v3/homoit0000004
related: https://homosaurus.org/v3/homoit0000244
related: https://homosaurus.org/v3/homoit0001535
related: https://homosaurus.org/v3/homoit0001633
related: https://homosaurus.org/v3/homoit0001758
related: https://homosaurus.org/v3/homoit0001762
related: https://homosaurus.org/v3/homoit0001766
related: https://homosaurus.org/v3/homoit0002146
related: https://homosaurus.org/v3/homoit0002912

Ashtime
type: Concept
issued: 2019-05-14
modified: 2025-02-23
replaces: ashtime
comment: Term used by the Maale people in Ethiopia for people assigned male at birth who exhibit feminine characteristics; there is some question over the legitimacy of term.
broader: https://homosaurus.org/v3/homoit0000322
change note: Version 3.7.0
has top concept: Gender
in scheme: v3

Asian American LGBTQ+ people
type: Concept
issued: 2019-05-14
modified: 2025-02-23
replaces: asianAmericansLGBTQ
comment: LGBTQ+ people of Asian heritage or descent born in the United States or born in Asian countries who live in or have a strong connection to the United States. Only use for individuals who self-identify as Asian American.
alternative label: Asian American people (LGBTQ)
alternative label: Asian Americans (LGBTQ)
alternative label: LGBTQ+ Asian American people
alternative label: LGBTQ+ Asian Americans
broader: https://homosaurus.org/v3/homoit0000074
change note: Version 3.7.0
has top concept: LGBTQ+ people
in scheme: v3
narrower: https://homosaurus.org/v3/homoit0000130
narrower: https://homosaurus.org/v3/homoit0000471
narrower: https://homosaurus.org/v3/homoit0000721
narrower: https://homosaurus.org/v3/homoit0001158
narrower: https://homosaurus.org/v3/homoit0001391
narrower: https://homosaurus.org/v3/homoit0002756
narrower: https://homosaurus.org/v3/homoit0002902

Asian LGBTQ+ people
type: Concept
issued: 2019-05-14
modified: 2025-02-23
replaces: asiansLGBTQ
comment: LGBTQ+ people of Asian heritage or descent, living in Asia or part of the Asian diaspora. Only use for people who self-identify as Asian.
alternative label: Asian people (LGBTQ)
alternative label: Asians (LGBTQ)
alternative label: LGBTQ+ Asian people
alternative label: LGBTQ+ Asians
broader: https://homosaurus.org/v3/homoit0001101
change note: Version 3.7.0
has top concept: LGBTQ+ people
in scheme: v3
narrower: https://homosaurus.org/v3/homoit0000073
narrower: https://homosaurus.org/v3/homoit0000131
narrower: https://homosaurus.org/v3/homoit0000472
narrower: https://homosaurus.org/v3/homoit0000722
narrower: https://homosaurus.org/v3/homoit0001159
narrower: https://homosaurus.org/v3/homoit0001392
narrower: https://homosaurus.org/v3/homoit0002757
narrower: https://homosaurus.org/v3/homoit0002901
narrower: https://homosaurus.org/v3/homoit0003559

Autoerotic asphyxiation
type: Concept
issued: 2019-05-14
modified: 2025-02-23
replaces: autoeroticAsphyxiation
comment: Intentional restriction of one's own oxygen for the purposes of sexual arousal.
alternative label: Asphyxiophilia
alternative label: Autoerotic asphyxia
alternative label: Hypoxyphilia
alternative label: Strangulation sex
broader: https://homosaurus.org/v3/homoit0001267
broader: https://homosaurus.org/v3/homoit0001299
broader: https://homosaurus.org/v3/homoit0003113
change note: Version 3.7.0
has top concept: Sex (Act)
in scheme: v3
related: https://homosaurus.org/v3/homoit0000442

Ass fucking
type: Concept
issued: 2019-05-14
modified: 2025-02-23
replaces: assFucking
comment: The sexual act of penetrating an individual's anus with a penis or dildo.
alternative label: Butt fucking
broader: https://homosaurus.org/v3/homoit0000043
broader: https://homosaurus.org/v3/homoit0000459
change note: Version 3.7.0
has top concept: Sex (Act)
in scheme: v3
narrower: https://homosaurus.org/v3/homoit0000099
related: https://homosaurus.org/v3/homoit0000293
related: https://homosaurus.org/v3/homoit0003107
related: https://homosaurus.org/v3/homoit0003124

Assigned female at birth
type: Concept
issued: 2019-05-14
modified: 2025-02-23
replaces: assignedFemaleAtBirth
comment: The assignment of a female gender marker or a female sex designation shortly after birth.
alternative label: AFAB
alternative label: Assigned F at birth
alternative label: Designated female at birth
alternative label: DFAB
alternative label: Female assigned at birth
alternative label: FAAB
broader: https://homosaurus.org/v3/homoit0000078
broader: https://homosaurus.org/v3/homoit0001268
change note: Version 3.7.0
has top concept: Gender
in scheme: v3
related: https://homosaurus.org/v3/homoit0000272
related: https://homosaurus.org/v3/homoit0001643

Assigned gender
type: Concept
issued: 2019-05-14
modified: 2025-02-23
replaces: assignedGender
comment: The gender, typically "girl" or "boy," ascribed to a child at birth or adolescence based on the child's perceived sex.
broader: https://homosaurus.org/v3/homoit0000560
broader: https://homosaurus.org/v3/homoit0000571
change note: Version 3.7.0
has top concept: Gender
in scheme: v3
narrower: https://homosaurus.org/v3/homoit0000077
narrower: https://homosaurus.org/v3/homoit0000079
narrower: https://homosaurus.org/v3/homoit0000120
related: https://homosaurus.org/v3/homoit0000118
related: https://homosaurus.org/v3/homoit0000266
related: https://homosaurus.org/v3/homoit0000288
related: https://homosaurus.org/v3/homoit0001465
related: https://homosaurus.org/v3/homoit0001648

Assigned male at birth
type: Concept
issued: 2019-05-14
modified: 2025-02-23
replaces: assignedMaleAtBirth
comment: The assignment of a male gender marker or a male sex designation shortly after birth.
alternative label: AMAB
alternative label: Assigned M at birth
alternative label: Designated male at birth
alternative label: DMAB
alternative label: Male assigned at birth
alternative label: MAAB
broader: https://homosaurus.org/v3/homoit0000078
broader: https://homosaurus.org/v3/homoit0001268
change note: Version 3.7.0
has top concept: Gender
in scheme: v3
related: https://homosaurus.org/v3/homoit0000270
related: https://homosaurus.org/v3/homoit0001642

Anal play
type: Concept
issued: 2019-05-14
modified: 2025-02-23
replaces: assplay
comment: Any kind of sexual play that involves anal stimulation.
alternative label: Assplay
broader: https://homosaurus.org/v3/homoit0001267
broader: https://homosaurus.org/v3/homoit0001299
change note: Version 3.7.0
has top concept: Sex (Act)
in scheme: v3
narrower: https://homosaurus.org/v3/homoit0000043
narrower: https://homosaurus.org/v3/homoit0000049
related: https://homosaurus.org/v3/homoit0000041
related: https://homosaurus.org/v3/homoit0000042
related: https://homosaurus.org/v3/homoit0000232
related: https://homosaurus.org/v3/homoit0000233
related: https://homosaurus.org/v3/homoit0000293
related: https://homosaurus.org/v3/homoit0000305
related: https://homosaurus.org/v3/homoit0001335
related: https://homosaurus.org/v3/homoit0003075
related: https://homosaurus.org/v3/homoit0003124

LGBTQ+ atheists
type: Concept
issued: 2019-05-14
modified: 2025-02-23
replaces: atheistsLGBTQ
comment: LGBTQ+ people who do not believe in the existence of God or gods.
alternative label: Atheists (LGBTQ)
broader: https://homosaurus.org/v3/homoit0000915
change note: Version 3.7.0
has top concept: LGBTQ+ people
in scheme: v3
narrower: https://homosaurus.org/v3/homoit0000132
narrower: https://homosaurus.org/v3/homoit0000473
narrower: https://homosaurus.org/v3/homoit0000723
narrower: https://homosaurus.org/v3/homoit0001160
narrower: https://homosaurus.org/v3/homoit0001393
narrower: https://homosaurus.org/v3/homoit0002973
narrower: https://homosaurus.org/v3/homoit0002979
related: https://homosaurus.org/v3/homoit0000928

Aversion therapy
type: Concept
issued: 2019-05-14
modified: 2025-02-23
replaces: aversionTherapy
comment: Behavior modification therapy intended to displace pleasant associations evoked by homosexuality with unpleasant ones (in the form of electric shocks or nausea-inducing drugs) in order to shift the subject's homosexual orientation to a heterosexual one.
broader: https://homosaurus.org/v3/homoit0000106
change note: Version 3.7.0
has top concept: Medical care
in scheme: v3
related: https://homosaurus.org/v3/homoit0000303

Aylonit
type: Concept
issued: 2019-05-14
modified: 2025-02-23
replaces: aylonit
comment: Israeli term referring to a woman with masculine development who is usually infertile.
broader: https://homosaurus.org/v3/homoit0000322
change note: Version 3.7.0
has top concept: Gender
in scheme: v3

Bondage
type: Concept
issued: 2019-05-14
modified: 2025-02-23
replaces: bondage
comment: The act of tying up or restraining the body, usually with rope, cuffs, tape, or other adhesive, for the purposes of erotic enjoyment or aesthetic appreciation.
alternative label: Erotic bondage
alternative label: Sexual bondage
broader: https://homosaurus.org/v3/homoit0000442
change note: Version 3.7.0
has top concept: Eroticism
in scheme: v3
narrower: https://homosaurus.org/v3/homoit0003071
narrower: https://homosaurus.org/v3/homoit0003089
narrower: https://homosaurus.org/v3/homoit0003145
related: https://homosaurus.org/v3/homoit0001238
related: https://homosaurus.org/v3/homoit0003059
related: https://homosaurus.org/v3/homoit0003090
related: https://homosaurus.org/v3/homoit0003117
related: https://homosaurus.org/v3/homoit0003134
related: https://homosaurus.org/v3/homoit0003146

Dark rooms
type: Concept
issued: 2019-05-14
modified: 2025-02-23
replaces: darkRooms
comment: Rooms in nightclubs, sex clubs, or bathhouses where patrons can discretely engage in sexual activity. Dark rooms were common features in gay bars and clubs in the 1960-80s and remain common among swingers today.
alternative label: Backrooms
broader: https://homosaurus.org/v3/homoit0000974
change note: Version 3.7.0
has top concept: Sex locations
in scheme: v3
related: https://homosaurus.org/v3/homoit0000474
related: https://homosaurus.org/v3/homoit0001270
related: https://homosaurus.org/v3/homoit0001272
related: https://homosaurus.org/v3/homoit0001553
related: https://homosaurus.org/v3/homoit0003079

Baby dykes
type: Concept
issued: 2019-05-14
modified: 2025-02-23
replaces: babyDyke
comment: Newly out lesbians; only use for lesbians who self-identify as dykes.
broader: https://homosaurus.org/v3/homoit0000556
change note: Version 3.7.0
has top concept: LGBTQ+ people
in scheme: v3
related: https://homosaurus.org/v3/homoit0000089
related: https://homosaurus.org/v3/homoit0000295
related: https://homosaurus.org/v3/homoit0001065

Baby gays
type: Concept
issued: 2019-05-14
modified: 2025-02-23
replaces: babyGay
comment: Newly out people, particularly newly out gay men.
broader: https://homosaurus.org/v3/homoit0000506
change note: Version 3.7.0
has top concept: LGBTQ+ people
in scheme: v3
related: https://homosaurus.org/v3/homoit0000088
related: https://homosaurus.org/v3/homoit0000295
related: https://homosaurus.org/v3/homoit0001065

Bading
type: Concept
issued: 2019-05-14
modified: 2025-02-23
replaces: bading
comment: Derogatory Filipino term referring to gay men who crossdress.
broader: https://homosaurus.org/v3/homoit0000322
broader: https://homosaurus.org/v3/homoit0001560
change note: Version 3.7.0
has top concept: Gender
in scheme: v3

Bakla
type: Concept
issued: 2019-05-14
modified: 2025-02-23
replaces: bakla
comment: Filipino word for people who are assigned male at birth who adopt feminine mannerisms; often considered a third gender.
broader: https://homosaurus.org/v3/homoit0000322
broader: https://homosaurus.org/v3/homoit0001560
change note: Version 3.7.0
has top concept: Gender
in scheme: v3
related: https://homosaurus.org/v3/homoit0000023
related: https://homosaurus.org/v3/homoit0000101

Ball culture
type: Concept
issued: 2019-05-14
modified: 2025-02-23
replaces: ballCulture
comment: A subculture that emerged in early 20th century New York City in which primarily African-American and Latin American LGBTQ+ people perform and compete for various prizes.
alternative label: Ballroom community
alternative label: Ballroom culture
alternative label: Ballroom scene
alternative label: Drag ball culture
alternative label: House-ballroom culture
broader: https://homosaurus.org/v3/homoit0001345
change note: Version 3.7.0
has top concept: Subcultures
in scheme: v3
narrower: https://homosaurus.org/v3/homoit0000094
related: https://homosaurus.org/v3/homoit0000095
related: https://homosaurus.org/v3/homoit0000368
related: https://homosaurus.org/v3/homoit0000370
related: https://homosaurus.org/v3/homoit0001295
related: https://homosaurus.org/v3/homoit0001494
related: https://homosaurus.org/v3/homoit0001900
related: https://homosaurus.org/v3/homoit0003505

Ballgags
type: Concept
issued: 2019-05-14
modified: 2025-02-23
replaces: ballgags
comment: Silicone, rubber, or other types of balls that are strapped in a person’s mouth to prevent them from speaking, typically during sex.
broader: https://homosaurus.org/v3/homoit0001266
change note: Version 3.7.0
has top concept: Sex accessories
in scheme: v3

Ballroom families
type: Concept
issued: 2019-05-14
modified: 2025-02-23
replaces: ballroomFamilies
comment: In ball culture, ballroom families (or houses) are chosen families headed by and named after established community members (e.g., the House of Xtravaganza); heads of ballroom families are typically called "mothers" or "fathers," while members are termed "children" and "siblings."
alternative label: Ballroom houses
broader: https://homosaurus.org/v3/homoit0000092
broader: https://homosaurus.org/v3/homoit0000834
change note: Version 3.7.0
has top concept: Subcultures
in scheme: v3
related: https://homosaurus.org/v3/homoit0000371

Banjees
type: Concept
issued: 2019-05-14
modified: 2025-02-23
replaces: banjees
comment: Term from the 1980s (or earlier) that describes a certain type of young Latin American or African American man who has sex with men and who dresses in stereotypical masculine urban fashion.
broader: https://homosaurus.org/v3/homoit0000878
broader: https://homosaurus.org/v3/homoit0001295
change note: Version 3.7.0
has top concept: LGBTQ+ historical terms
in scheme: v3
related: https://homosaurus.org/v3/homoit0000015
related: https://homosaurus.org/v3/homoit0000092
related: https://homosaurus.org/v3/homoit0000253
related: https://homosaurus.org/v3/homoit0000978
related: https://homosaurus.org/v3/homoit0001009
related: https://homosaurus.org/v3/homoit0002017

Bantut
type: Concept
issued: 2019-05-14
modified: 2025-02-23
replaces: bantut
comment: Filipino term for gay men who assume the clothes and/or mannerisms of women.
broader: https://homosaurus.org/v3/homoit0000322
broader: https://homosaurus.org/v3/homoit0001560
change note: Version 3.7.0
has top concept: Gender
in scheme: v3

LGBTQ+ Baptists
type: Concept
issued: 2019-05-14
modified: 2025-02-23
replaces: LGBTQBaptists
comment: LGBTQ+ people who are Baptist.
alternative label: Baptists (LGBTQ)
alternative label: LGBTQ Baptists
broader: https://homosaurus.org/v3/homoit0001137
change note: Version 3.7.0
has top concept: LGBTQ+ religious people
in scheme: v3

Berdache
type: Concept
issued: 2019-05-14
modified: 2025-02-23
replaces: berdache
comment: An offensive term developed by settler anthropologists to broadly describe Indigenous people expressing mixed gender roles; only use in historical contexts.
alternative label: Bardache
broader: https://homosaurus.org/v3/homoit0000878
broader: https://homosaurus.org/v3/homoit0001560
change note: Version 3.7.0
has top concept: LGBTQ+ historical terms
in scheme: v3
related: https://homosaurus.org/v3/homoit0001037
related: https://homosaurus.org/v3/homoit0001480
related: https://homosaurus.org/v3/homoit0001914

Barebacking
type: Concept
issued: 2019-05-14
modified: 2025-02-23
replaces: barebacking
comment: The practice of engaging in anal sex without using a condom.
broader: https://homosaurus.org/v3/homoit0000076
broader: https://homosaurus.org/v3/homoit0001239
change note: Version 3.7.0
has top concept: Sex (Act)
in scheme: v3
related: https://homosaurus.org/v3/homoit0003129

LGBTQ+ bars
type: Concept
issued: 2019-05-14
modified: 2025-02-23
replaces: barsLGBTQ
comment: Establishments that serve alcohol and are patronized primarily by LGBTQ+ people.
alternative label: Bars (LGBTQ)
broader: https://homosaurus.org/v3/homoit0000900
change note: Version 3.7.0
has top concept: LGBTQ+ meeting places
in scheme: v3
narrower: https://homosaurus.org/v3/homoit0000133
narrower: https://homosaurus.org/v3/homoit0000369
narrower: https://homosaurus.org/v3/homoit0000474
narrower: https://homosaurus.org/v3/homoit0000724
narrower: https://homosaurus.org/v3/homoit0001161
narrower: https://homosaurus.org/v3/homoit0001394
narrower: https://homosaurus.org/v3/homoit0001553
related: https://homosaurus.org/v3/homoit0000488
related: https://homosaurus.org/v3/homoit0000909
related: https://homosaurus.org/v3/homoit0000925
related: https://homosaurus.org/v3/homoit0002384

Bayot
type: Concept
issued: 2019-05-14
modified: 2025-02-23
replaces: bayot
comment: Derogatory Cebuano term used in the Philippines to describe effeminate gay men or masculine women.
broader: https://homosaurus.org/v3/homoit0000322
broader: https://homosaurus.org/v3/homoit0001560
change note: Version 3.7.0
has top concept: Gender
in scheme: v3
related: https://homosaurus.org/v3/homoit0000091

Kink community
type: Concept
issued: 2019-05-14
modified: 2025-02-23
replaces: BDSMCommunity
comment: A broad term including all communities of people interested in kinks and fetishes, including or overlapping with certain subcultures such as the leather community and rubber and latex communities.
broader: https://homosaurus.org/v3/homoit0000297
change note: Version 3.7.0
has top concept: LGBTQ+ communities
in scheme: v3
related: https://homosaurus.org/v3/homoit0000363
related: https://homosaurus.org/v3/homoit0000442
related: https://homosaurus.org/v3/homoit0000705
related: https://homosaurus.org/v3/homoit0001353
related: https://homosaurus.org/v3/homoit0001376
related: https://homosaurus.org/v3/homoit0003084

LGBTQ+ beaches
type: Concept
issued: 2019-05-14
modified: 2025-02-23
replaces: beachesLGBTQ
comment: Beaches set aside for use by LGBTQ+ people or beaches known to be frequented by LGBTQ+ people.
alternative label: Beaches (LGBTQ)
broader: https://homosaurus.org/v3/homoit0000900
change note: Version 3.7.0
has top concept: LGBTQ+ meeting places
in scheme: v3
narrower: https://homosaurus.org/v3/homoit0000134
narrower: https://homosaurus.org/v3/homoit0000476
narrower: https://homosaurus.org/v3/homoit0000725
narrower: https://homosaurus.org/v3/homoit0001050
narrower: https://homosaurus.org/v3/homoit0001162
narrower: https://homosaurus.org/v3/homoit0001395

Bears (Gay culture)
type: Concept
issued: 2019-05-14
modified: 2025-02-23
replaces: bears
comment: Slang used in the U.S. and other English speaking countries to describe hairy and large or muscular gay men.
alternative label: Bear men
alternative label: Bears
broader: https://homosaurus.org/v3/homoit0000487
broader: https://homosaurus.org/v3/homoit0000506
broader: https://homosaurus.org/v3/homoit0000577
broader: https://homosaurus.org/v3/homoit0001295
change note: Version 3.7.0
has top concept: Subcultures
in scheme: v3
narrower: https://homosaurus.org/v3/homoit0000321
related: https://homosaurus.org/v3/homoit0000267
related: https://homosaurus.org/v3/homoit0000568
related: https://homosaurus.org/v3/homoit0000598
related: https://homosaurus.org/v3/homoit0001063
related: https://homosaurus.org/v3/homoit0001145
related: https://homosaurus.org/v3/homoit0001508
related: https://homosaurus.org/v3/homoit0002148
related: https://homosaurus.org/v3/homoit0002149
related: https://homosaurus.org/v3/homoit0003718

Behavioral therapy
type: Concept
issued: 2019-05-14
modified: 2025-02-23
replaces: behaviouralTherapy
comment: Therapeutic techniques and treatments derived from cognitive psychology that are designed to identify and potentially change behaviors perceived as self-destructive or unhealthy. Includes behavioral therapy intended to alter an individual's sexual or gender identity or expression.
broader: https://homosaurus.org/v3/homoit0001366
change note: Version 3.7.0
has top concept: Medical care
in scheme: v3
narrower: https://homosaurus.org/v3/homoit0000084
narrower: https://homosaurus.org/v3/homoit0000303
preferred label: Behavioural therapy

Bi+ people
type: Concept
issued: 2019-05-14
modified: 2025-02-23
replaces: bi+People
comment: Individuals who are not exclusively sexually and/or romantically attracted to individuals of a single biological sex (includes bisexual, queer, pansexual, and fluid identities).
broader: https://homosaurus.org/v3/homoit0000915
change note: Version 3.7.0
has top concept: LGBTQ+ people
in scheme: v3
narrower: https://homosaurus.org/v3/homoit0000170
narrower: https://homosaurus.org/v3/homoit0001073
narrower: https://homosaurus.org/v3/homoit0001195
narrower: https://homosaurus.org/v3/homoit0001919
related: https://homosaurus.org/v3/homoit0001297

Bigender identity
type: Concept
issued: 2019-05-14
modified: 2025-02-23
replaces: bigenderIdentity
comment: Term used to describe the identities of people who have two genders.
broader: https://homosaurus.org/v3/homoit0000571
change note: Version 3.7.0
has top concept: Gender
in scheme: v3
related: https://homosaurus.org/v3/homoit0000111
related: https://homosaurus.org/v3/homoit0000569

Bigender people
type: Concept
issued: 2019-05-14
modified: 2025-02-23
replaces: bigenderPeople
comment: People who identify as any two genders, either simultaneously or more fluidly.
broader: https://homosaurus.org/v3/homoit0001378
change note: Version 3.7.0
has top concept: LGBTQ+ people
in scheme: v3
related: https://homosaurus.org/v3/homoit0000110
related: https://homosaurus.org/v3/homoit0000570

Binabae
type: Concept
issued: 2019-05-14
modified: 2025-02-23
replaces: binabae
comment: Tagalog term for individuals who possess both male and female traits.
broader: https://homosaurus.org/v3/homoit0000322
change note: Version 3.7.0
has top concept: Gender
in scheme: v3

Binding (Chest)
type: Concept
issued: 2019-05-14
modified: 2025-02-23
replaces: bindingChest
comment: The act of flattening or concealing the chest area with a tight fitting shirt, strap, or similar material; often practiced by transgender men and transmasculine people.
broader: https://homosaurus.org/v3/homoit0000568
change note: Version 3.7.0
has top concept: Gender
in scheme: v3
related: https://homosaurus.org/v3/homoit0000222
related: https://homosaurus.org/v3/homoit0000436
related: https://homosaurus.org/v3/homoit0001643
related: https://homosaurus.org/v3/homoit0001840
related: https://homosaurus.org/v3/homoit0001852
related: https://homosaurus.org/v3/homoit0003118
related: https://homosaurus.org/v3/homoit0003815

Essentialism
type: Concept
issued: 2019-05-14
modified: 2025-02-23
replaces: essentialism
comment: The practice of defining certain categories through a set of supposed universal or fixed characteristics or traits (e.g., defining women in terms of "female" genitalia).
alternative label: Biological essentialism
broader: https://homosaurus.org/v3/homoit0001365
change note: Version 3.7.0
has top concept: Theories
in scheme: v3
narrower: https://homosaurus.org/v3/homoit0003158
related: https://homosaurus.org/v3/homoit0001219
related: https://homosaurus.org/v3/homoit0001295
related: https://homosaurus.org/v3/homoit0001320
related: https://homosaurus.org/v3/homoit0003519

Biological parenthood
type: Concept
issued: 2019-05-14
modified: 2025-02-23
replaces: biologicalParenthood
comment: The experience of being a biological parent to a child. This relationship can be genetic, gestational, or both.
broader: https://homosaurus.org/v3/homoit0000819
broader: https://homosaurus.org/v3/homoit0000914
change note: Version 3.7.0
has top concept: LGBTQ+ families
in scheme: v3
narrower: https://homosaurus.org/v3/homoit0000583
narrower: https://homosaurus.org/v3/homoit0000587
related: https://homosaurus.org/v3/homoit0000121
related: https://homosaurus.org/v3/homoit0000364
related: https://homosaurus.org/v3/homoit0000451
related: https://homosaurus.org/v3/homoit0001001
related: https://homosaurus.org/v3/homoit0001093
related: https://homosaurus.org/v3/homoit0002621
related: https://homosaurus.org/v3/homoit0002623

Biphobia
type: Concept
issued: 2019-05-14
modified: 2025-02-23
replaces: biphobia
comment: Antagonism or disgust directed toward bisexuality as an identity or bisexual people due to their sexuality. Biphobia can include denial of the existence of bisexuality, stereotypes, verbal harassment, and physical violence.
broader: https://homosaurus.org/v3/homoit0000920
change note: Version 3.7.0
has top concept: LGBTQ+ phobia
in scheme: v3
narrower: https://homosaurus.org/v3/homoit0002592
related: https://homosaurus.org/v3/homoit0000051
related: https://homosaurus.org/v3/homoit0000052
related: https://homosaurus.org/v3/homoit0000170
related: https://homosaurus.org/v3/homoit0000619

Birth certificate amendments
type: Concept
issued: 2019-05-14
modified: 2025-02-23
replaces: birthCertificateAmendments
comment: Formal changes to an individual's birth certificate, typically to reflect a change to the individual's legal name or gender or sex marker.
broader: https://homosaurus.org/v3/homoit0000119
change note: Version 3.7.0
has top concept: Legal status
in scheme: v3
related: https://homosaurus.org/v3/homoit0000078
related: https://homosaurus.org/v3/homoit0000120
related: https://homosaurus.org/v3/homoit0000918

Birth certificates
type: Concept
issued: 2019-05-14
modified: 2025-02-23
replaces: birthCertificates
comment: Legal documents issued to record an individual’s birth, typically including identifying information such as the individual's name, assigned gender or sex, date and location of birth, and parentage.
broader: https://homosaurus.org/v3/homoit0001053
change note: Version 3.7.0
has top concept: Legal status
in scheme: v3
narrower: https://homosaurus.org/v3/homoit0000118
narrower: https://homosaurus.org/v3/homoit0000573
related: https://homosaurus.org/v3/homoit0000120
related: https://homosaurus.org/v3/homoit0000247
related: https://homosaurus.org/v3/homoit0000311
related: https://homosaurus.org/v3/homoit0000711
related: https://homosaurus.org/v3/homoit0001005
related: https://homosaurus.org/v3/homoit0001324
related: https://homosaurus.org/v3/homoit0001465

Gender assigned at birth
type: Concept
issued: 2019-05-14
modified: 2025-02-23
replaces: genderAssignedAtBirth
comment: The legal gender marker recorded in birth-related certifications and registries. Often but not always used synonymously with “sex assigned at birth." Also used in reference to the gendered roles and expectations associated with said gender marker.
alternative label: Birth gender
alternative label: Natal gender
alternative label: GAAB
alternative label: Assigned gender at birth
alternative label: AGAB
alternative label: Designated gender at birth
alternative label: DGAB
alternative label: Gender at birth
broader: https://homosaurus.org/v3/homoit0000078
change note: Version 3.7.0
has top concept: Gender
in scheme: v3
related: https://homosaurus.org/v3/homoit0000118
related: https://homosaurus.org/v3/homoit0000119
related: https://homosaurus.org/v3/homoit0000271
related: https://homosaurus.org/v3/homoit0000567
related: https://homosaurus.org/v3/homoit0000573
related: https://homosaurus.org/v3/homoit0001268
related: https://homosaurus.org/v3/homoit0001378
related: https://homosaurus.org/v3/homoit0002256

Birth parents
type: Concept
issued: 2019-05-14
modified: 2025-02-23
replaces: birthParents
comment: Biological or genetic parents of a child or children placed for adoption.
broader: https://homosaurus.org/v3/homoit0000587
broader: https://homosaurus.org/v3/homoit0002372
change note: Version 3.7.0
has top concept: LGBTQ+ families
in scheme: v3
narrower: https://homosaurus.org/v3/homoit0000821
related: https://homosaurus.org/v3/homoit0000010
related: https://homosaurus.org/v3/homoit0000116
related: https://homosaurus.org/v3/homoit0000809
related: https://homosaurus.org/v3/homoit0000812
related: https://homosaurus.org/v3/homoit0000819
related: https://homosaurus.org/v3/homoit0000843

Bisexual activism
type: Concept
issued: 2019-05-14
modified: 2025-02-23
replaces: bisexualActivism
comment: Direct action and organizing to achieve political or social change and acceptance for bisexuality.
broader: https://homosaurus.org/v3/homoit0000006
change note: Version 3.7.0
has top concept: LGBTQ+ activism
in scheme: v3
related: https://homosaurus.org/v3/homoit0000147
related: https://homosaurus.org/v3/homoit0000162
related: https://homosaurus.org/v3/homoit0000175
related: https://homosaurus.org/v3/homoit0000183

African American bisexual people
type: Concept
issued: 2019-05-14
modified: 2025-02-23
replaces: bisexualAfricanAmericans
comment: Bisexual people of African descent born in the United States or bisexual people born in African countries who live in or have a strong connection to the United States. Use for individuals who self-identity as African American. Follow the individual’s preference for African American or Black whenever possible.
alternative label: Bisexual African American people
alternative label: Bisexual African Americans
broader: https://homosaurus.org/v3/homoit0000015
broader: https://homosaurus.org/v3/homoit0000135
change note: Version 3.7.0
has top concept: LGBTQ+ people
in scheme: v3
related: https://homosaurus.org/v3/homoit0000365

Afro-Canadian bisexual people
type: Concept
issued: 2019-05-14
modified: 2025-02-23
replaces: bisexualAfroCanadians
comment: Bisexual people of African descent born in Canada or bisexual people born in African countries who live in or have a strong connection to Canada. Use for individuals who self-identify as Afro-Canadian.
alternative label: Bisexual Afro-Canadian people
alternative label: Bisexual Afro-Canadians
broader: https://homosaurus.org/v3/homoit0000016
broader: https://homosaurus.org/v3/homoit0000135
change note: Version 3.7.0
has top concept: LGBTQ+ people
in scheme: v3

Afro-Caribbean bisexual people
type: Concept
issued: 2019-05-14
modified: 2025-02-23
replaces: bisexualAfroCaribbeans
comment: Bisexual people of African descent born in the Caribbean or bisexual people born in African countries who live in or have a strong connection to the Caribbean. Only use for individuals who self-identify as Afro-Caribbean.
alternative label: Bisexual Afro-Caribbean people
alternative label: Bisexual Afro-Caribbeans
broader: https://homosaurus.org/v3/homoit0000017
broader: https://homosaurus.org/v3/homoit0000135
change note: Version 3.7.0
has top concept: LGBTQ+ people
in scheme: v3

Afro-European bisexual people
type: Concept
issued: 2019-05-14
modified: 2025-02-23
replaces: bisexualAfroEuropeans
comment: Bisexual people of African descent born in European countries or bisexual people born in African countries who live in or have a strong connection to Europe. Only use for individuals who self-identify as Afro-European.
alternative label: Bisexual Afro-European people
alternative label: Bisexual Afro-Europeans
broader: https://homosaurus.org/v3/homoit0000018
broader: https://homosaurus.org/v3/homoit0000135
change note: Version 3.7.0
has top concept: LGBTQ+ people
in scheme: v3

Afro-Latin American bisexual people
type: Concept
issued: 2019-05-14
modified: 2025-02-23
replaces: bisexualAfroLatinAmericans
comment: Bisexual people of African descent born in Latin American countries or bisexual people born in African countries who live in or have a strong connection to Latin America. Only use for individuals who self-identify as Afro-Latin American.
alternative label: Bisexual Afro-Latin Americans
broader: https://homosaurus.org/v3/homoit0000019
broader: https://homosaurus.org/v3/homoit0000135
change note: Version 3.7.0
has top concept: LGBTQ+ people
in scheme: v3

Bisexual archives
type: Concept
issued: 2019-05-14
modified: 2025-02-23
replaces: bisexualArchives
comment: Collections of records and materials relating to bisexual people or bisexual communities; can include a variety of organizations and institutions from community to government archives.
broader: https://homosaurus.org/v3/homoit0000066
change note: Version 3.7.0
has top concept: LGBTQ+ cultural heritage institutions
in scheme: v3

Bisexual artists
type: Concept
issued: 2019-05-14
modified: 2025-02-23
replaces: bisexualArtists
comment: Bisexual people who practice any of various creative arts.
broader: https://homosaurus.org/v3/homoit0000070
change note: Version 3.7.0
has top concept: LGBTQ+ people
in scheme: v3

Asian American bisexual people
type: Concept
issued: 2019-05-14
modified: 2025-02-23
replaces: bisexualAsianAmericans
comment: Bisexual people of Asian heritage or descent born in the United States or born in Asian countries who live in or have a strong connection to the United States. Only use for individuals who self-identify as Asian American.
alternative label: Bisexual Asian American people
alternative label: Bisexual Asian Americans
broader: https://homosaurus.org/v3/homoit0000073
broader: https://homosaurus.org/v3/homoit0000131
change note: Version 3.7.0
has top concept: LGBTQ+ people
in scheme: v3

Asian bisexual people
type: Concept
issued: 2019-05-14
modified: 2025-02-23
replaces: bisexualAsians
comment: Bisexual people of Asian heritage or descent, living in Asia or part of the Asian diaspora. Only use for people who self-identify as Asian.
alternative label: Bisexual Asian people
alternative label: Bisexual Asians
broader: https://homosaurus.org/v3/homoit0000074
change note: Version 3.7.0
has top concept: LGBTQ+ people
in scheme: v3
narrower: https://homosaurus.org/v3/homoit0000130

Bisexual atheists
type: Concept
issued: 2019-05-14
modified: 2025-02-23
replaces: bisexualAtheists
comment: Bisexual people who are atheists.
broader: https://homosaurus.org/v3/homoit0000082
change note: Version 3.7.0
has top concept: LGBTQ+ people
in scheme: v3

Bisexual bars
type: Concept
issued: 2019-05-14
modified: 2025-02-23
replaces: bisexualBars
comment: Drinking establishments that primary cater to bisexual people.
broader: https://homosaurus.org/v3/homoit0000100
change note: Version 3.7.0
has top concept: LGBTQ+ meeting places
in scheme: v3
related: https://homosaurus.org/v3/homoit0000170

Bisexual beaches
type: Concept
issued: 2019-05-14
modified: 2025-02-23
replaces: bisexualBeaches
comment: Beaches set aside for use by bisexual people or beaches known to be frequented by bisexual people.
broader: https://homosaurus.org/v3/homoit0000104
change note: Version 3.7.0
has top concept: LGBTQ+ meeting places
in scheme: v3
related: https://homosaurus.org/v3/homoit0000170

Black bisexual people
type: Concept
issued: 2019-05-14
modified: 2025-02-23
replaces: bisexualBlackPeople
comment: Black people who are bisexual. Use only for individuals who self-identity as Black. Follow the individual’s preference for African American or Black whenever possible.
alternative label: Bisexual Black people
broader: https://homosaurus.org/v3/homoit0000208
change note: Version 3.7.0
has top concept: LGBTQ+ people
in scheme: v3
narrower: https://homosaurus.org/v3/homoit0000123
narrower: https://homosaurus.org/v3/homoit0000124
narrower: https://homosaurus.org/v3/homoit0000125
narrower: https://homosaurus.org/v3/homoit0000126
narrower: https://homosaurus.org/v3/homoit0000127

Bisexual bookshops
type: Concept
issued: 2019-05-14
modified: 2025-02-23
replaces: bisexualBookshops
comment: Bookshops that sell materials intended for use by bisexual people or addressing topics related to bisexuality.
broader: https://homosaurus.org/v3/homoit0000216
change note: Version 3.7.0
has top concept: LGBTQ+ bookshops
in scheme: v3
related: https://homosaurus.org/v3/homoit0000170

Bisexual boys
type: Concept
issued: 2019-05-14
modified: 2025-02-23
replaces: bisexualBoys
comment: Boys (typically children younger than 18) who are bisexual.
broader: https://homosaurus.org/v3/homoit0000140
broader: https://homosaurus.org/v3/homoit0000192
broader: https://homosaurus.org/v3/homoit0000220
change note: Version 3.7.0
has top concept: LGBTQ+ people
in scheme: v3

Bisexual Buddhists
type: Concept
issued: 2019-05-14
modified: 2025-02-23
replaces: bisexualBuddhists
comment: Bisexual people who are Buddhist.
broader: https://homosaurus.org/v3/homoit0000225
change note: Version 3.7.0
has top concept: LGBTQ+ religious people
in scheme: v3

Bisexual characters
type: Concept
issued: 2019-05-14
modified: 2025-02-23
replaces: bisexualCharacters
comment: Characters in creative works who are bisexual.
broader: https://homosaurus.org/v3/homoit0000249
change note: Version 3.7.0
has top concept: LGBTQ+ characters
in scheme: v3
related: https://homosaurus.org/v3/homoit0000140
related: https://homosaurus.org/v3/homoit0000149
related: https://homosaurus.org/v3/homoit0000151
related: https://homosaurus.org/v3/homoit0000170
related: https://homosaurus.org/v3/homoit0000193
related: https://homosaurus.org/v3/homoit0001754
related: https://homosaurus.org/v3/homoit0002535

Bisexual children
type: Concept
issued: 2019-05-14
modified: 2025-02-23
replaces: bisexualChildren
comment: Bisexual people who have not yet reached the age of adolescence.
broader: https://homosaurus.org/v3/homoit0000170
broader: https://homosaurus.org/v3/homoit0000256
change note: Version 3.7.0
has top concept: LGBTQ+ people
in scheme: v3
narrower: https://homosaurus.org/v3/homoit0000137
narrower: https://homosaurus.org/v3/homoit0000152
related: https://homosaurus.org/v3/homoit0000139
related: https://homosaurus.org/v3/homoit0000153

Bisexual Christians
type: Concept
issued: 2019-05-14
modified: 2025-02-23
replaces: bisexualChristians
comment: Bisexual people who are Christian.
broader: https://homosaurus.org/v3/homoit0000265
change note: Version 3.7.0
has top concept: LGBTQ+ religious people
in scheme: v3

Bisexual clergy
type: Concept
issued: 2019-05-14
modified: 2025-02-23
replaces: bisexualClergy
comment: Bisexual people who are ordained for religious duties, particularly in the Christian Church.
broader: https://homosaurus.org/v3/homoit0001624
change note: Version 3.7.0
has top concept: LGBTQ+ clergy
in scheme: v3
related: https://homosaurus.org/v3/homoit0000244
related: https://homosaurus.org/v3/homoit0000484
related: https://homosaurus.org/v3/homoit0000732
related: https://homosaurus.org/v3/homoit0001169
related: https://homosaurus.org/v3/homoit0001402

Bisexual community
type: Concept
issued: 2019-05-14
modified: 2025-02-23
replaces: bisexualCommunity
comment: Groups of people who share the experience of being bisexual.
broader: https://homosaurus.org/v3/homoit0000297
change note: Version 3.7.0
has top concept: LGBTQ+ communities
in scheme: v3
related: https://homosaurus.org/v3/homoit0000170
related: https://homosaurus.org/v3/homoit0000594
related: https://homosaurus.org/v3/homoit0000804
related: https://homosaurus.org/v3/homoit0000805
related: https://homosaurus.org/v3/homoit0000806
related: https://homosaurus.org/v3/homoit0000807
related: https://homosaurus.org/v3/homoit0000882
related: https://homosaurus.org/v3/homoit0001789

Bisexual community centers
type: Concept
issued: 2019-05-14
modified: 2025-02-23
replaces: bisexualCommunityCentres
comment: Spaces in which people from bisexual communities meet for social, education, recreational, or organizing activities.
broader: https://homosaurus.org/v3/homoit0000298
change note: Version 3.7.0
has top concept: LGBTQ+ centers
in scheme: v3
preferred label: Bisexual community centres
related: https://homosaurus.org/v3/homoit0000170

Bisexual couples
type: Concept
issued: 2019-05-14
modified: 2025-02-23
replaces: bisexualCouples
comment: Partnerships in which both people are bisexual.
broader: https://homosaurus.org/v3/homoit0000310
change note: Version 3.7.0
has top concept: LGBTQ+ relationships
in scheme: v3
related: https://homosaurus.org/v3/homoit0000182

Bisexual daughters
type: Concept
issued: 2019-05-14
modified: 2025-02-23
replaces: bisexualDaughters
comment: Daughters who identify as bisexual.
broader: https://homosaurus.org/v3/homoit0000330
change note: Version 3.7.0
has top concept: LGBTQ+ people
in scheme: v3

Bisexual information centers
type: Concept
issued: 2019-05-14
modified: 2025-02-23
replaces: bisexualInformationCentres
comment: Institutions providing education, support, and information about bisexuality and bisexual communities to bisexual people.
broader: https://homosaurus.org/v3/homoit0000660
change note: Version 3.7.0
has top concept: LGBTQ+ centers
in scheme: v3
preferred label: Bisexual information centres
related: https://homosaurus.org/v3/homoit0000122
related: https://homosaurus.org/v3/homoit0000162

Bisexual dominatrices
type: Concept
issued: 2019-05-14
modified: 2025-02-23
replaces: bisexualDominatrices
comment: Women who take a dominant role in BDSM activities; use for dominatrices who identify as bisexual.
broader: https://homosaurus.org/v3/homoit0000363
change note: Version 3.7.0
has top concept: Relationship minorities
in scheme: v3
related: https://homosaurus.org/v3/homoit0000738
related: https://homosaurus.org/v3/homoit0001175
related: https://homosaurus.org/v3/homoit0001410

Bisexual drama
type: Concept
issued: 2019-05-14
modified: 2025-02-23
replaces: bisexualDrama
comment: Works of fiction written to be performed; use in reference to dramatic works focusing on bisexual characters or themes.
broader: https://homosaurus.org/v3/homoit0000376
change note: Version 3.7.0
has top concept: Subcultures
in scheme: v3
related: https://homosaurus.org/v3/homoit0000139
related: https://homosaurus.org/v3/homoit0000157
related: https://homosaurus.org/v3/homoit0000194
related: https://homosaurus.org/v3/homoit0001726

Bisexual families
type: Concept
issued: 2019-05-14
modified: 2025-02-23
replaces: bisexualFamilies
comment: Families, whether biological, adoptive, or chosen, in which one or more individuals identify as bisexual.
broader: https://homosaurus.org/v3/homoit0000420
change note: Version 3.7.0
has top concept: LGBTQ+ families
in scheme: v3
related: https://homosaurus.org/v3/homoit0000169
related: https://homosaurus.org/v3/homoit0000170
related: https://homosaurus.org/v3/homoit0000257

Bisexual fiction
type: Concept
issued: 2019-05-14
modified: 2025-02-23
replaces: bisexualFiction
comment: Written works describing imagined events or people; use in reference to fictional works focusing on bisexual characters or themes.
broader: https://homosaurus.org/v3/homoit0000443
change note: Version 3.7.0
has top concept: Subcultures
in scheme: v3
related: https://homosaurus.org/v3/homoit0000139
related: https://homosaurus.org/v3/homoit0000157
related: https://homosaurus.org/v3/homoit0001726
related: https://homosaurus.org/v3/homoit0001752
related: https://homosaurus.org/v3/homoit0001753
related: https://homosaurus.org/v3/homoit0001754
related: https://homosaurus.org/v3/homoit0002150
related: https://homosaurus.org/v3/homoit0002535

Bisexual girls
type: Concept
issued: 2019-05-14
modified: 2025-02-23
replaces: bisexualGirls
comment: Girls (typically children younger than 18) who are bisexual.
broader: https://homosaurus.org/v3/homoit0000140
broader: https://homosaurus.org/v3/homoit0000192
broader: https://homosaurus.org/v3/homoit0000590
change note: Version 3.7.0
has top concept: LGBTQ+ people
in scheme: v3

Bisexual identity
type: Concept
issued: 2019-05-14
modified: 2025-02-23
replaces: bisexualIdentity
comment: Term used to describe the sexual identity of individuals who are romantically and/or sexually attracted to people of more than one gender and who prefer the term bisexual over alternatives such as pansexual, polysexual, etc.
broader: https://homosaurus.org/v3/homoit0001295
change note: Version 3.7.0
has top concept: Sexual identity
in scheme: v3
related: https://homosaurus.org/v3/homoit0000140
related: https://homosaurus.org/v3/homoit0000170

Jewish bisexual people
type: Concept
issued: 2019-05-14
modified: 2025-02-23
replaces: bisexualJews
comment: Bisexual people who are Jewish.
alternative label: Bisexual Jews
alternative label: Jewish bisexuals
broader: https://homosaurus.org/v3/homoit0000682
change note: Version 3.7.0
has top concept: LGBTQ+ people
in scheme: v3

Latino/a/x bisexual people
type: Concept
issued: 2019-05-14
modified: 2025-02-23
replaces: bisexualLatinx
comment: Latin American people who are bisexual; only use to describe individuals who self-identify as Latino, Latina, or Latinx. Do not conflate with Chicano/a/x or Hispanic.
alternative label: Bisexual Latinas
alternative label: Bisexual Latine people
alternative label: Bisexual Latinos
alternative label: Bisexual Latinx people
alternative label: Latina bisexual people
alternative label: Latine bisexual people
alternative label: Latino bisexual people
alternative label: Latinx bisexual people
broader: https://homosaurus.org/v3/homoit0000253
change note: Version 3.7.0
has top concept: LGBTQ+ people
in scheme: v3

Bisexual libraries
type: Concept
issued: 2019-05-14
modified: 2025-02-23
replaces: bisexualLibraries
comment: Libraries that hold materials primarily pertaining to bisexual people or intended for use by bisexual people.
broader: https://homosaurus.org/v3/homoit0000968
change note: Version 3.7.0
has top concept: LGBTQ+ cultural heritage institutions
in scheme: v3

Bisexual literature
type: Concept
issued: 2019-05-14
modified: 2025-02-23
replaces: bisexualLiterature
comment: Written literary works about bisexuality, bisexual characters, or bisexual themes.
broader: https://homosaurus.org/v3/homoit0000972
change note: Version 3.7.0
has top concept: Subcultures
in scheme: v3
related: https://homosaurus.org/v3/homoit0000149
related: https://homosaurus.org/v3/homoit0000151
related: https://homosaurus.org/v3/homoit0000174
related: https://homosaurus.org/v3/homoit0001726
related: https://homosaurus.org/v3/homoit0001754
related: https://homosaurus.org/v3/homoit0002506
related: https://homosaurus.org/v3/homoit0002535

Mixed-orientation marriage
type: Concept
issued: 2019-05-14
modified: 2025-02-23
replaces: mixed-orientationMarriage
comment: Marriages between individuals who do not share the same sexual orientation (e.g., bisexual-heterosexual marriage, allosexual-asexual marriage).
alternative label: Bisexual marriage
broader: https://homosaurus.org/v3/homoit0000990
change note: Version 3.7.0
has top concept: Living arrangements
in scheme: v3

Bisexual dominants
type: Concept
issued: 2019-05-14
modified: 2025-02-23
replaces: bisexualMasters
comment: Bisexual people who are part of the BDSM scene and assume the dominant role in sexual relationships with a dominant/submissive dynamic.
alternative label: Bisexual masters
broader: https://homosaurus.org/v3/homoit0000999
change note: Version 3.7.0
has top concept: Sexual identity
in scheme: v3

Bisexual men
type: Concept
issued: 2019-05-14
modified: 2025-02-23
replaces: bisexualMen
comment: Men who identify as bisexual.
alternative label: Male bisexuals
broader: https://homosaurus.org/v3/homoit0000170
broader: https://homosaurus.org/v3/homoit0001008
change note: Version 3.7.0
has top concept: LGBTQ+ people
in scheme: v3
related: https://homosaurus.org/v3/homoit0001009
related: https://homosaurus.org/v3/homoit0001185

Bisexual mistresses
type: Concept
issued: 2019-05-14
modified: 2025-02-23
replaces: bisexualMistresses
comment: Bisexual women who are part of the BDSM scene and assume the mistress role in sexual relationships with a mistress/submissive dynamic.
broader: https://homosaurus.org/v3/homoit0001018
change note: Version 3.7.0
has top concept: Sexual identity
in scheme: v3
related: https://homosaurus.org/v3/homoit0000751
related: https://homosaurus.org/v3/homoit0001186
related: https://homosaurus.org/v3/homoit0001421

Bisexual movement
type: Concept
issued: 2019-05-14
modified: 2025-02-23
replaces: bisexualMovement
comment: Umbrella term for activism focused on the rights of bisexual people and issues faced by bisexual communities.
broader: https://homosaurus.org/v3/homoit0001026
change note: Version 3.7.0
has top concept: Social movements
in scheme: v3
related: https://homosaurus.org/v3/homoit0000122
related: https://homosaurus.org/v3/homoit0000147
related: https://homosaurus.org/v3/homoit0000177

Bisexual museums
type: Concept
issued: 2019-05-14
modified: 2025-02-23
replaces: bisexualMuseums
comment: Institutions dedicated to the storage, exhibition, conservation, and preservation of materials relating to bisexuality, bisexual people, or bisexual history.
broader: https://homosaurus.org/v3/homoit0001030
change note: Version 3.7.0
has top concept: LGBTQ+ cultural heritage institutions
in scheme: v3

Bisexual Muslims
type: Concept
issued: 2019-05-14
modified: 2025-02-23
replaces: bisexualMuslims
comment: Bisexual people who are Muslim.
broader: https://homosaurus.org/v3/homoit0001032
change note: Version 3.7.0
has top concept: LGBTQ+ religious people
in scheme: v3

Native American bisexual people
type: Concept
issued: 2019-05-14
modified: 2025-02-23
replaces: bisexualNativeAmericans
comment: People who are part of the Native peoples of the continental United States and Canada (excluding Inuit people) and self-identity as bisexual. Use more specific terms when available.
alternative label: American Indian bisexual people
alternative label: Bisexual American Indians
alternative label: Bisexual Native Americans
broader: https://homosaurus.org/v3/homoit0001037
change note: Version 3.7.0
has top concept: LGBTQ+ people
in scheme: v3

Bisexual newsletters
type: Concept
issued: 2019-05-14
modified: 2025-02-23
replaces: bisexualNewsletters
comment: Serialized print or digital periodicals created by or for bisexual people, often with the purpose of sharing news and information related to bisexual communities and bisexual issues.
broader: https://homosaurus.org/v3/homoit0000177
broader: https://homosaurus.org/v3/homoit0001041
change note: Version 3.7.0
has top concept: LGBTQ+ press
in scheme: v3
related: https://homosaurus.org/v3/homoit0000167

Bisexual newspapers
type: Concept
issued: 2019-05-14
modified: 2025-02-23
replaces: bisexualNewspapers
comment: Serialized print or digital publications about bisexuality or bisexual issues (and typically produced by bisexual people or organizations) that contain news, articles, columns, correspondence, and advertisements.
broader: https://homosaurus.org/v3/homoit0000177
broader: https://homosaurus.org/v3/homoit0001042
change note: Version 3.7.0
has top concept: LGBTQ+ press
in scheme: v3
related: https://homosaurus.org/v3/homoit0000166

Bisexual Pagans
type: Concept
issued: 2019-05-14
modified: 2025-02-23
replaces: bisexualPagans
comment: Bisexual people who are members of polytheistic religions or other religions outside of the dominant culture that typically incorporate nature worship and/or the sacred feminine, such as Wicca, Druidry, Heathenry, etc. Use to describe bisexual people who self-identify as Pagan.
broader: https://homosaurus.org/v3/homoit0001069
change note: Version 3.7.0
has top concept: LGBTQ+ religious people
in scheme: v3
related: https://homosaurus.org/v3/homoit0001910

Bisexual parents
type: Concept
issued: 2019-05-14
modified: 2025-02-23
replaces: bisexualParents
comment: Parents who are bisexual.
broader: https://homosaurus.org/v3/homoit0000170
broader: https://homosaurus.org/v3/homoit0001075
change note: Version 3.7.0
has top concept: LGBTQ+ people
in scheme: v3
related: https://homosaurus.org/v3/homoit0000150
related: https://homosaurus.org/v3/homoit0000257

Bisexual people
type: Concept
issued: 2019-05-14
modified: 2025-02-23
replaces: bisexualPeople
comment: Individuals who are romantically and/or sexually attracted to more than one gender and who identify as bisexual; do not use to describe pansexual or polysexual people unless they also use the term bisexual.
alternative label: Bisexuals
broader: https://homosaurus.org/v3/homoit0000108
broader: https://homosaurus.org/v3/homoit0000915
broader: https://homosaurus.org/v3/homoit0001297
change note: Version 3.7.0
has top concept: LGBTQ+ people
in scheme: v3
narrower: https://homosaurus.org/v3/homoit0000140
narrower: https://homosaurus.org/v3/homoit0000160
narrower: https://homosaurus.org/v3/homoit0000169
narrower: https://homosaurus.org/v3/homoit0000192
narrower: https://homosaurus.org/v3/homoit0000202
narrower: https://homosaurus.org/v3/homoit0000285
narrower: https://homosaurus.org/v3/homoit0001054
narrower: https://homosaurus.org/v3/homoit0003035
related: https://homosaurus.org/v3/homoit0000117
related: https://homosaurus.org/v3/homoit0000133
related: https://homosaurus.org/v3/homoit0000134
related: https://homosaurus.org/v3/homoit0000136
related: https://homosaurus.org/v3/homoit0000139
related: https://homosaurus.org/v3/homoit0000143
related: https://homosaurus.org/v3/homoit0000144
related: https://homosaurus.org/v3/homoit0000150
related: https://homosaurus.org/v3/homoit0000153
related: https://homosaurus.org/v3/homoit0000173
related: https://homosaurus.org/v3/homoit0000204
related: https://homosaurus.org/v3/homoit0001073
related: https://homosaurus.org/v3/homoit0001103
related: https://homosaurus.org/v3/homoit0001531
related: https://homosaurus.org/v3/homoit0002150

Bisexual people in the military
type: Concept
issued: 2019-05-14
modified: 2025-02-23
replaces: bisexualPeopleInTheMilitary
comment: Bisexual individuals serving in state and national armed forces.
broader: https://homosaurus.org/v3/homoit0001100
change note: Version 3.7.0
has top concept: Legal status
in scheme: v3

Bisexual people of color
type: Concept
issued: 2019-05-14
modified: 2025-02-23
replaces: bisexualPeopleOfColour
comment: Primarily used in the United States, this term refers to bisexual people who are not white and who identify as people of color.
broader: https://homosaurus.org/v3/homoit0001101
change note: Version 3.7.0
has top concept: LGBTQ+ people
in scheme: v3
preferred label: Bisexual people of colour

Parents of bisexual people
type: Concept
issued: 2019-05-14
modified: 2025-02-23
replaces: parentsOfBisexualPeople
comment: People who act as parents to one or more bisexual person. For parents who are themselves bisexual, use the term "Bisexual parents."
alternative label: Bisexual people’s parents
broader: https://homosaurus.org/v3/homoit0002224
change note: Version 3.7.0
has top concept: Family members
in scheme: v3
related: https://homosaurus.org/v3/homoit0000170

Bisexual poetry
type: Concept
issued: 2019-05-14
modified: 2025-02-23
replaces: bisexualPoetry
comment: Literary work, typically written in verse, that focuses on bisexual characters, themes, or identity.
broader: https://homosaurus.org/v3/homoit0001118
change note: Version 3.7.0
has top concept: Subcultures
in scheme: v3
related: https://homosaurus.org/v3/homoit0000157
related: https://homosaurus.org/v3/homoit0001726

Bisexual political activists
type: Concept
issued: 2019-05-14
modified: 2025-02-23
replaces: bisexualPoliticalActivists
comment: Bisexual individuals working to bring about political or social change through public organizing.
broader: https://homosaurus.org/v3/homoit0000007
change note: Version 3.7.0
has top concept: LGBTQ+ people
in scheme: v3
related: https://homosaurus.org/v3/homoit0000122

Bisexual porn films
type: Concept
issued: 2019-05-14
modified: 2025-02-23
replaces: bisexualPornFilms
comment: Erotic or sexually explicit films featuring bisexual people.
broader: https://homosaurus.org/v3/homoit0000013
broader: https://homosaurus.org/v3/homoit0002609
change note: Version 3.7.0
has top concept: Subcultures
in scheme: v3
related: https://homosaurus.org/v3/homoit0002548

Bisexual press
type: Concept
issued: 2019-05-14
modified: 2025-02-23
replaces: bisexualPress
comment: Newspapers, magazines, or other publishing outlets aimed at bisexual audiences and/or operated by bisexual people.
broader: https://homosaurus.org/v3/homoit0001132
change note: Version 3.7.0
has top concept: LGBTQ+ press
in scheme: v3
narrower: https://homosaurus.org/v3/homoit0000166
narrower: https://homosaurus.org/v3/homoit0000167
related: https://homosaurus.org/v3/homoit0000162
related: https://homosaurus.org/v3/homoit0000896

Bisexual sex workers
type: Concept
issued: 2019-05-14
modified: 2025-02-23
replaces: bisexualProstitutes
comment: Bisexual people who receive money or goods in exchange for sexual services, performances, or companionship. Use to describe bisexual people working across the broad spectrum of sex work.
alternative label: Bisexual prostitutes
alternative label: Bi sex workers
alternative label: Bi prostitutes
alternative label: Bisexual prostitution
alternative label: Bisexual sex work
broader: https://homosaurus.org/v3/homoit0001277
change note: Version 3.7.0
has top concept: Sex workers
in scheme: v3

Bisexual Protestants
type: Concept
issued: 2019-05-14
modified: 2025-02-23
replaces: bisexualProtestants
comment: Bisexual people who are members of the Protestant church.
broader: https://homosaurus.org/v3/homoit0001137
change note: Version 3.7.0
has top concept: LGBTQ+ religious people
in scheme: v3

Bisexual publishers
type: Concept
issued: 2019-05-14
modified: 2025-02-23
replaces: bisexualPublishers
comment: Companies and organizations that publish materials for bisexual communities or addressing bisexual issues.
broader: https://homosaurus.org/v3/homoit0001144
change note: Version 3.7.0
has top concept: LGBTQ+ publishers
in scheme: v3

Bisexual radio
type: Concept
issued: 2019-05-14
modified: 2025-02-23
replaces: bisexualRadio
comment: Auditory content broadcast on the radio (analog or digital) about bisexuality and bisexual issues.
broader: https://homosaurus.org/v3/homoit0001231
change note: Version 3.7.0
has top concept: LGBTQ+ radio
in scheme: v3

Bisexual relationships
type: Concept
issued: 2019-05-14
modified: 2025-02-23
replaces: bisexualRelationships
comment: Ongoing connections (romantic, sexual, or platonic) between two or more bisexual people.
broader: https://homosaurus.org/v3/homoit0001237
change note: Version 3.7.0
has top concept: LGBTQ+ relationships
in scheme: v3
related: https://homosaurus.org/v3/homoit0000145
related: https://homosaurus.org/v3/homoit0000529
related: https://homosaurus.org/v3/homoit0000773
related: https://homosaurus.org/v3/homoit0001205
related: https://homosaurus.org/v3/homoit0001442

Bisexual rights
type: Concept
issued: 2019-05-14
modified: 2025-02-23
replaces: bisexualRights
comment: Legal, social, or ethical principles of freedom or entitlement held by bisexual people.
broader: https://homosaurus.org/v3/homoit0000276
change note: Version 3.7.0
has top concept: Human rights
in scheme: v3
related: https://homosaurus.org/v3/homoit0000122

Bisexual Roman Catholics
type: Concept
issued: 2019-05-14
modified: 2025-02-23
replaces: bisexualRomanCatholics
comment: Bisexual people who are members of the Roman Catholic Church.
broader: https://homosaurus.org/v3/homoit0001244
change note: Version 3.7.0
has top concept: LGBTQ+ religious people
in scheme: v3

Bisexual slang
type: Concept
issued: 2019-05-14
modified: 2025-02-23
replaces: bisexualSlang
comment: Colloquial or informal language related to bisexuality or used by bisexual people.
broader: https://homosaurus.org/v3/homoit0001317
change note: Version 3.7.0
has top concept: LGBTQ+ slang
in scheme: v3

Bisexual sons
type: Concept
issued: 2019-05-14
modified: 2025-02-23
replaces: bisexualSons
comment: Sons who identify as bisexual.
broader: https://homosaurus.org/v3/homoit0001329
change note: Version 3.7.0
has top concept: LGBTQ+ people
in scheme: v3

Bisexual studies
type: Concept
issued: 2019-05-14
modified: 2025-02-23
replaces: bisexualStudies
comment: Academic field of research and study about bisexuality, bisexual individuals, and bisexual communities.
broader: https://homosaurus.org/v3/homoit0000579
change note: Version 3.7.0
has top concept: Gender studies
in scheme: v3
related: https://homosaurus.org/v3/homoit0000539
related: https://homosaurus.org/v3/homoit0000781
related: https://homosaurus.org/v3/homoit0001210
related: https://homosaurus.org/v3/homoit0001447

Bisexual survivors of hate crimes
type: Concept
issued: 2019-05-14
modified: 2025-02-23
replaces: bisexualSurvivorsOfHateCrimes
comment: Bisexual people who have experienced and survived hate crimes; follow the individual's preference for "victims" or "survivors" whenever possible.
broader: https://homosaurus.org/v3/homoit0000196
broader: https://homosaurus.org/v3/homoit0001349
change note: Version 3.7.0
has top concept: LGBTQ+ people
in scheme: v3

Bisexual survivors of rape
type: Concept
issued: 2019-05-14
modified: 2025-02-23
replaces: bisexualSurvivorsOfRape
comment: Bisexual people who have experienced and survived rape; follow the individual's preference for "victims" or "survivors" whenever possible.
broader: https://homosaurus.org/v3/homoit0000197
broader: https://homosaurus.org/v3/homoit0001350
change note: Version 3.7.0
has top concept: LGBTQ+ people
in scheme: v3

Bisexual survivors of sexual abuse
type: Concept
issued: 2019-05-14
modified: 2025-02-23
replaces: bisexualSurvivorsOfSexualAbuse
comment: Bisexual people who have experienced and survived sexual abuse; follow the individual's preference for "victims" or "survivors" whenever possible.
broader: https://homosaurus.org/v3/homoit0000198
broader: https://homosaurus.org/v3/homoit0001351
change note: Version 3.7.0
has top concept: LGBTQ+ people
in scheme: v3

Bisexual survivors of war
type: Concept
issued: 2019-05-14
modified: 2025-02-23
replaces: bisexualSurvivorsOfWar
comment: Bisexual people who have experienced and survived war; follow the individual's preference for "victims" or "survivors" whenever possible.
broader: https://homosaurus.org/v3/homoit0000199
broader: https://homosaurus.org/v3/homoit0001352
change note: Version 3.7.0
has top concept: LGBTQ+ people
in scheme: v3

Bisexual youth
type: Concept
issued: 2019-05-14
modified: 2025-02-23
replaces: bisexualYouth
comment: Bisexual people between the ages of childhood and adulthood.
alternative label: Bisexual teenagers
alternative label: Bisexual adolescents
alternative label: Bisexual teens
broader: https://homosaurus.org/v3/homoit0000170
broader: https://homosaurus.org/v3/homoit0001521
change note: Version 3.7.0
has top concept: LGBTQ+ people
in scheme: v3
narrower: https://homosaurus.org/v3/homoit0000137
narrower: https://homosaurus.org/v3/homoit0000152
related: https://homosaurus.org/v3/homoit0000203

Bisexual television
type: Concept
issued: 2019-05-14
modified: 2025-02-23
replaces: bisexualTelevision
comment: Television shows featuring bisexual characters or themes.
broader: https://homosaurus.org/v3/homoit0001359
change note: Version 3.7.0
has top concept: LGBTQ+ television
in scheme: v3
related: https://homosaurus.org/v3/homoit0000139

Bisexual theater
type: Concept
issued: 2019-05-14
modified: 2025-02-23
replaces: bisexualTheatre
comment: Works in the performance arts that focus on bisexual characters, communities, or issues.
broader: https://homosaurus.org/v3/homoit0001363
change note: Version 3.7.0
has top concept: LGBTQ+ theater
in scheme: v3
preferred label: Bisexual theatre
related: https://homosaurus.org/v3/homoit0000149

Bisexual victims of hate crimes
type: Concept
issued: 2019-05-14
modified: 2025-02-23
replaces: bisexualVictimsOfHateCrimes
comment: Bisexual people who have experienced hate crimes and may or may not have survived; follow the individual's preference for "victims" or "survivors" whenever possible.
broader: https://homosaurus.org/v3/homoit0000613
change note: Version 3.7.0
has top concept: LGBTQ+ people
in scheme: v3
narrower: https://homosaurus.org/v3/homoit0000188

Bisexual victims of rape
type: Concept
issued: 2019-05-14
modified: 2025-02-23
replaces: bisexualVictimsOfRape
comment: Bisexual people who have experienced rape and may or may not have survived; follow the individual's preference for "victims" or "survivors" whenever possible.
broader: https://homosaurus.org/v3/homoit0000958
change note: Version 3.7.0
has top concept: LGBTQ+ people
in scheme: v3
narrower: https://homosaurus.org/v3/homoit0000189

Bisexual victims of sexual abuse
type: Concept
issued: 2019-05-14
modified: 2025-02-23
replaces: bisexualVictimsOfSexualAbuse
comment: Bisexual people who have experienced sexual abuse and may or may not have survived; follow the individual's preference for "victims" or "survivors" whenever possible.
broader: https://homosaurus.org/v3/homoit0000959
change note: Version 3.7.0
has top concept: LGBTQ+ people
in scheme: v3
narrower: https://homosaurus.org/v3/homoit0000190

Bisexual victims of war
type: Concept
issued: 2019-05-14
modified: 2025-02-23
replaces: bisexualVictimsOfWar
comment: Bisexual people who have experienced war and may or may not have survived; follow the individual's preference for "victims" or "survivors" whenever possible.
broader: https://homosaurus.org/v3/homoit0000961
change note: Version 3.7.0
has top concept: LGBTQ+ people
in scheme: v3
narrower: https://homosaurus.org/v3/homoit0000191

Bisexual victims' rights
type: Concept
issued: 2019-05-14
modified: 2025-02-23
replaces: bisexualVictimsRights
comment: Bisexual people's legal rights to be informed, present, and heard within the criminal justice system after having been harmed or injured as the result of of a crime, accident, or other event.
broader: https://homosaurus.org/v3/homoit0001492
change note: Version 3.7.0
has top concept: Law
in scheme: v3

White bisexual people
type: Concept
issued: 2019-05-14
modified: 2025-02-23
replaces: bisexualWhitePeople
comment: Bisexual people who are white.
alternative label: Bisexual Caucasian people
alternative label: Bisexual white people
broader: https://homosaurus.org/v3/homoit0000243
change note: Version 3.7.0
has top concept: White LGBTQ+ people
in scheme: v3

Bisexual women
type: Concept
issued: 2019-05-14
modified: 2025-02-23
replaces: bisexualWomen
comment: Bisexual individuals who self-identity as women and understand their gender in terms of Western conceptions of womanness, femaleness, and/or femininity.
broader: https://homosaurus.org/v3/homoit0000170
broader: https://homosaurus.org/v3/homoit0001509
change note: Version 3.7.0
has top concept: LGBTQ+ people
in scheme: v3
narrower: https://homosaurus.org/v3/homoit0001002
related: https://homosaurus.org/v3/homoit0001510

Bisexual youth literature
type: Concept
issued: 2019-05-14
modified: 2025-02-23
replaces: bisexualYouthLiterature
comment: Written literary works for an audience of readers from 12-18 years of age, also known as young adult literature or YA; use in reference to youth literature focusing on bisexual characters or themes.
broader: https://homosaurus.org/v3/homoit0001522
change note: Version 3.7.0
has top concept: Subcultures
in scheme: v3
related: https://homosaurus.org/v3/homoit0000192

Bisexuality
type: Concept
issued: 2019-05-14
modified: 2025-02-23
replaces: bisexuality
comment: Sexual identity that is defined as attraction to more than one gender; follow the individual's preference for bisexuality, pansexuality, or polysexuality whenever possible.
broader: https://homosaurus.org/v3/homoit0001298
broader: https://homosaurus.org/v3/homoit0001558
change note: Version 3.7.0
has top concept: Sexual orientation
in scheme: v3
narrower: https://homosaurus.org/v3/homoit0003445
related: https://homosaurus.org/v3/homoit0000170
related: https://homosaurus.org/v3/homoit0000647
related: https://homosaurus.org/v3/homoit0000799
related: https://homosaurus.org/v3/homoit0001919

Bissu
type: Concept
issued: 2019-05-14
modified: 2025-02-23
replaces: bissu
comment: Mentally and physically androgynous shamans in Bugis (Indonesia) culture.
broader: https://homosaurus.org/v3/homoit0000322
change note: Version 3.7.0
has top concept: Gender
in scheme: v3

Biting
type: Concept
issued: 2019-05-14
modified: 2025-02-23
replaces: biting
comment: Biting, or applying pressure with one's teeth, for the purposes of sexual arousal.
broader: https://homosaurus.org/v3/homoit0000593
broader: https://homosaurus.org/v3/homoit0001299
change note: Version 3.7.0
has top concept: Sex (Act)
in scheme: v3
related: https://homosaurus.org/v3/homoit0000211

Biza'ah
type: Concept
issued: 2019-05-14
modified: 2025-02-23
replaces: bizaah
comment: Among the Zapotec in Teotitlán del Valle, Mexico, this term refers to people assigned male at birth who exhibit feminine characteristics.
broader: https://homosaurus.org/v3/homoit0000322
change note: Version 3.7.0
has top concept: Gender
in scheme: v3

Black LGBTQ+ people
type: Concept
issued: 2019-05-14
modified: 2025-02-23
replaces: blackPeopleLGBTQ
comment: Black people who are also LGBTQ+; do not use for people of color broadly; follow the individual's preference for Black or African American whenever possible.
alternative label: Black people (LGBTQ)
alternative label: LGBTQ+ Black people
broader: https://homosaurus.org/v3/homoit0001101
change note: Version 3.7.0
has top concept: LGBTQ+ people
in scheme: v3
narrower: https://homosaurus.org/v3/homoit0000015
narrower: https://homosaurus.org/v3/homoit0000016
narrower: https://homosaurus.org/v3/homoit0000017
narrower: https://homosaurus.org/v3/homoit0000018
narrower: https://homosaurus.org/v3/homoit0000019
narrower: https://homosaurus.org/v3/homoit0000135
narrower: https://homosaurus.org/v3/homoit0000477
narrower: https://homosaurus.org/v3/homoit0000726
narrower: https://homosaurus.org/v3/homoit0001163
narrower: https://homosaurus.org/v3/homoit0001396
narrower: https://homosaurus.org/v3/homoit0001782
narrower: https://homosaurus.org/v3/homoit0002334
narrower: https://homosaurus.org/v3/homoit0002764
narrower: https://homosaurus.org/v3/homoit0003400
related: https://homosaurus.org/v3/homoit0001928
related: https://homosaurus.org/v3/homoit0002376
related: https://homosaurus.org/v3/homoit0002398
related: https://homosaurus.org/v3/homoit0002399

Blindfolds
type: Concept
issued: 2019-05-14
modified: 2025-02-23
replaces: blindfolds
comment: An accessory used to cover the eyes, traditionally a piece of cloth tied around one’s head to eliminate or limit vision.
broader: https://homosaurus.org/v3/homoit0001266
broader: https://homosaurus.org/v3/homoit0003059
change note: Version 3.7.0
has top concept: Sex accessories
in scheme: v3
related: https://homosaurus.org/v3/homoit0003146
related: https://homosaurus.org/v3/homoit0003850

Blogs
type: Concept
issued: 2019-05-14
modified: 2025-02-23
replaces: blogs
comment: Websites or webpages, typically run by individuals or small groups, that are written in an informal or conversational style.
broader: https://homosaurus.org/v3/homoit0001321
change note: Version 3.7.0
has top concept: Social media
in scheme: v3
narrower: https://homosaurus.org/v3/homoit0000823

Vampirism (Sex)
type: Concept
issued: 2019-05-14
modified: 2025-02-23
replaces: vampirism
comment: Sexual practices or fetishes centering around the "vampire lifestyle"; can be a subset of BDSM communities and include roleplay, the consumption of blood, etc.
alternative label: Blood sports
alternative label: Vampire sex
broader: https://homosaurus.org/v3/homoit0000442
broader: https://homosaurus.org/v3/homoit0001299
change note: Version 3.7.0
has top concept: Eroticism
in scheme: v3
related: https://homosaurus.org/v3/homoit0000206

Fellatio
type: Concept
issued: 2019-05-14
modified: 2025-02-23
replaces: fellatio
comment: A sexual act involving the use of the mouth and tongue to stimulate another person's external genitalia (typically the penis or clitoris).
alternative label: Blow jobs
alternative label: Cocksucking
alternative label: Penilingus
broader: https://homosaurus.org/v3/homoit0000593
broader: https://homosaurus.org/v3/homoit0001109
broader: https://homosaurus.org/v3/homoit0001267
broader: https://homosaurus.org/v3/homoit0001299
change note: Version 3.7.0
has top concept: Sex (Act)
in scheme: v3
related: https://homosaurus.org/v3/homoit0001099
related: https://homosaurus.org/v3/homoit0002578

Sex dolls
type: Concept
issued: 2019-05-14
modified: 2025-02-23
replaces: sexDolls
comment: Sex toys designed to mimic parts of or the entirety of the body.
alternative label: Blow up dolls
alternative label: Inflatable dolls
broader: https://homosaurus.org/v3/homoit0001266
change note: Version 3.7.0
has top concept: Sex accessories
in scheme: v3
related: https://homosaurus.org/v3/homoit0003099

Bootblacking
type: Concept
issued: 2019-05-14
modified: 2025-02-23
replaces: bootblacking
comment: In the leather and kink communities, the act of cleaning and conditioning leather.
broader: https://homosaurus.org/v3/homoit0000705
change note: Version 3.7.0
has top concept: LGBTQ+ communities
in scheme: v3
related: https://homosaurus.org/v3/homoit0000442
related: https://homosaurus.org/v3/homoit0001242
related: https://homosaurus.org/v3/homoit0003063
related: https://homosaurus.org/v3/homoit0003064
related: https://homosaurus.org/v3/homoit0003065
related: https://homosaurus.org/v3/homoit0003102
related: https://homosaurus.org/v3/homoit0003105
related: https://homosaurus.org/v3/homoit0003122

Boston marriages
type: Concept
issued: 2019-05-14
modified: 2025-02-23
replaces: bostonMarriages
comment: The cohabitation of two women (often in a romantic relationship) without the financial support of a man. Originated in New England (USA) in the late 19th century.
broader: https://homosaurus.org/v3/homoit0000310
broader: https://homosaurus.org/v3/homoit0000878
change note: Version 3.7.0
has top concept: LGBTQ+ relationships
in scheme: v3
related: https://homosaurus.org/v3/homoit0000735

Bottoms (Sex)
type: Concept
issued: 2019-05-14
modified: 2025-02-23
replaces: bottoms
comment: The receptive partner during sex or kink activities.
alternative label: Bottoms
alternative label: Catchers (Sex)
alternative label: Catchers
broader: https://homosaurus.org/v3/homoit0001295
broader: https://homosaurus.org/v3/homoit0001304
change note: Version 3.7.0
has top concept: Sexual identity
in scheme: v3
related: https://homosaurus.org/v3/homoit0001318
related: https://homosaurus.org/v3/homoit0001353
related: https://homosaurus.org/v3/homoit0001376
related: https://homosaurus.org/v3/homoit0001779
related: https://homosaurus.org/v3/homoit0003052
related: https://homosaurus.org/v3/homoit0003084

Boys
type: Concept
issued: 2019-05-14
modified: 2025-02-23
replaces: boys
comment: Children or youth, typically younger than 18 years old, who identify as boys.
broader: https://homosaurus.org/v3/homoit0000255
change note: Version 3.7.0
has top concept: Family members
in scheme: v3
narrower: https://homosaurus.org/v3/homoit0000137
narrower: https://homosaurus.org/v3/homoit0000479
narrower: https://homosaurus.org/v3/homoit0000621
narrower: https://homosaurus.org/v3/homoit0001313
narrower: https://homosaurus.org/v3/homoit0002283
related: https://homosaurus.org/v3/homoit0000221
related: https://homosaurus.org/v3/homoit0000563

Boys' friendships
type: Concept
issued: 2019-05-14
modified: 2025-02-23
replaces: boysFriendships
comment: Connections based on affection and trust between two or more boys.
broader: https://homosaurus.org/v3/homoit0000455
broader: https://homosaurus.org/v3/homoit0000649
change note: Version 3.7.0
has top concept: LGBTQ+ relationships
in scheme: v3
related: https://homosaurus.org/v3/homoit0000220

Breast
type: Concept
issued: 2019-05-14
modified: 2025-02-23
replaces: breasts
comment: One of the two soft, protruding organs on an individual's chest.
alternative label: Boobs
alternative label: Bosoms
alternative label: Bosom
alternative label: Tits
alternative label: Titties
alternative label: Boob
alternative label: Breasts
alternative label: Tit
alternative label: Titty
broader: https://homosaurus.org/v3/homoit0000401
broader: https://homosaurus.org/v3/homoit0001259
change note: Version 3.7.0
has top concept: Erogenous body parts
in scheme: v3
related: https://homosaurus.org/v3/homoit0000114
related: https://homosaurus.org/v3/homoit0001620
related: https://homosaurus.org/v3/homoit0001621
related: https://homosaurus.org/v3/homoit0001622
related: https://homosaurus.org/v3/homoit0001623
related: https://homosaurus.org/v3/homoit0001630
related: https://homosaurus.org/v3/homoit0001631
related: https://homosaurus.org/v3/homoit0001639
related: https://homosaurus.org/v3/homoit0003118
related: https://homosaurus.org/v3/homoit0003130
related: https://homosaurus.org/v3/homoit0003132
related: https://homosaurus.org/v3/homoit0003133

Brotherboys
type: Concept
issued: 2019-05-14
modified: 2025-02-23
replaces: brotherboys
comment: Indigenous Australian term for people who transition from female to male.
alternative label: Brothaboys
broader: https://homosaurus.org/v3/homoit0000322
change note: Version 3.7.0
has top concept: Gender
in scheme: v3
related: https://homosaurus.org/v3/homoit0000436
related: https://homosaurus.org/v3/homoit0001314

LGBTQ+ Buddhists
type: Concept
issued: 2019-05-14
modified: 2025-02-23
replaces: buddhistsLGBTQ
comment: LGBTQ+ people who are Buddhist.
alternative label: Buddhists (LGBTQ)
broader: https://homosaurus.org/v3/homoit0000928
change note: Version 3.7.0
has top concept: LGBTQ+ religious people
in scheme: v3
narrower: https://homosaurus.org/v3/homoit0000138
narrower: https://homosaurus.org/v3/homoit0000480
narrower: https://homosaurus.org/v3/homoit0000728
narrower: https://homosaurus.org/v3/homoit0001165
narrower: https://homosaurus.org/v3/homoit0001398
narrower: https://homosaurus.org/v3/homoit0002988
narrower: https://homosaurus.org/v3/homoit0002989

LGBTQ+ peer support
type: Concept
issued: 2019-05-14
modified: 2025-02-23
replaces: buddyCareForLGBTQPeople
comment: A peer-to-peer form of healthcare support for LGBTQ+ people in which volunteers (sometimes called buddies) attend clinical visits with patients to provide emotional and logistical support.
alternative label: Buddy care for LGBTQ+ people
alternative label: LGBTQ+ buddy care
alternative label: Peer support for LGBTQ+ people
broader: https://homosaurus.org/v3/homoit0000614
change note: Version 3.7.0
has top concept: Health care for LGBTQ+ people
in scheme: v3
related: https://homosaurus.org/v3/homoit0000005
related: https://homosaurus.org/v3/homoit0000636

Sodomites
type: Concept
issued: 2019-05-14
modified: 2025-02-23
replaces: sodomites
comment: Pejorative historical term for individuals who engage in sexual activities that are characterized as unnatural or immoral; commonly applied to gay men engaging in anal sex. Only use in historical contexts.
alternative label: Buggers
broader: https://homosaurus.org/v3/homoit0000878
change note: Version 3.7.0
has top concept: LGBTQ+ historical terms
in scheme: v3
related: https://homosaurus.org/v3/homoit0001297
related: https://homosaurus.org/v3/homoit0001325

Burrnesha
type: Concept
issued: 2019-05-14
modified: 2025-02-23
replaces: burrnesha
comment: In the Balkans, people assigned female at birth who take a vow of chastity and live as men.
broader: https://homosaurus.org/v3/homoit0000322
change note: Version 3.7.0
has top concept: Gender
in scheme: v3

Butch-femme relationships
type: Concept
issued: 2019-05-14
modified: 2025-02-23
replaces: butchFemmeRelationships
comment: Romantic, sexual, or play relationships between a masculine-identifying or -presenting person and a feminine-identifying or -presenting person. Though the terms "butch" and "femme" are most commonly used in lesbian communities, they are also used by other LGBTQ+ people. Only use to describe relationships between individuals who self-identify as butch and femme.
broader: https://homosaurus.org/v3/homoit0000382
broader: https://homosaurus.org/v3/homoit0001237
change note: Version 3.7.0
has top concept: Subcultures
in scheme: v3
related: https://homosaurus.org/v3/homoit0000231
related: https://homosaurus.org/v3/homoit0000440
related: https://homosaurus.org/v3/homoit0001241
related: https://homosaurus.org/v3/homoit0001295
related: https://homosaurus.org/v3/homoit0001340

Butches
type: Concept
issued: 2019-05-14
modified: 2025-02-23
replaces: butches
comment: A masculine person of any gender, though this term is most commonly used in lesbian communities.
broader: https://homosaurus.org/v3/homoit0000577
broader: https://homosaurus.org/v3/homoit0001295
broader: https://homosaurus.org/v3/homoit0001304
change note: Version 3.7.0
has top concept: Role behavior
in scheme: v3
related: https://homosaurus.org/v3/homoit0000215
related: https://homosaurus.org/v3/homoit0000230
related: https://homosaurus.org/v3/homoit0000384
related: https://homosaurus.org/v3/homoit0000432
related: https://homosaurus.org/v3/homoit0000440
related: https://homosaurus.org/v3/homoit0000556
related: https://homosaurus.org/v3/homoit0000568
related: https://homosaurus.org/v3/homoit0000995
related: https://homosaurus.org/v3/homoit0001327
related: https://homosaurus.org/v3/homoit0001340
related: https://homosaurus.org/v3/homoit0001374
related: https://homosaurus.org/v3/homoit0001499
related: https://homosaurus.org/v3/homoit0002061

Butt
type: Concept
issued: 2019-05-14
modified: 2025-02-23
replaces: buttocks
comment: Colloquial term for the buttocks, or the fleshy protuberances at the back of the hips on which people sit.
alternative label: Arse
alternative label: Ass
alternative label: Bum
alternative label: Buttock
alternative label: Buttocks
broader: https://homosaurus.org/v3/homoit0000401
change note: Version 3.7.0
has top concept: Erogenous body parts
in scheme: v3
related: https://homosaurus.org/v3/homoit0000081
related: https://homosaurus.org/v3/homoit0001335

Butt plugs
type: Concept
issued: 2019-05-14
modified: 2025-02-23
replaces: buttplugs
comment: A sex toy designed to be inserted into the anus for sexual stimulation or pleasure. Butt plugs tend to be shorter than dildos and have a flared base that prevents them from being lost in the rectum.
alternative label: Anal dilators
alternative label: Anal inserts
alternative label: Anal plugs
alternative label: Buttplugs
broader: https://homosaurus.org/v3/homoit0001266
change note: Version 3.7.0
has top concept: Sex accessories
in scheme: v3
related: https://homosaurus.org/v3/homoit0000043
related: https://homosaurus.org/v3/homoit0000081

Calabai
type: Concept
issued: 2019-05-14
modified: 2025-02-23
replaces: calabai
comment: In Bugis culture, this term refers to people assigned male at birth who assume female roles.
broader: https://homosaurus.org/v3/homoit0000322
change note: Version 3.7.0
has top concept: Gender
in scheme: v3

Calalai
type: Concept
issued: 2019-05-14
modified: 2025-02-23
replaces: calalai
comment: In Bugis culture, this term refers to people assigned female at birth who assume male roles.
broader: https://homosaurus.org/v3/homoit0000322
change note: Version 3.7.0
has top concept: Gender
in scheme: v3

Men sex workers
type: Concept
issued: 2019-05-14
modified: 2025-02-23
replaces: maleProstitutes
comment: Men who receive money or goods in exchange for sexual services, performances, or companionship. Use to describe men working across the broad spectrum of sex work.
alternative label: Call boys
alternative label: Gigolos
alternative label: Rent boys
alternative label: Taxi boys
alternative label: Male sex workers
alternative label: Male prostitutes
alternative label: Men prostitutes
alternative label: Male prostitution
alternative label: Men prostitution
alternative label: Male sex work
alternative label: Men sex work
broader: https://homosaurus.org/v3/homoit0003758
change note: Version 3.7.0
has top concept: Sex workers
in scheme: v3

LGBTQ+ Calvinists
type: Concept
issued: 2019-05-14
modified: 2025-02-23
replaces: LGBTQCalvinists
comment: LGBTQ+ people who are Calvinists.
alternative label: Calvinists (LGBTQ)
alternative label: LGBTQ Calvinists
broader: https://homosaurus.org/v3/homoit0001137
change note: Version 3.7.0
has top concept: LGBTQ+ religious people
in scheme: v3

Cunnilingus
type: Concept
issued: 2019-05-14
modified: 2025-02-23
replaces: cunnilingus
comment: A sexual act involving the use of the mouth and tongue to stimulate the clitoris, labia, and vagina.
alternative label: Carpet munching
alternative label: Cunt licking
alternative label: Eating pussy
alternative label: Muff diving
broader: https://homosaurus.org/v3/homoit0000280
broader: https://homosaurus.org/v3/homoit0000593
broader: https://homosaurus.org/v3/homoit0000969
broader: https://homosaurus.org/v3/homoit0001267
broader: https://homosaurus.org/v3/homoit0001299
change note: Version 3.7.0
has top concept: Sex (Act)
in scheme: v3
related: https://homosaurus.org/v3/homoit0001487
related: https://homosaurus.org/v3/homoit0001488
related: https://homosaurus.org/v3/homoit0002578

Eunuchs
type: Concept
issued: 2019-05-14
modified: 2025-02-23
replaces: eunuchs
comment: Individuals assigned male at birth who have been castrated. Historically, eunuchs served in royal courts as slaves or servants; in some cases, individuals were castrated before puberty to retain childlike vocal qualities.
alternative label: Castrati
broader: https://homosaurus.org/v3/homoit0000322
change note: Version 3.7.0
has top concept: Gender
in scheme: v3
related: https://homosaurus.org/v3/homoit0000241
related: https://homosaurus.org/v3/homoit0000632

Casual sex
type: Concept
issued: 2019-05-14
modified: 2025-02-23
replaces: casualSex
comment: Intermittent or isolated sexual encounters between two or more people, typically occurring outside of romantic relationships or other forms of commitment, emotional attachment, or familiarity.
alternative label: Promiscuity
broader: https://homosaurus.org/v3/homoit0001299
broader: https://homosaurus.org/v3/homoit0001302
change note: Version 3.7.0
has top concept: Sexual practices
in scheme: v3
related: https://homosaurus.org/v3/homoit0000050
related: https://homosaurus.org/v3/homoit0000319
related: https://homosaurus.org/v3/homoit0000603
related: https://homosaurus.org/v3/homoit0001272
related: https://homosaurus.org/v3/homoit0001300
related: https://homosaurus.org/v3/homoit0001306

Chakka
type: Concept
issued: 2019-05-14
modified: 2025-02-23
replaces: chakka
comment: Derogatory term for a third gender person in Karnataka culture in India.
broader: https://homosaurus.org/v3/homoit0000322
broader: https://homosaurus.org/v3/homoit0001560
change note: Version 3.7.0
has top concept: Gender
in scheme: v3
related: https://homosaurus.org/v3/homoit0000632

Legal name change
type: Concept
issued: 2019-05-14
modified: 2025-02-23
replaces: legalNameChange
comment: The process by which an individual adopts a new name on legal or government-issued documents.
alternative label: Change of name
broader: https://homosaurus.org/v3/homoit0000918
broader: https://homosaurus.org/v3/homoit0001053
change note: Version 3.7.0
has top concept: Law
in scheme: v3
related: https://homosaurus.org/v3/homoit0000119
related: https://homosaurus.org/v3/homoit0000377
related: https://homosaurus.org/v3/homoit0000711
related: https://homosaurus.org/v3/homoit0000990
related: https://homosaurus.org/v3/homoit0001092
related: https://homosaurus.org/v3/homoit0001324
related: https://homosaurus.org/v3/homoit0003503

Changing rooms
type: Concept
issued: 2019-05-14
modified: 2025-02-23
replaces: changingRooms
comment: Rooms or areas in public or commercial spaces where people can change their clothes with varying degrees of privacy.
broader: https://homosaurus.org/v3/homoit0001141
change note: Version 3.7.0
has top concept: Public facilities
in scheme: v3
related: https://homosaurus.org/v3/homoit0001139

Chatrooms
type: Concept
issued: 2019-05-14
modified: 2025-02-23
replaces: chatrooms
comment: Dedicated websites or online applications used to exchange messages and images with other people, typically in real time.
broader: https://homosaurus.org/v3/homoit0001321
change note: Version 3.7.0
has top concept: Social media
in scheme: v3
narrower: https://homosaurus.org/v3/homoit0000832

Chest harnesses
type: Concept
issued: 2019-05-14
modified: 2025-02-23
replaces: chestHarnesses
comment: Wearable accessories, typically consisting of leather straps and metal rings or points of attachment, that fit around the chest and shoulders like a vest. May be worn as a fashion statement, to signal one's belonging to the leather or BDSM communities, or to restrict the wearer's movement during sex.
broader: https://homosaurus.org/v3/homoit0000612
change note: Version 3.7.0
has top concept: Sex accessories
in scheme: v3

Latino/a/x LGBTQ+ people
type: Concept
issued: 2019-05-14
modified: 2025-02-23
replaces: latinxLGBTQ
comment: Latin American people who are LGBTQ+; only use to describe individuals who self-identify as Latino, Latina, or Latinx. Do not conflate with Chicano/a/x or Hispanic.
alternative label: Latinas (LGBTQ)
alternative label: Latinos (LGBTQ)
alternative label: Latine people (LGBTQ)
alternative label: Latinx people (LGBTQ)
alternative label: LGBTQ+ Latinas
alternative label: LGBTQ+ Latine people
alternative label: LGBTQ+ Latinos
alternative label: LGBTQ+ Latinx people
broader: https://homosaurus.org/v3/homoit0000860
change note: Version 3.7.0
has top concept: LGBTQ+ people
in scheme: v3
narrower: https://homosaurus.org/v3/homoit0000019
narrower: https://homosaurus.org/v3/homoit0000155
narrower: https://homosaurus.org/v3/homoit0000498
narrower: https://homosaurus.org/v3/homoit0000747
narrower: https://homosaurus.org/v3/homoit0001181
narrower: https://homosaurus.org/v3/homoit0001417
narrower: https://homosaurus.org/v3/homoit0002769
narrower: https://homosaurus.org/v3/homoit0002897
narrower: https://homosaurus.org/v3/homoit0003419
related: https://homosaurus.org/v3/homoit0000095

Children
type: Concept
issued: 2019-05-14
modified: 2025-02-23
replaces: children
comment: People who have not yet reached the age of adolescence.
alternative label: Kids
broader: https://homosaurus.org/v3/homoit0000421
change note: Version 3.7.0
has top concept: Family members
in scheme: v3
narrower: https://homosaurus.org/v3/homoit0000220
narrower: https://homosaurus.org/v3/homoit0000256
narrower: https://homosaurus.org/v3/homoit0000260
narrower: https://homosaurus.org/v3/homoit0000590
narrower: https://homosaurus.org/v3/homoit0001768
narrower: https://homosaurus.org/v3/homoit0002282
narrower: https://homosaurus.org/v3/homoit0002285
narrower: https://homosaurus.org/v3/homoit0002628
narrower: https://homosaurus.org/v3/homoit0002629
narrower: https://homosaurus.org/v3/homoit0002772
narrower: https://homosaurus.org/v3/homoit0003501
related: https://homosaurus.org/v3/homoit0000254
related: https://homosaurus.org/v3/homoit0000263
related: https://homosaurus.org/v3/homoit0000347
related: https://homosaurus.org/v3/homoit0001520

LGBTQ+ children
type: Concept
issued: 2019-05-14
modified: 2025-02-23
replaces: childrenLGBTQ
comment: LGBTQ+ people who have not yet reached the age of adolescence.
alternative label: Children (LGBTQ)
broader: https://homosaurus.org/v3/homoit0000255
change note: Version 3.7.0
has top concept: Family members
in scheme: v3
narrower: https://homosaurus.org/v3/homoit0000140
narrower: https://homosaurus.org/v3/homoit0000668
narrower: https://homosaurus.org/v3/homoit0001167
narrower: https://homosaurus.org/v3/homoit0001307
narrower: https://homosaurus.org/v3/homoit0001400
narrower: https://homosaurus.org/v3/homoit0002222
narrower: https://homosaurus.org/v3/homoit0002362
narrower: https://homosaurus.org/v3/homoit0002363
narrower: https://homosaurus.org/v3/homoit0002772
related: https://homosaurus.org/v3/homoit0001756
related: https://homosaurus.org/v3/homoit0002699

Children of bisexual people
type: Concept
issued: 2019-05-14
modified: 2025-02-23
replaces: childrenOfBisexualPeople
comment: Children who have one or more bisexual parent.
broader: https://homosaurus.org/v3/homoit0000260
change note: Version 3.7.0
has top concept: Family members
in scheme: v3
narrower: https://homosaurus.org/v3/homoit0001330
related: https://homosaurus.org/v3/homoit0000150
related: https://homosaurus.org/v3/homoit0000169

Children of gay men
type: Concept
issued: 2019-05-14
modified: 2025-02-23
replaces: childrenOfGayMen
comment: Children who have one or more gay father.
broader: https://homosaurus.org/v3/homoit0000260
change note: Version 3.7.0
has top concept: Family members
in scheme: v3
narrower: https://homosaurus.org/v3/homoit0001331
related: https://homosaurus.org/v3/homoit0000491
related: https://homosaurus.org/v3/homoit0000492

Children of lesbians
type: Concept
issued: 2019-05-14
modified: 2025-02-23
replaces: childrenOfLesbians
comment: Children who have one or more lesbian parent.
broader: https://homosaurus.org/v3/homoit0000260
change note: Version 3.7.0
has top concept: Family members
in scheme: v3
narrower: https://homosaurus.org/v3/homoit0001332
related: https://homosaurus.org/v3/homoit0000740
related: https://homosaurus.org/v3/homoit0000752

Children of LGBTQ+ people
type: Concept
issued: 2019-05-14
modified: 2025-02-23
replaces: childrenOfLGBTQPeople
comment: Children who have one or more LGBTQ+ parent.
alternative label: Children of LGBTQ people
broader: https://homosaurus.org/v3/homoit0000255
change note: Version 3.7.0
has top concept: Family members
in scheme: v3
narrower: https://homosaurus.org/v3/homoit0000257
narrower: https://homosaurus.org/v3/homoit0000258
narrower: https://homosaurus.org/v3/homoit0000259
narrower: https://homosaurus.org/v3/homoit0000261
narrower: https://homosaurus.org/v3/homoit0000262
narrower: https://homosaurus.org/v3/homoit0001765
narrower: https://homosaurus.org/v3/homoit0001766
narrower: https://homosaurus.org/v3/homoit0001767
narrower: https://homosaurus.org/v3/homoit0002583
narrower: https://homosaurus.org/v3/homoit0002584
narrower: https://homosaurus.org/v3/homoit0002585
related: https://homosaurus.org/v3/homoit0000809
related: https://homosaurus.org/v3/homoit0002586

Children of transgender people
type: Concept
issued: 2019-05-14
modified: 2025-02-23
replaces: childrenOfTransgenderPeople
comment: Children who have one or more transgender parent.
broader: https://homosaurus.org/v3/homoit0000260
change note: Version 3.7.0
has top concept: Family members
in scheme: v3
narrower: https://homosaurus.org/v3/homoit0001333
narrower: https://homosaurus.org/v3/homoit0002587
related: https://homosaurus.org/v3/homoit0001412
related: https://homosaurus.org/v3/homoit0001430

Children of queer people
type: Concept
issued: 2019-05-14
modified: 2025-02-23
replaces: childrenOfQueerPeople
comment: Children who have one or more queer parent.
broader: https://homosaurus.org/v3/homoit0000260
change note: Version 3.7.0
has top concept: Family members
in scheme: v3
narrower: https://homosaurus.org/v3/homoit0001334
related: https://homosaurus.org/v3/homoit0001176
related: https://homosaurus.org/v3/homoit0001194
related: https://homosaurus.org/v3/homoit0002583
related: https://homosaurus.org/v3/homoit0002588

Children's sexuality
type: Concept
issued: 2019-05-14
modified: 2025-02-23
replaces: childrensSexuality
comment: The sexual behavior of children, include children's sense of their sexual orientation.
broader: https://homosaurus.org/v3/homoit0001306
change note: Version 3.7.0
has top concept: Sexuality
in scheme: v3
related: https://homosaurus.org/v3/homoit0000255

LGBTQ+ Christians
type: Concept
issued: 2019-05-14
modified: 2025-02-23
replaces: christiansLGBTQ
comment: LGBTQ+ people who are Christian. Use a more specific term if possible.
alternative label: Christians (LGBTQ)
broader: https://homosaurus.org/v3/homoit0000928
change note: Version 3.7.0
has top concept: LGBTQ+ religious people
in scheme: v3
narrower: https://homosaurus.org/v3/homoit0000141
narrower: https://homosaurus.org/v3/homoit0000386
narrower: https://homosaurus.org/v3/homoit0000483
narrower: https://homosaurus.org/v3/homoit0000680
narrower: https://homosaurus.org/v3/homoit0000731
narrower: https://homosaurus.org/v3/homoit0000904
narrower: https://homosaurus.org/v3/homoit0000912
narrower: https://homosaurus.org/v3/homoit0001137
narrower: https://homosaurus.org/v3/homoit0001168
narrower: https://homosaurus.org/v3/homoit0001244
narrower: https://homosaurus.org/v3/homoit0001401
narrower: https://homosaurus.org/v3/homoit0002974
narrower: https://homosaurus.org/v3/homoit0002980

Chromosomes
type: Concept
issued: 2019-05-14
modified: 2025-02-23
replaces: chromosomes
comment: Structures found in the nucleus of most living cells that carry genetic information in the form of genes. Often used in reference to sex chromosomes, a type of chromosome involved in sex determination.
broader: https://homosaurus.org/v3/homoit0001269
change note: Version 3.7.0
has top concept: Sex (Body)
in scheme: v3
related: https://homosaurus.org/v3/homoit0000078
related: https://homosaurus.org/v3/homoit0001648

Chubs (Gay culture)
type: Concept
issued: 2019-05-14
modified: 2025-02-23
replaces: chubsGayMen
comment: Slang term used in gay communities (primarily in the United States) to describe larger or heavy-set gay men.
alternative label: Chubs (Gay men)
alternative label: Chubs
broader: https://homosaurus.org/v3/homoit0000487
broader: https://homosaurus.org/v3/homoit0001295
change note: Version 3.7.0
has top concept: Subcultures
in scheme: v3
related: https://homosaurus.org/v3/homoit0000105

Cisgender men
type: Concept
issued: 2019-05-14
modified: 2025-02-23
replaces: cisgenderMen
comment: Men whose gender identity matches the sex or gender they were assigned at birth.
broader: https://homosaurus.org/v3/homoit0000271
broader: https://homosaurus.org/v3/homoit0001008
change note: Version 3.7.0
has top concept: Cisgender people
in scheme: v3
related: https://homosaurus.org/v3/homoit0000079
related: https://homosaurus.org/v3/homoit0001925

Cisgender women
type: Concept
issued: 2019-05-14
modified: 2025-02-23
replaces: cisgenderWomen
comment: Women whose gender identity matches the sex or gender they were assigned at birth.
broader: https://homosaurus.org/v3/homoit0000271
broader: https://homosaurus.org/v3/homoit0001509
change note: Version 3.7.0
has top concept: Cisgender people
in scheme: v3
related: https://homosaurus.org/v3/homoit0000077
related: https://homosaurus.org/v3/homoit0001925

Civil unions
type: Concept
issued: 2019-05-14
modified: 2025-02-23
replaces: civilUnions
comment: Legally recognized unions with rights similar (but often not identical or equal) to those of marriage, originally created for same-sex couples in jurisdictions where they were not legally allowed to marry.
alternative label: Civil partnership
alternative label: Registered partnership
broader: https://homosaurus.org/v3/homoit0000973
change note: Version 3.7.0
has top concept: Living arrangements
in scheme: v3
narrower: https://homosaurus.org/v3/homoit0000275
narrower: https://homosaurus.org/v3/homoit0000277
related: https://homosaurus.org/v3/homoit0000362
related: https://homosaurus.org/v3/homoit0000712
related: https://homosaurus.org/v3/homoit0000918
related: https://homosaurus.org/v3/homoit0000990
related: https://homosaurus.org/v3/homoit0000992
related: https://homosaurus.org/v3/homoit0001053

Civil union documents
type: Concept
issued: 2019-05-14
modified: 2025-02-23
replaces: civilUnionDocuments
comment: Legal documents certifying civil unions established in compliance with the laws of certain jurisdictions.
broader: https://homosaurus.org/v3/homoit0000274
broader: https://homosaurus.org/v3/homoit0001053
change note: Version 3.7.0
has top concept: Living arrangements
in scheme: v3

LGBTQ+ civil rights
type: Concept
issued: 2019-05-14
modified: 2025-02-23
replaces: civilRightsLGBTQ
comment: Legal rights of LGBTQ+ people to political and social freedom and equality.
alternative label: LGBTQ rights
alternative label: Civil rights (LGBTQ)
broader: https://homosaurus.org/v3/homoit0000652
change note: Version 3.7.0
has top concept: Human rights
in scheme: v3
narrower: https://homosaurus.org/v3/homoit0000183
narrower: https://homosaurus.org/v3/homoit0000531
narrower: https://homosaurus.org/v3/homoit0000775
narrower: https://homosaurus.org/v3/homoit0001206
narrower: https://homosaurus.org/v3/homoit0001443
narrower: https://homosaurus.org/v3/homoit0002808
related: https://homosaurus.org/v3/homoit0000339
related: https://homosaurus.org/v3/homoit0000673
related: https://homosaurus.org/v3/homoit0001026
related: https://homosaurus.org/v3/homoit0001492
related: https://homosaurus.org/v3/homoit0002723

Civil union certificates
type: Concept
issued: 2019-05-14
modified: 2025-02-23
replaces: civilUnionCertificates
comment: Official certificates certifying civil unions established in compliance with the laws of certain jurisdictions.
broader: https://homosaurus.org/v3/homoit0000274
broader: https://homosaurus.org/v3/homoit0001053
change note: Version 3.7.0
has top concept: Living arrangements
in scheme: v3

Clit rings
type: Concept
issued: 2019-05-14
modified: 2025-02-23
replaces: clitRings
comment: Genital piercings placed directly through the hood of the clitoris, typically worn for aesthetic purposes or to enhance sexual arousal.
broader: https://homosaurus.org/v3/homoit0001266
change note: Version 3.7.0
has top concept: Sex accessories
in scheme: v3
related: https://homosaurus.org/v3/homoit0000282

Clitoral sex
type: Concept
issued: 2019-05-14
modified: 2025-02-23
replaces: clitoralSex
comment: Sexual acts involving the clitoris.
broader: https://homosaurus.org/v3/homoit0001267
broader: https://homosaurus.org/v3/homoit0001299
change note: Version 3.7.0
has top concept: Sex (Act)
in scheme: v3
narrower: https://homosaurus.org/v3/homoit0000239
narrower: https://homosaurus.org/v3/homoit0000459
narrower: https://homosaurus.org/v3/homoit0003736
related: https://homosaurus.org/v3/homoit0000282
related: https://homosaurus.org/v3/homoit0001487

Clitoridectomy
type: Concept
issued: 2019-05-14
modified: 2025-02-23
replaces: clitoridectomy
comment: Surgical procedure involving the removal or reduction of the clitoris.
alternative label: Clitorectomy
alternative label: Female circumcision
broader: https://homosaurus.org/v3/homoit0000430
broader: https://homosaurus.org/v3/homoit0000670
change note: Version 3.7.0
has top concept: Female genital mutilation
in scheme: v3
related: https://homosaurus.org/v3/homoit0000269

Clitoris
type: Concept
issued: 2019-05-14
modified: 2025-02-23
replaces: clitoris
comment: Erogenous external organ that is capable of erection under sexual stimulation.
broader: https://homosaurus.org/v3/homoit0000401
broader: https://homosaurus.org/v3/homoit0000585
change note: Version 3.7.0
has top concept: Erogenous body parts
in scheme: v3
narrower: https://homosaurus.org/v3/homoit0000460
related: https://homosaurus.org/v3/homoit0000279
related: https://homosaurus.org/v3/homoit0000280
related: https://homosaurus.org/v3/homoit0001844
related: https://homosaurus.org/v3/homoit0001848
related: https://homosaurus.org/v3/homoit0003736

Clitoromegaly
type: Concept
issued: 2019-05-14
modified: 2025-02-23
replaces: clitoromegaly
comment: People born with clitoromegaly have a clitoris that is larger than what society considers to be typical. Clitoromegaly is a trait associated with several different intersex variations, including congenital adrenal hyperplasia and progestin-induced virilization.
alternative label: Enlarged clitoris
broader: https://homosaurus.org/v3/homoit0000669
change note: Version 3.7.0
has top concept: Sex (Body)
in scheme: v3

Clones (Gay culture)
type: Concept
issued: 2019-05-14
modified: 2025-02-23
replaces: clonesGayMen
comment: Historical term for gay men who dress in a particular masculine fashion; often used in the Castro District of San Francisco.
alternative label: Clones (Gay men)
alternative label: Clones
broader: https://homosaurus.org/v3/homoit0000506
broader: https://homosaurus.org/v3/homoit0000878
change note: Version 3.7.0
has top concept: LGBTQ+ people
in scheme: v3

Closeted bisexual people
type: Concept
issued: 2019-05-14
modified: 2025-02-23
replaces: closetedBisexualPeople
comment: Bisexual people who do not identify as such to others.
broader: https://homosaurus.org/v3/homoit0000170
broader: https://homosaurus.org/v3/homoit0001783
change note: Version 3.7.0
has top concept: LGBTQ+ people
in scheme: v3
related: https://homosaurus.org/v3/homoit0000286
related: https://homosaurus.org/v3/homoit0000287
related: https://homosaurus.org/v3/homoit0000295
related: https://homosaurus.org/v3/homoit0000365
related: https://homosaurus.org/v3/homoit0001065
related: https://homosaurus.org/v3/homoit0001261
related: https://homosaurus.org/v3/homoit0001784
related: https://homosaurus.org/v3/homoit0001785
related: https://homosaurus.org/v3/homoit0002905

Closeted gay men
type: Concept
issued: 2019-05-14
modified: 2025-02-23
replaces: closetedGayMen
comment: Gay men who do not identify as such to others.
broader: https://homosaurus.org/v3/homoit0000506
broader: https://homosaurus.org/v3/homoit0001783
change note: Version 3.7.0
has top concept: LGBTQ+ people
in scheme: v3
related: https://homosaurus.org/v3/homoit0000285
related: https://homosaurus.org/v3/homoit0000287
related: https://homosaurus.org/v3/homoit0000295
related: https://homosaurus.org/v3/homoit0000365
related: https://homosaurus.org/v3/homoit0001065
related: https://homosaurus.org/v3/homoit0001261
related: https://homosaurus.org/v3/homoit0001784
related: https://homosaurus.org/v3/homoit0001785
related: https://homosaurus.org/v3/homoit0002905

Closeted lesbians
type: Concept
issued: 2019-05-14
modified: 2025-02-23
replaces: closetedLesbians
comment: Lesbians who do not identify as such to others.
broader: https://homosaurus.org/v3/homoit0000556
broader: https://homosaurus.org/v3/homoit0001783
change note: Version 3.7.0
has top concept: LGBTQ+ people
in scheme: v3
related: https://homosaurus.org/v3/homoit0000285
related: https://homosaurus.org/v3/homoit0000286
related: https://homosaurus.org/v3/homoit0000295
related: https://homosaurus.org/v3/homoit0001065
related: https://homosaurus.org/v3/homoit0001261
related: https://homosaurus.org/v3/homoit0001784
related: https://homosaurus.org/v3/homoit0001785
related: https://homosaurus.org/v3/homoit0002905

Clothing
type: Concept
issued: 2019-05-14
modified: 2025-02-23
replaces: clothing
comment: Items worn on the body for protection, insulation, and self-expression; typically made of fabric or textiles.
broader: https://homosaurus.org/v3/homoit0000568
change note: Version 3.7.0
has top concept: Gender
in scheme: v3
narrower: https://homosaurus.org/v3/homoit0000970
narrower: https://homosaurus.org/v3/homoit0001808
narrower: https://homosaurus.org/v3/homoit0003815
related: https://homosaurus.org/v3/homoit0000316
related: https://homosaurus.org/v3/homoit0000318
related: https://homosaurus.org/v3/homoit0000366
related: https://homosaurus.org/v3/homoit0000367
related: https://homosaurus.org/v3/homoit0001895
related: https://homosaurus.org/v3/homoit0002169
related: https://homosaurus.org/v3/homoit0003063
related: https://homosaurus.org/v3/homoit0003066

Cock rings
type: Concept
issued: 2019-05-14
modified: 2025-02-23
replaces: cockRings
comment: Rings or circular sex toys worn on the penis to maintain an erection and prevent orgasm.
broader: https://homosaurus.org/v3/homoit0001266
change note: Version 3.7.0
has top concept: Sex accessories
in scheme: v3
related: https://homosaurus.org/v3/homoit0001099

Enemas
type: Concept
issued: 2019-05-14
modified: 2025-02-23
replaces: enemas
comment: A liquid application device used as a douche or to cleanse the bowels or vagina, or usage of such a device. Can be used for sexual or erotic purposes.
alternative label: Colonic irrigation
broader: https://homosaurus.org/v3/homoit0000442
broader: https://homosaurus.org/v3/homoit0001266
broader: https://homosaurus.org/v3/homoit0001267
broader: https://homosaurus.org/v3/homoit0001299
broader: https://homosaurus.org/v3/homoit0003059
change note: Version 3.7.0
has top concept: Eroticism
in scheme: v3
related: https://homosaurus.org/v3/homoit0000076
related: https://homosaurus.org/v3/homoit0000081
related: https://homosaurus.org/v3/homoit0003124

Collars
type: Concept
issued: 2019-05-14
modified: 2025-02-23
replaces: collars
comment: Straps or bands of material worn around the neck. May be worn as a fashion statement, to signal "ownership" by a dominant partner within the context of a BDSM relationship, or during sex to restrict the wearer's movement and breath control.
broader: https://homosaurus.org/v3/homoit0001266
change note: Version 3.7.0
has top concept: Sex accessories
in scheme: v3
related: https://homosaurus.org/v3/homoit0000214

Common law marriage
type: Concept
issued: 2019-05-14
modified: 2025-02-23
replaces: commonLawMarriage
comment: Legal framework in which two partners are considered married without having formally registered their relationship as a civil or religious marriage. Common law marriage grants certain economic rights and legal privileges.
broader: https://homosaurus.org/v3/homoit0000990
broader: https://homosaurus.org/v3/homoit0000992
change note: Version 3.7.0
has top concept: Living arrangements
in scheme: v3

LGBTQ+ community centers
type: Concept
issued: 2019-05-14
modified: 2025-02-23
replaces: communityCentresLGBTQ
comment: Spaces in which people from LGBTQ+ communities meet for social, education, recreational, or organizing activities.
broader: https://homosaurus.org/v3/homoit0000830
broader: https://homosaurus.org/v3/homoit0000900
change note: Version 3.7.0
has top concept: LGBTQ+ centers
in scheme: v3
narrower: https://homosaurus.org/v3/homoit0000144
narrower: https://homosaurus.org/v3/homoit0000486
narrower: https://homosaurus.org/v3/homoit0000734
narrower: https://homosaurus.org/v3/homoit0001171
narrower: https://homosaurus.org/v3/homoit0001404
narrower: https://homosaurus.org/v3/homoit0001512
narrower: https://homosaurus.org/v3/homoit0002775
narrower: https://homosaurus.org/v3/homoit0002968
preferred label: LGBTQ+ community centres
related: https://homosaurus.org/v3/homoit0000297
related: https://homosaurus.org/v3/homoit0002689

Condoms
type: Concept
issued: 2019-05-14
modified: 2025-02-23
replaces: condoms
comment: Latex contraceptives used to cover penises during sexual activity for the purposes of preventing STIs and/or pregnancy.
alternative label: Prophylactics
alternative label: Rubbers
broader: https://homosaurus.org/v3/homoit0001266
change note: Version 3.7.0
has top concept: Sex accessories
in scheme: v3
related: https://homosaurus.org/v3/homoit0001251

LGBTQ+ Confucianists
type: Concept
issued: 2019-05-14
modified: 2025-02-23
replaces: LGBTQConfucianists
comment: LGBTQ+ people who are Confucianists.
alternative label: Confucianists (LGBTQ)
alternative label: LGBTQ Confucianists
broader: https://homosaurus.org/v3/homoit0000928
change note: Version 3.7.0
has top concept: LGBTQ+ religious people
in scheme: v3

Congenital adrenal hyperplasia
type: Concept
issued: 2019-05-14
modified: 2025-02-23
replaces: congenitalAdrenalHyperplasia
comment: Congenital adrenal hyperplasia (CAH) is a group of different but related genetic variations that affect the enzymes that allow the adrenal glands to make hormones that regulate the body’s functions. People with CAH do not consistently produce the amount of cortisol or aldosterone they need, but they may naturally produce higher-than-typical levels of androgens such as testosterone to help the body compensate. Someone with CAH can be born with XX or XY chromosomes. People with CAH and XY chromosomes are usually not considered to have a variation in sex characteristics since an increased amount of androgens will not cause the development of any characteristics that are not considered typical for people assigned male at birth. In people with XX chromosomes and CAH, the increase in androgen production can result in genital differences such as a larger-than-typical clitoris, fused labia, and the fusion of the urethra and vaginal canal to form a single opening. They may also develop some characteristics like body and facial hair or increased muscle mass during childhood or puberty.
alternative label: CAH
broader: https://homosaurus.org/v3/homoit0000669
change note: Version 3.7.0
has top concept: Sex (Body)
in scheme: v3
narrower: https://homosaurus.org/v3/homoit0002827
narrower: https://homosaurus.org/v3/homoit0002869

Conversion therapy
type: Concept
issued: 2019-05-14
modified: 2025-02-23
replaces: sexualReorientation
comment: Efforts to change the sexual or gender identity of an individual who is or is suspected to be LGBTQ+ to meet heterosexual or cisgender norms, typically under the belief that being LGBTQ+ is dangerous and/or the result of mental illness or trauma. The processes involved in conversion therapy include visualization training, spiritual interventions, and other aversion treatments.
alternative label: Reparative therapy
alternative label: Reorientation therapy
alternative label: Sexual reorientation therapy
broader: https://homosaurus.org/v3/homoit0000106
change note: Version 3.7.0
has top concept: Medical care
in scheme: v3
narrower: https://homosaurus.org/v3/homoit0003512

Second parent adoption
type: Concept
issued: 2019-05-14
modified: 2025-02-23
replaces: secondParentAdoption
comment: An adoption process by which a legal child-parent relationship is established by granting the “second” parent the same rights as the “first” parent without the “first” or legal parent relinquishing any parental rights. A second or co-parent adoption can be important for LGBTQ+ parents to protect their parental rights as the relationship of the non-biological parent may not be recognized in some jurisdictions without such an adoption.
alternative label: Co-parent adoption
broader: https://homosaurus.org/v3/homoit0000809
change note: Version 3.7.0
has top concept: LGBTQ+ family planning
in scheme: v3
related: https://homosaurus.org/v3/homoit0000918

Scat play
type: Concept
issued: 2019-05-14
modified: 2025-02-23
replaces: scat
comment: Use of feces for erotic enjoyment.
alternative label: Coprophilia
alternative label: Coprolagnia
alternative label: Extrementophilia
alternative label: Fecalphilia
alternative label: Fecophilia
alternative label: Poop fetish
alternative label: Poop fetishism
alternative label: Poop kink
alternative label: Scat fetish
alternative label: Scat fetishism
alternative label: Scat kink
alternative label: Scat
alternative label: Scatophilia
broader: https://homosaurus.org/v3/homoit0000442
change note: Version 3.7.0
has top concept: Eroticism
in scheme: v3
related: https://homosaurus.org/v3/homoit0000081
related: https://homosaurus.org/v3/homoit0000597

Corrective rape
type: Concept
issued: 2019-05-14
modified: 2025-02-23
replaces: correctiveRape
comment: Criminal practice in which men rape lesbians, sometimes under the supervision of members of the women's families or local communities, with the purported purpose of "curing" them of homosexuality.
broader: https://homosaurus.org/v3/homoit0001305
change note: Version 3.7.0
has top concept: Sexual violence
in scheme: v3
related: https://homosaurus.org/v3/homoit0000783
related: https://homosaurus.org/v3/homoit0000793
related: https://homosaurus.org/v3/homoit0003444

Corsets
type: Concept
issued: 2019-05-14
modified: 2025-02-23
replaces: corsets
comment: A garment worn to hold and train the torso into a desired shape, traditionally a smaller waist or larger bottom, for aesthetic purposes (either for the duration of wearing it or with a more lasting effect), or to support the breasts.
alternative label: Bondage corsets
alternative label: Tightlacing
broader: https://homosaurus.org/v3/homoit0003059
broader: https://homosaurus.org/v3/homoit0003066
change note: Version 3.7.0
has top concept: Eroticism
in scheme: v3
related: https://homosaurus.org/v3/homoit0003076
related: https://homosaurus.org/v3/homoit0003113

Cottages (Gay culture)
type: Concept
issued: 2019-05-14
modified: 2025-02-23
replaces: cottages
comment: UK slang term for public bathrooms used as locations for sexual encounters, particularly by gay men.
alternative label: Public urinals
alternative label: Cottages
broader: https://homosaurus.org/v3/homoit0000974
change note: Version 3.7.0
has top concept: Sex locations
in scheme: v3
narrower: https://homosaurus.org/v3/homoit0000595
related: https://homosaurus.org/v3/homoit0000309
related: https://homosaurus.org/v3/homoit0001140
related: https://homosaurus.org/v3/homoit0001358

Cottaging (Gay culture)
type: Concept
issued: 2019-05-14
modified: 2025-02-23
replaces: cottaging
comment: UK slang term commonly used in gay communities to describe the practice of engaging in anonymous sex in a public bathroom or cruising for sexual partners there.
alternative label: Cottaging
broader: https://homosaurus.org/v3/homoit0001267
broader: https://homosaurus.org/v3/homoit0001299
change note: Version 3.7.0
has top concept: Sex (Act)
in scheme: v3
related: https://homosaurus.org/v3/homoit0000050
related: https://homosaurus.org/v3/homoit0000308
related: https://homosaurus.org/v3/homoit0000319
related: https://homosaurus.org/v3/homoit0001142
related: https://homosaurus.org/v3/homoit0001357

LGBTQ+ couples
type: Concept
issued: 2019-05-14
modified: 2025-02-23
replaces: couplesLGBTQ
comment: Partnerships in which both people are LGBTQ+.
alternative label: Couples (LGBTQ)
broader: https://homosaurus.org/v3/homoit0001237
change note: Version 3.7.0
has top concept: LGBTQ+ relationships
in scheme: v3
narrower: https://homosaurus.org/v3/homoit0000145
narrower: https://homosaurus.org/v3/homoit0000218
narrower: https://homosaurus.org/v3/homoit0000503
narrower: https://homosaurus.org/v3/homoit0000735
narrower: https://homosaurus.org/v3/homoit0001172
narrower: https://homosaurus.org/v3/homoit0001405
narrower: https://homosaurus.org/v3/homoit0002780
narrower: https://homosaurus.org/v3/homoit0002969
related: https://homosaurus.org/v3/homoit0001083
related: https://homosaurus.org/v3/homoit0002690

Court orders
type: Concept
issued: 2019-05-14
modified: 2025-02-23
replaces: courtOrders
comment: Proclamations by a judge or panel of judges requiring or authorizing specific actions (e.g., court orders approving or denying requests for name or gender marker changes).
broader: https://homosaurus.org/v3/homoit0000702
broader: https://homosaurus.org/v3/homoit0001053
change note: Version 3.7.0
has top concept: Law
in scheme: v3
related: https://homosaurus.org/v3/homoit0000119
related: https://homosaurus.org/v3/homoit0000377
related: https://homosaurus.org/v3/homoit0000573

LGBTQ+ victims of crime
type: Concept
issued: 2019-05-14
modified: 2025-02-23
replaces: LGBTQVictimsOfCrime
comment: LGBTQ+ people who have experienced crimes and may or may not have survived; follow the individual's preference for “victims” or “survivors” whenever possible.
alternative label: Crime victims (LGBTQ)
alternative label: LGBTQ victims of crime
broader: https://homosaurus.org/v3/homoit0000915
change note: Version 3.7.0
has top concept: LGBTQ+ people
in scheme: v3
narrower: https://homosaurus.org/v3/homoit0000613
narrower: https://homosaurus.org/v3/homoit0000958
narrower: https://homosaurus.org/v3/homoit0000959
narrower: https://homosaurus.org/v3/homoit0003745
related: https://homosaurus.org/v3/homoit0001492

Criminal law
type: Concept
issued: 2019-05-14
modified: 2025-02-23
replaces: criminalLaw
comment: Body of law relating to crime that prescribes the legality and consequences of conduct perceived as threatening, harmful, or endangering to the property, health, safety, and/or moral welfare of oneself and others.
broader: https://homosaurus.org/v3/homoit0000702
change note: Version 3.7.0
has top concept: Law
in scheme: v3
narrower: https://homosaurus.org/v3/homoit0000314
narrower: https://homosaurus.org/v3/homoit0000339
narrower: https://homosaurus.org/v3/homoit0001289

Criminalization
type: Concept
issued: 2019-05-14
modified: 2025-02-23
replaces: criminalisation
comment: The process by which behaviors and individuals are framed as and come to be known as criminal.
broader: https://homosaurus.org/v3/homoit0000313
change note: Version 3.7.0
has top concept: Law
in scheme: v3
narrower: https://homosaurus.org/v3/homoit0002379
narrower: https://homosaurus.org/v3/homoit0002388
narrower: https://homosaurus.org/v3/homoit0003773
preferred label: Criminalisation
related: https://homosaurus.org/v3/homoit0000339
related: https://homosaurus.org/v3/homoit0001139
related: https://homosaurus.org/v3/homoit0003499

Cross-cultural relationships
type: Concept
issued: 2019-05-14
modified: 2025-02-23
replaces: cross-culturalRelationships
comment: Relationships between people of different ethnic or racial backgrounds.
alternative label: Intercultural relationships
alternative label: Interracial relationships
broader: https://homosaurus.org/v3/homoit0001237
change note: Version 3.7.0
has top concept: LGBTQ+ relationships
in scheme: v3
related: https://homosaurus.org/v3/homoit0001295
related: https://homosaurus.org/v3/homoit0001636

Crossdressers
type: Concept
issued: 2019-05-14
modified: 2025-02-23
replaces: crossdressers
comment: Individuals who wear clothes stereotypical to or associated with a gender other than their predominantly-identified gender. Crossdressers often develop a persona while crossdressing. Only use to describe individuals who self-identify as crossdressers.
alternative label: Cross-dressers
broader: https://homosaurus.org/v3/homoit0001817
change note: Version 3.7.0
has top concept: Gender minorities
in scheme: v3
related: https://homosaurus.org/v3/homoit0000289
related: https://homosaurus.org/v3/homoit0000318
related: https://homosaurus.org/v3/homoit0000373
related: https://homosaurus.org/v3/homoit0000375
related: https://homosaurus.org/v3/homoit0000396
related: https://homosaurus.org/v3/homoit0000970
related: https://homosaurus.org/v3/homoit0001076
related: https://homosaurus.org/v3/homoit0001085
related: https://homosaurus.org/v3/homoit0001090
related: https://homosaurus.org/v3/homoit0001378
related: https://homosaurus.org/v3/homoit0001470
related: https://homosaurus.org/v3/homoit0001781

Hormone therapy (Gender)
type: Concept
issued: 2019-05-14
modified: 2025-02-23
replaces: hormoneTherapyGender
comment: The process of altering one's sex hormones using hormone blockers and/or doses of testosterone, estrogen, or progesterone.
alternative label: Cross-gender hormone therapy
alternative label: Hormone reassignment therapy
alternative label: Hormone replacement therapy
broader: https://homosaurus.org/v3/homoit0001366
change note: Version 3.7.0
has top concept: Medical care
in scheme: v3
narrower: https://homosaurus.org/v3/homoit0000407
narrower: https://homosaurus.org/v3/homoit0000650
narrower: https://homosaurus.org/v3/homoit0001362
related: https://homosaurus.org/v3/homoit0001007
related: https://homosaurus.org/v3/homoit0001047
related: https://homosaurus.org/v3/homoit0001378
related: https://homosaurus.org/v3/homoit0002820

Crossdressing
type: Concept
issued: 2019-05-14
modified: 2025-02-23
replaces: crossdressing
comment: The practice of wearing clothing stereotypical to a gender other than the individual's predominantly-identified gender.
broader: https://homosaurus.org/v3/homoit0000568
change note: Version 3.7.0
has top concept: Gender
in scheme: v3
related: https://homosaurus.org/v3/homoit0000289
related: https://homosaurus.org/v3/homoit0000316
related: https://homosaurus.org/v3/homoit0000395
related: https://homosaurus.org/v3/homoit0000685
related: https://homosaurus.org/v3/homoit0000970
related: https://homosaurus.org/v3/homoit0001233
related: https://homosaurus.org/v3/homoit0001469
related: https://homosaurus.org/v3/homoit0001895
related: https://homosaurus.org/v3/homoit0003126
related: https://homosaurus.org/v3/homoit0003160

Cruising (LGBTQ+ culture)
type: Concept
issued: 2019-05-14
modified: 2025-02-23
replaces: cruising
comment: Walking or driving about a locality in search of a sex partner, typically to engage in casual sex.
alternative label: Cruising
broader: https://homosaurus.org/v3/homoit0001267
broader: https://homosaurus.org/v3/homoit0001299
change note: Version 3.7.0
has top concept: Sex (Act)
in scheme: v3
related: https://homosaurus.org/v3/homoit0000050
related: https://homosaurus.org/v3/homoit0000242
related: https://homosaurus.org/v3/homoit0000309
related: https://homosaurus.org/v3/homoit0000900
related: https://homosaurus.org/v3/homoit0001142
related: https://homosaurus.org/v3/homoit0001357

Cubs (Gay culture)
type: Concept
issued: 2019-05-14
modified: 2025-02-23
replaces: cubs
comment: Slang commonly used in gay communities in the United States to describe younger, heavy-set gay men, usually with hairy bodies and facial hair.
alternative label: Cubs
broader: https://homosaurus.org/v3/homoit0000105
broader: https://homosaurus.org/v3/homoit0000487
broader: https://homosaurus.org/v3/homoit0000577
broader: https://homosaurus.org/v3/homoit0001508
change note: Version 3.7.0
has top concept: Subcultures
in scheme: v3
related: https://homosaurus.org/v3/homoit0000568

Non-Euro-American gender and sexual identities
type: Concept
issued: 2019-05-14
modified: 2025-02-23
replaces: nonEuroAmericanGenderAndSexualIdentities
comment: Broad term describing gender and sexual identities specific to regions outside of North America and Europe.
alternative label: Culturally-specific gender identities
broader: https://homosaurus.org/v3/homoit0000571
change note: Version 3.7.0
has top concept: Gender
in scheme: v3
narrower: https://homosaurus.org/v3/homoit0000003
narrower: https://homosaurus.org/v3/homoit0000023
narrower: https://homosaurus.org/v3/homoit0000035
narrower: https://homosaurus.org/v3/homoit0000037
narrower: https://homosaurus.org/v3/homoit0000039
narrower: https://homosaurus.org/v3/homoit0000046
narrower: https://homosaurus.org/v3/homoit0000065
narrower: https://homosaurus.org/v3/homoit0000072
narrower: https://homosaurus.org/v3/homoit0000085
narrower: https://homosaurus.org/v3/homoit0000090
narrower: https://homosaurus.org/v3/homoit0000091
narrower: https://homosaurus.org/v3/homoit0000096
narrower: https://homosaurus.org/v3/homoit0000101
narrower: https://homosaurus.org/v3/homoit0000113
narrower: https://homosaurus.org/v3/homoit0000205
narrower: https://homosaurus.org/v3/homoit0000207
narrower: https://homosaurus.org/v3/homoit0000224
narrower: https://homosaurus.org/v3/homoit0000229
narrower: https://homosaurus.org/v3/homoit0000234
narrower: https://homosaurus.org/v3/homoit0000235
narrower: https://homosaurus.org/v3/homoit0000240
narrower: https://homosaurus.org/v3/homoit0000246
narrower: https://homosaurus.org/v3/homoit0000340
narrower: https://homosaurus.org/v3/homoit0000350
narrower: https://homosaurus.org/v3/homoit0000353
narrower: https://homosaurus.org/v3/homoit0000413
narrower: https://homosaurus.org/v3/homoit0000414
narrower: https://homosaurus.org/v3/homoit0000419
narrower: https://homosaurus.org/v3/homoit0000441
narrower: https://homosaurus.org/v3/homoit0000461
narrower: https://homosaurus.org/v3/homoit0000604
narrower: https://homosaurus.org/v3/homoit0000616
narrower: https://homosaurus.org/v3/homoit0000632
narrower: https://homosaurus.org/v3/homoit0000654
narrower: https://homosaurus.org/v3/homoit0000678
narrower: https://homosaurus.org/v3/homoit0000684
narrower: https://homosaurus.org/v3/homoit0000687
narrower: https://homosaurus.org/v3/homoit0000688
narrower: https://homosaurus.org/v3/homoit0000689
narrower: https://homosaurus.org/v3/homoit0000690
narrower: https://homosaurus.org/v3/homoit0000693
narrower: https://homosaurus.org/v3/homoit0000694
narrower: https://homosaurus.org/v3/homoit0000695
narrower: https://homosaurus.org/v3/homoit0000697
narrower: https://homosaurus.org/v3/homoit0000898
narrower: https://homosaurus.org/v3/homoit0000966
narrower: https://homosaurus.org/v3/homoit0000979
narrower: https://homosaurus.org/v3/homoit0000980
narrower: https://homosaurus.org/v3/homoit0000987
narrower: https://homosaurus.org/v3/homoit0000996
narrower: https://homosaurus.org/v3/homoit0001013
narrower: https://homosaurus.org/v3/homoit0001029
narrower: https://homosaurus.org/v3/homoit0001034
narrower: https://homosaurus.org/v3/homoit0001035
narrower: https://homosaurus.org/v3/homoit0001043
narrower: https://homosaurus.org/v3/homoit0001044
narrower: https://homosaurus.org/v3/homoit0001070
narrower: https://homosaurus.org/v3/homoit0001072
narrower: https://homosaurus.org/v3/homoit0001147
narrower: https://homosaurus.org/v3/homoit0001253
narrower: https://homosaurus.org/v3/homoit0001256
narrower: https://homosaurus.org/v3/homoit0001263
narrower: https://homosaurus.org/v3/homoit0001264
narrower: https://homosaurus.org/v3/homoit0001309
narrower: https://homosaurus.org/v3/homoit0001314
narrower: https://homosaurus.org/v3/homoit0001316
narrower: https://homosaurus.org/v3/homoit0001338
narrower: https://homosaurus.org/v3/homoit0001368
narrower: https://homosaurus.org/v3/homoit0001370
narrower: https://homosaurus.org/v3/homoit0001371

Cum
type: Concept
issued: 2019-05-14
modified: 2025-02-23
replaces: cum
comment: Body fluids produced by sexual arousal and orgasm.
alternative label: Semen
broader: https://homosaurus.org/v3/homoit0003061
change note: Version 3.7.0
has top concept: Body fluids
in scheme: v3
related: https://homosaurus.org/v3/homoit0000589
related: https://homosaurus.org/v3/homoit0000610
related: https://homosaurus.org/v3/homoit0000683
related: https://homosaurus.org/v3/homoit0001062
related: https://homosaurus.org/v3/homoit0001284
related: https://homosaurus.org/v3/homoit0001288
related: https://homosaurus.org/v3/homoit0003127
related: https://homosaurus.org/v3/homoit0003128

Cyberbullying
type: Concept
issued: 2019-05-14
modified: 2025-02-23
replaces: cyberbullying
comment: Bullying or harassment that takes place online.
broader: https://homosaurus.org/v3/homoit0000228
change note: Version 3.7.0
has top concept: Bullying
in scheme: v3
related: https://homosaurus.org/v3/homoit0001321

Dandies
type: Concept
issued: 2019-05-14
modified: 2025-02-23
replaces: dandies
comment: Men who place particular importance upon physical appearance, refined language, and leisurely hobbies.
broader: https://homosaurus.org/v3/homoit0000577
broader: https://homosaurus.org/v3/homoit0000878
broader: https://homosaurus.org/v3/homoit0001295
change note: Version 3.7.0
has top concept: Role behavior
in scheme: v3
related: https://homosaurus.org/v3/homoit0000327
related: https://homosaurus.org/v3/homoit0000568

Dandyism
type: Concept
issued: 2019-05-14
modified: 2025-02-23
replaces: dandyism
comment: The style or conduct of a dandy.
broader: https://homosaurus.org/v3/homoit0001345
change note: Version 3.7.0
has top concept: Subcultures
in scheme: v3
related: https://homosaurus.org/v3/homoit0000326

Dating applications
type: Concept
issued: 2019-05-14
modified: 2025-02-23
replaces: datingApplications
comment: Software applications designed to generate connections between people interested in romantic or sexual relationships.
alternative label: Dating apps
broader: https://homosaurus.org/v3/homoit0001321
change note: Version 3.7.0
has top concept: Social media
in scheme: v3
narrower: https://homosaurus.org/v3/homoit0000846
related: https://homosaurus.org/v3/homoit0000325
related: https://homosaurus.org/v3/homoit0000329
related: https://homosaurus.org/v3/homoit0000664

Dating websites
type: Concept
issued: 2019-05-14
modified: 2025-02-23
replaces: datingWebsites
comment: Online websites designed to generate connections between people interested in romantic or sexual relationships.
broader: https://homosaurus.org/v3/homoit0001321
change note: Version 3.7.0
has top concept: Social media
in scheme: v3
narrower: https://homosaurus.org/v3/homoit0000847
related: https://homosaurus.org/v3/homoit0000328
related: https://homosaurus.org/v3/homoit0000664

LGBTQ+ daughters
type: Concept
issued: 2019-05-14
modified: 2025-02-23
replaces: daughtersLGBTQ
comment: Daughters who identify as LGBTQ+.
alternative label: Daughters (LGBTQ)
broader: https://homosaurus.org/v3/homoit0000915
broader: https://homosaurus.org/v3/homoit0002351
change note: Version 3.7.0
has top concept: LGBTQ+ people
in scheme: v3
narrower: https://homosaurus.org/v3/homoit0000146
narrower: https://homosaurus.org/v3/homoit0000736
narrower: https://homosaurus.org/v3/homoit0001173
narrower: https://homosaurus.org/v3/homoit0001407
narrower: https://homosaurus.org/v3/homoit0002781
narrower: https://homosaurus.org/v3/homoit0002971
related: https://homosaurus.org/v3/homoit0003241

Daughters of bisexual people
type: Concept
issued: 2019-05-14
modified: 2025-02-23
replaces: daughtersOfBisexualPeople
comment: Daughters who have one or more bisexual parent.
broader: https://homosaurus.org/v3/homoit0002352
change note: Version 3.7.0
has top concept: Family members
in scheme: v3

Daughters of gay men
type: Concept
issued: 2019-05-14
modified: 2025-02-23
replaces: daughtersOfGayMen
comment: Daughters who have one or more gay parent.
broader: https://homosaurus.org/v3/homoit0002352
change note: Version 3.7.0
has top concept: Family members
in scheme: v3

Daughters of lesbians
type: Concept
issued: 2019-05-14
modified: 2025-02-23
replaces: daughtersOfLesbians
comment: Daughters who have one or more lesbian parent.
broader: https://homosaurus.org/v3/homoit0002352
change note: Version 3.7.0
has top concept: Family members
in scheme: v3

Daughters of transgender people
type: Concept
issued: 2019-05-14
modified: 2025-02-23
replaces: daughtersOfTransgenderPeople
comment: Daughters who have one or more transgender parent.
broader: https://homosaurus.org/v3/homoit0002352
change note: Version 3.7.0
has top concept: Family members
in scheme: v3

Daughters of queer people
type: Concept
issued: 2019-05-14
modified: 2025-02-23
replaces: daughtersOfQueerPeople
comment: Daughters who have one or more queer parent.
broader: https://homosaurus.org/v3/homoit0002352
change note: Version 3.7.0
has top concept: Family members
in scheme: v3

Deadnaming
type: Concept
issued: 2019-05-14
modified: 2025-02-23
replaces: deadnaming
comment: The act of using or referring to a person’s assigned name rather than their chosen name, commonly with malicious intent.
broader: https://homosaurus.org/v3/homoit0000062
change note: Version 3.7.0
has top concept: LGBTQ+ discrimination
in scheme: v3
related: https://homosaurus.org/v3/homoit0000264
related: https://homosaurus.org/v3/homoit0000592
related: https://homosaurus.org/v3/homoit0001016
related: https://homosaurus.org/v3/homoit0001065
related: https://homosaurus.org/v3/homoit0001560

Decadence
type: Concept
issued: 2019-05-14
modified: 2025-02-23
replaces: decadence
comment: A way of life characterized by mannerisms and affectations marked by excess.
broader: https://homosaurus.org/v3/homoit0001345
change note: Version 3.7.0
has top concept: Subcultures
in scheme: v3
related: https://homosaurus.org/v3/homoit0001295

Decriminalization
type: Concept
issued: 2019-05-14
modified: 2025-02-23
replaces: decriminalisation
comment: The process of lessening or removing criminal penalties for certain acts.
broader: https://homosaurus.org/v3/homoit0000313
change note: Version 3.7.0
has top concept: Law
in scheme: v3
narrower: https://homosaurus.org/v3/homoit0003774
preferred label: Decriminalisation
related: https://homosaurus.org/v3/homoit0000276
related: https://homosaurus.org/v3/homoit0000314

Dee
type: Concept
issued: 2019-05-14
modified: 2025-02-23
replaces: dee
comment: In Thailand, cisgender women who conform to feminine gender norms and who often partner with masculine-identified toms; similar to a femme in U.S. lesbian culture.
broader: https://homosaurus.org/v3/homoit0000322
change note: Version 3.7.0
has top concept: Gender
in scheme: v3
related: https://homosaurus.org/v3/homoit0000687
related: https://homosaurus.org/v3/homoit0001373

Demigender people
type: Concept
issued: 2019-05-14
modified: 2025-02-23
replaces: demigenderPeople
comment: People who have a partial connection to a certain gender or concept of gender.
broader: https://homosaurus.org/v3/homoit0001378
broader: https://homosaurus.org/v3/homoit0001817
change note: Version 3.7.0
has top concept: LGBTQ+ people
in scheme: v3
narrower: https://homosaurus.org/v3/homoit0001652
narrower: https://homosaurus.org/v3/homoit0001653
related: https://homosaurus.org/v3/homoit0000571
related: https://homosaurus.org/v3/homoit0001923

Demisexuality
type: Concept
issued: 2019-05-14
modified: 2025-02-23
replaces: demisexuality
comment: A sexual orientation generally characterized by the lack of sexual attraction to other people unless or until emotional connections have been formed.
broader: https://homosaurus.org/v3/homoit0001298
change note: Version 3.7.0
has top concept: Sexual orientation
in scheme: v3
related: https://homosaurus.org/v3/homoit0000344
related: https://homosaurus.org/v3/homoit0001535
related: https://homosaurus.org/v3/homoit0001923
related: https://homosaurus.org/v3/homoit0001986

Demisexual people
type: Concept
issued: 2019-05-14
modified: 2025-02-23
replaces: demisexualPeople
comment: Individuals who do not experience sexual attraction unless they have first formed a strong emotional connection with a person.
broader: https://homosaurus.org/v3/homoit0001295
broader: https://homosaurus.org/v3/homoit0001297
broader: https://homosaurus.org/v3/homoit0001300
change note: Version 3.7.0
has top concept: Sexual identity
in scheme: v3
narrower: https://homosaurus.org/v3/homoit0003036
related: https://homosaurus.org/v3/homoit0000343
related: https://homosaurus.org/v3/homoit0001302
related: https://homosaurus.org/v3/homoit0001535
related: https://homosaurus.org/v3/homoit0001985

Dental dams
type: Concept
issued: 2019-05-14
modified: 2025-02-23
replaces: dentalDams
comment: A square sheet of latex or polyurethane used to create a barrier between the mouth and the vagina or anus during oral sex.
alternative label: Latex barriers
broader: https://homosaurus.org/v3/homoit0001266
change note: Version 3.7.0
has top concept: Sex accessories
in scheme: v3
related: https://homosaurus.org/v3/homoit0001251

Detention of LGBTQ+ people under a hospital order
type: Concept
issued: 2019-05-14
modified: 2025-02-23
replaces: detentionOfLGBTQPeopleUnderAHospital
comment: Physical and legal confinement of LGBTQ+ people in hospitals or medical institutions, typically to receive evaluation and treatment ordered by a court or other such authority. Can be used to describe both short-term or long-term institutionalization.
alternative label: Detention of LGBTQ people under a hospital order
broader: https://homosaurus.org/v3/homoit0000348
change note: Version 3.7.0
has top concept: Detention of LGBTQ+ people
in scheme: v3
related: https://homosaurus.org/v3/homoit0000394
related: https://homosaurus.org/v3/homoit0001012

Dhurani
type: Concept
issued: 2019-05-14
modified: 2025-02-23
replaces: dhurani
comment: Bengali term for third sex people, often referring to feminine people who were assigned male at birth.
broader: https://homosaurus.org/v3/homoit0000322
change note: Version 3.7.0
has top concept: Gender
in scheme: v3

Intersex
type: Concept
issued: 2019-05-14
modified: 2025-02-23
replaces: intersex
comment: An umbrella term used to refer to people born with variations in their physical sex characteristics--including genitals, gonads, chromosomes, and hormonal factors--that do not fit typical definitions of male or female bodies.
alternative label: Differences in sex development
alternative label: Divergences in sex development
alternative label: DSDs
alternative label: Hermaphroditism
alternative label: Intersexuality
alternative label: Variations in sex development
alternative label: VSDs
alternative label: Intersexual
broader: https://homosaurus.org/v3/homoit0001269
change note: Version 3.7.0
has top concept: Sex (Body)
in scheme: v3
narrower: https://homosaurus.org/v3/homoit0000357
narrower: https://homosaurus.org/v3/homoit0000669
narrower: https://homosaurus.org/v3/homoit0002835
narrower: https://homosaurus.org/v3/homoit0002841
related: https://homosaurus.org/v3/homoit0000618
related: https://homosaurus.org/v3/homoit0000666
related: https://homosaurus.org/v3/homoit0000670
related: https://homosaurus.org/v3/homoit0000671
related: https://homosaurus.org/v3/homoit0000672
related: https://homosaurus.org/v3/homoit0001822

Dilbaa
type: Concept
issued: 2019-05-14
modified: 2025-02-23
replaces: dilbaa
comment: Navajo term for a person assigned female at birth who takes on the role of a boy in childhood and a man in adulthood.
broader: https://homosaurus.org/v3/homoit0000322
change note: Version 3.7.0
has top concept: Gender
in scheme: v3
related: https://homosaurus.org/v3/homoit0001035
related: https://homosaurus.org/v3/homoit0001480

Dildo harnesses
type: Concept
issued: 2019-05-14
modified: 2025-02-23
replaces: dildoHarnesses
comment: Devices worn to attach a dildo to a person's body, typically so they can penetrate a partner's vagina or anus.
alternative label: Strap-ons
broader: https://homosaurus.org/v3/homoit0000612
broader: https://homosaurus.org/v3/homoit0001266
change note: Version 3.7.0
has top concept: Sex accessories
in scheme: v3
related: https://homosaurus.org/v3/homoit0000355
related: https://homosaurus.org/v3/homoit0001067
related: https://homosaurus.org/v3/homoit0001342
related: https://homosaurus.org/v3/homoit0001367

Dildos
type: Concept
issued: 2019-05-14
modified: 2025-02-23
replaces: dildos
comment: A sex toy, often explicitly (although not necessarily) phallic in appearance, intended for sexual penetration or other sexual activity during masturbation or with sex partners.
broader: https://homosaurus.org/v3/homoit0001266
change note: Version 3.7.0
has top concept: Sex accessories
in scheme: v3
related: https://homosaurus.org/v3/homoit0000354
related: https://homosaurus.org/v3/homoit0001099
related: https://homosaurus.org/v3/homoit0001342
related: https://homosaurus.org/v3/homoit0001491

Disorders of sexual development
type: Concept
issued: 2019-05-14
modified: 2025-02-23
replaces: disordersOfSexualDevelopment
comment: Term used within medical contexts to refer to a wide range of variations in sex characteristics. Many people with intersex variations consider these terms to be stigmatizing and pathologizing, though they often still encounter them in their medical records.
alternative label: Disorders of sex development
broader: https://homosaurus.org/v3/homoit0000352
change note: Version 3.7.0
has top concept: Sex (Body)
in scheme: v3
related: https://homosaurus.org/v3/homoit0001006

Divorced people
type: Concept
issued: 2019-05-14
modified: 2025-02-23
replaces: divorcedPeople
comment: People whose marriages have been legally dissolved.
broader: https://homosaurus.org/v3/homoit0000989
change note: Version 3.7.0
has top concept: Living arrangements
in scheme: v3
related: https://homosaurus.org/v3/homoit0000854
related: https://homosaurus.org/v3/homoit0001312

Domestic partnership contracts
type: Concept
issued: 2019-05-14
modified: 2025-02-23
replaces: domesticPartnershipContracts
comment: Agreements, legal or otherwise, between two unmarried people in a domestic partnership that define property rights and support obligations if the relationship ends or if one partner dies.
broader: https://homosaurus.org/v3/homoit0001053
change note: Version 3.7.0
has top concept: Legal status
in scheme: v3
related: https://homosaurus.org/v3/homoit0000361
related: https://homosaurus.org/v3/homoit0000362
related: https://homosaurus.org/v3/homoit0000918
related: https://homosaurus.org/v3/homoit0000963
related: https://homosaurus.org/v3/homoit0000973
related: https://homosaurus.org/v3/homoit0000990

Domestic partnerships
type: Concept
issued: 2019-05-14
modified: 2025-02-23
replaces: domesticPartnerships
comment: Legal or personal relationships between individuals who live together and share their lives but are not married or joined by civil union.
broader: https://homosaurus.org/v3/homoit0000973
change note: Version 3.7.0
has top concept: Living arrangements
in scheme: v3
related: https://homosaurus.org/v3/homoit0000274
related: https://homosaurus.org/v3/homoit0000360
related: https://homosaurus.org/v3/homoit0000990
related: https://homosaurus.org/v3/homoit0001053
related: https://homosaurus.org/v3/homoit0001237
related: https://homosaurus.org/v3/homoit0001311

LGBTQ+ dominatrices
type: Concept
issued: 2019-05-14
modified: 2025-02-23
replaces: dominatricesLGBTQ
comment: The person who takes on the position of authority or power in a power exchange relationship or kink activity. Most commonly used by feminine identified people and professional dominants.
alternative label: Dominatrices (LGBTQ)
alternative label: LGBTQ+ D-types
alternative label: LGBTQ+ Dommes
alternative label: LGBTQ+ Mistresses
broader: https://homosaurus.org/v3/homoit0001637
broader: https://homosaurus.org/v3/homoit0003084
change note: Version 3.7.0
has top concept: Relationship minorities
in scheme: v3
narrower: https://homosaurus.org/v3/homoit0000148
narrower: https://homosaurus.org/v3/homoit0000738
narrower: https://homosaurus.org/v3/homoit0001175
narrower: https://homosaurus.org/v3/homoit0001410
narrower: https://homosaurus.org/v3/homoit0002990
related: https://homosaurus.org/v3/homoit0000103
related: https://homosaurus.org/v3/homoit0000705
related: https://homosaurus.org/v3/homoit0000999
related: https://homosaurus.org/v3/homoit0001018
related: https://homosaurus.org/v3/homoit0001318
related: https://homosaurus.org/v3/homoit0003052

Down-low
type: Concept
issued: 2019-05-14
modified: 2025-02-23
replaces: downLow
comment: African American slang term that describes a subculture of Black men who identify as heterosexual but have sex with men.
broader: https://homosaurus.org/v3/homoit0000015
change note: Version 3.7.0
has top concept: LGBTQ+ people
in scheme: v3
related: https://homosaurus.org/v3/homoit0000123
related: https://homosaurus.org/v3/homoit0000285
related: https://homosaurus.org/v3/homoit0000286
related: https://homosaurus.org/v3/homoit0000463
related: https://homosaurus.org/v3/homoit0001009
related: https://homosaurus.org/v3/homoit0001261
related: https://homosaurus.org/v3/homoit0001783
related: https://homosaurus.org/v3/homoit0001785
related: https://homosaurus.org/v3/homoit0001786
related: https://homosaurus.org/v3/homoit0001787
related: https://homosaurus.org/v3/homoit0001788
related: https://homosaurus.org/v3/homoit0002278

Drab (LGBTQ+ culture)
type: Concept
issued: 2019-05-14
modified: 2025-02-23
replaces: drab
comment: Slang term used to describe people wearing masculine clothing, typically drag queens or crossdressers who also sometimes wear feminine clothing. Drab is a shortened form of the phrase "dressed as a boy" or "dress resembling a boy."
alternative label: Drab
broader: https://homosaurus.org/v3/homoit0000568
change note: Version 3.7.0
has top concept: Gender
in scheme: v3
related: https://homosaurus.org/v3/homoit0000289
related: https://homosaurus.org/v3/homoit0000367

Drag
type: Concept
issued: 2019-05-14
modified: 2025-02-23
replaces: drag
comment: A performance genre involving dressing and/or using makeup to produce, emphasize, and/or exaggerate traits associated with a certain gender, which typically (but not always) is not the gender the performer primarily identifies with.
broader: https://homosaurus.org/v3/homoit0000568
change note: Version 3.7.0
has top concept: Gender
in scheme: v3
narrower: https://homosaurus.org/v3/homoit0000970
narrower: https://homosaurus.org/v3/homoit0003160
narrower: https://homosaurus.org/v3/homoit0003245
related: https://homosaurus.org/v3/homoit0000238
related: https://homosaurus.org/v3/homoit0000289
related: https://homosaurus.org/v3/homoit0000366
related: https://homosaurus.org/v3/homoit0000368
related: https://homosaurus.org/v3/homoit0000369
related: https://homosaurus.org/v3/homoit0000370
related: https://homosaurus.org/v3/homoit0000373
related: https://homosaurus.org/v3/homoit0000375
related: https://homosaurus.org/v3/homoit0000816
related: https://homosaurus.org/v3/homoit0001494
related: https://homosaurus.org/v3/homoit0001808
related: https://homosaurus.org/v3/homoit0001895
related: https://homosaurus.org/v3/homoit0001906
related: https://homosaurus.org/v3/homoit0003359
related: https://homosaurus.org/v3/homoit0003360

Drag balls
type: Concept
issued: 2019-05-14
modified: 2025-02-23
replaces: dragBalls
comment: Events that are part of the drag ball subculture that emerged in early 20th-century New York City among primarily African-American and Latin American LGBTQ+ people. During a drag ball, individuals "walk" or perform for prizes.
broader: https://homosaurus.org/v3/homoit0000861
change note: Version 3.7.0
has top concept: LGBTQ+ events
in scheme: v3
related: https://homosaurus.org/v3/homoit0000092
related: https://homosaurus.org/v3/homoit0000367
related: https://homosaurus.org/v3/homoit0000370
related: https://homosaurus.org/v3/homoit0001494

Drag bars
type: Concept
issued: 2019-05-14
modified: 2025-02-23
replaces: dragBars
comment: Establishments (typically serving alcohol) that host drag shows or other events featuring drag performers.
broader: https://homosaurus.org/v3/homoit0000100
change note: Version 3.7.0
has top concept: LGBTQ+ meeting places
in scheme: v3
related: https://homosaurus.org/v3/homoit0000367
related: https://homosaurus.org/v3/homoit0000370
related: https://homosaurus.org/v3/homoit0000925
related: https://homosaurus.org/v3/homoit0003359
related: https://homosaurus.org/v3/homoit0003360

Drag community
type: Concept
issued: 2019-05-14
modified: 2025-02-23
replaces: dragCommunity
comment: Groups of people (typically drag performers) with a shared interest in drag performances and culture.
broader: https://homosaurus.org/v3/homoit0000297
change note: Version 3.7.0
has top concept: LGBTQ+ communities
in scheme: v3
narrower: https://homosaurus.org/v3/homoit0000371
related: https://homosaurus.org/v3/homoit0000092
related: https://homosaurus.org/v3/homoit0000367
related: https://homosaurus.org/v3/homoit0000368
related: https://homosaurus.org/v3/homoit0000369
related: https://homosaurus.org/v3/homoit0000373
related: https://homosaurus.org/v3/homoit0000375
related: https://homosaurus.org/v3/homoit0001900
related: https://homosaurus.org/v3/homoit0001906

Drag families
type: Concept
issued: 2019-05-14
modified: 2025-02-23
replaces: dragFamilies
comment: Groups of drag performers who share a community and typically live in close quarters with one another. Drag families are headed by drag mothers or drag fathers, with other members termed drag daughters and sons. Members of a drag family typically use the same last name as their drag mother or father (e.g., Xtravaganza) in social contexts or while performing.
broader: https://homosaurus.org/v3/homoit0000370
broader: https://homosaurus.org/v3/homoit0000420
broader: https://homosaurus.org/v3/homoit0000834
change note: Version 3.7.0
has top concept: LGBTQ+ communities
in scheme: v3
narrower: https://homosaurus.org/v3/homoit0000372
narrower: https://homosaurus.org/v3/homoit0000374
related: https://homosaurus.org/v3/homoit0000094
related: https://homosaurus.org/v3/homoit0000373
related: https://homosaurus.org/v3/homoit0000375

Drag fathers
type: Concept
issued: 2019-05-14
modified: 2025-02-23
replaces: dragFathers
comment: More experienced drag kings who support less experienced drag kings as they enter the drag scene as performers.
broader: https://homosaurus.org/v3/homoit0000371
change note: Version 3.7.0
has top concept: LGBTQ+ communities
in scheme: v3
related: https://homosaurus.org/v3/homoit0000373
related: https://homosaurus.org/v3/homoit0000374
related: https://homosaurus.org/v3/homoit0000375

Drag mothers
type: Concept
issued: 2019-05-14
modified: 2025-02-23
replaces: dragMothers
comment: More experienced drag queens who support less experienced drag queens as they enter the drag scene as performers.
broader: https://homosaurus.org/v3/homoit0000371
change note: Version 3.7.0
has top concept: LGBTQ+ communities
in scheme: v3
related: https://homosaurus.org/v3/homoit0000372
related: https://homosaurus.org/v3/homoit0000373
related: https://homosaurus.org/v3/homoit0000375

Drag queens
type: Concept
issued: 2019-05-14
modified: 2025-02-23
replaces: dragQueens
comment: Performers, often people assigned male at birth, who dress in stereotypically feminine attire and enact feminine personas for the purpose of entertainment.
broader: https://homosaurus.org/v3/homoit0001148
change note: Version 3.7.0
has top concept: Subcultures
in scheme: v3
related: https://homosaurus.org/v3/homoit0000316
related: https://homosaurus.org/v3/homoit0000367
related: https://homosaurus.org/v3/homoit0000370
related: https://homosaurus.org/v3/homoit0000371
related: https://homosaurus.org/v3/homoit0000372
related: https://homosaurus.org/v3/homoit0000373
related: https://homosaurus.org/v3/homoit0000374
related: https://homosaurus.org/v3/homoit0000431
related: https://homosaurus.org/v3/homoit0001906

LGBTQ+ drama
type: Concept
issued: 2019-05-14
modified: 2025-02-23
replaces: dramaLGBTQ
comment: Works of fiction written to be performed; use in reference to dramatic works focusing on LGBTQ+ characters or themes.
alternative label: Drama (LGBTQ)
broader: https://homosaurus.org/v3/homoit0000972
change note: Version 3.7.0
has top concept: Subcultures
in scheme: v3
narrower: https://homosaurus.org/v3/homoit0000149
narrower: https://homosaurus.org/v3/homoit0000489
narrower: https://homosaurus.org/v3/homoit0000739
narrower: https://homosaurus.org/v3/homoit0001174
narrower: https://homosaurus.org/v3/homoit0001411
narrower: https://homosaurus.org/v3/homoit0002452
narrower: https://homosaurus.org/v3/homoit0002468
narrower: https://homosaurus.org/v3/homoit0002485
narrower: https://homosaurus.org/v3/homoit0002501
narrower: https://homosaurus.org/v3/homoit0002522
narrower: https://homosaurus.org/v3/homoit0002739
related: https://homosaurus.org/v3/homoit0000922
related: https://homosaurus.org/v3/homoit0001363
related: https://homosaurus.org/v3/homoit0001723
related: https://homosaurus.org/v3/homoit0002691

Driver's licenses
type: Concept
issued: 2019-05-14
modified: 2025-02-23
replaces: driversLicenses
comment: Legal documents authorizing individuals to operate motor vehicles; commonly used as legal proof of identity; can be used in reference to LGBTQ+ people seeking driver's licenses or changes to existing licenses (e.g., name, gender or sex marker, photo).
broader: https://homosaurus.org/v3/homoit0001053
change note: Version 3.7.0
has top concept: Legal status
in scheme: v3
narrower: https://homosaurus.org/v3/homoit0000573
related: https://homosaurus.org/v3/homoit0000247
related: https://homosaurus.org/v3/homoit0000311
related: https://homosaurus.org/v3/homoit0000711
related: https://homosaurus.org/v3/homoit0001005
related: https://homosaurus.org/v3/homoit0001324
related: https://homosaurus.org/v3/homoit0001465

LGBTQ+ people who use substances
type: Concept
issued: 2019-05-14
modified: 2025-02-23
replaces: drugUsers
comment: Umbrella term for LGBTQ+ people who use substances (that are typically deemed harmful or are subject to legal restriction, such as drugs or alcohol) for any reason. Apply more specific terms if possible.
alternative label: Drug users (LGBTQ)
alternative label: LGBTQ+ people who drink
alternative label: LGBTQ+ people who use drugs
alternative label: Substance users (LGBTQ)
broader: https://homosaurus.org/v3/homoit0000915
change note: Version 3.7.0
has top concept: LGBTQ+ people
in scheme: v3
narrower: https://homosaurus.org/v3/homoit0001235
narrower: https://homosaurus.org/v3/homoit0001540
narrower: https://homosaurus.org/v3/homoit0001550
narrower: https://homosaurus.org/v3/homoit0002229

Dutch boys
type: Concept
issued: 2019-05-14
modified: 2025-02-23
replaces: dutchBoys
comment: Slang for heterosexual men who are friends with lesbians and socialize in lesbian spaces.
alternative label: Lesbros
broader: https://homosaurus.org/v3/homoit0000626
change note: Version 3.7.0
has top concept: Heterosexuals
in scheme: v3
related: https://homosaurus.org/v3/homoit0000416
related: https://homosaurus.org/v3/homoit0000455
related: https://homosaurus.org/v3/homoit0000598
related: https://homosaurus.org/v3/homoit0001133
related: https://homosaurus.org/v3/homoit0001788

Lesbian culture
type: Concept
issued: 2019-05-14
modified: 2025-02-23
replaces: lesbianCulture
comment: Use to describe cultural experiences shared by members of lesbian communities or products of lesbian culture (e.g., art and media created by and for lesbians, activism focused on lesbian issues, slang commonly used in lesbian communities, etc.).
alternative label: Dyke culture
broader: https://homosaurus.org/v3/homoit0001831
change note: Version 3.7.0
has top concept: Subcultures
in scheme: v3
narrower: https://homosaurus.org/v3/homoit0000230
narrower: https://homosaurus.org/v3/homoit0000385
narrower: https://homosaurus.org/v3/homoit0000730
narrower: https://homosaurus.org/v3/homoit0000755
narrower: https://homosaurus.org/v3/homoit0000779
related: https://homosaurus.org/v3/homoit0001295
related: https://homosaurus.org/v3/homoit0001832
related: https://homosaurus.org/v3/homoit0001833

Dyke marches
type: Concept
issued: 2019-05-14
modified: 2025-02-23
replaces: dykeMarches
comment: Marches, rallies, and other public gatherings focused on lesbian visibility, rights, and issues. This term should only be used to describe marches explicitly for dykes or marches centered on the dyke identity and politics. Otherwise, use the more general term "Lesbian pride."
broader: https://homosaurus.org/v3/homoit0003651
change note: Version 3.7.0
has top concept: LGBTQ+ events
in scheme: v3
related: https://homosaurus.org/v3/homoit0000767

Dykes
type: Concept
issued: 2019-05-14
modified: 2025-02-23
replaces: dykes
comment: A largely reclaimed slur common in the U.S. that may be used to refer to lesbians who embrace a masculine style of presentation or lesbian political activists in general. Only use for individuals who self-identify as dykes.
broader: https://homosaurus.org/v3/homoit0001559
broader: https://homosaurus.org/v3/homoit0001560
change note: Version 3.7.0
has top concept: LGBTQ+ slang
in scheme: v3
related: https://homosaurus.org/v3/homoit0000231
related: https://homosaurus.org/v3/homoit0000440
related: https://homosaurus.org/v3/homoit0000556
related: https://homosaurus.org/v3/homoit0003719

Dykes on bikes
type: Concept
issued: 2019-05-14
modified: 2025-02-23
replaces: dykesOnBikes
comment: A chartered motorcycle club with many loosely affiliated chapters that are comprised of lesbian members who identify as dykes; known for their participation in gay pride events.
broader: https://homosaurus.org/v3/homoit0000382
change note: Version 3.7.0
has top concept: Subcultures
in scheme: v3
related: https://homosaurus.org/v3/homoit0000906
related: https://homosaurus.org/v3/homoit0003104

LGBTQ+ Eastern Orthodox Christians
type: Concept
issued: 2019-05-14
modified: 2025-02-23
replaces: LGBTQEasternOrthodoxChristians
comment: LGBTQ+ people who are members of the Eastern Orthodox Christian Church.
alternative label: Eastern Orthodox Christians (LGBTQ)
alternative label: LGBTQ Orthodox Eastern Christians
alternative label: LGBTQ Eastern Orthodox Christians
broader: https://homosaurus.org/v3/homoit0000265
change note: Version 3.7.0
has top concept: LGBTQ+ religious people
in scheme: v3

Ecofeminism
type: Concept
issued: 2019-05-14
modified: 2025-02-23
replaces: ecofeminism
comment: Political and philosophical movement that views feminism and concerns for the environment as inherently related.
broader: https://homosaurus.org/v3/homoit0000437
change note: Version 3.7.0
has top concept: Feminism
in scheme: v3
related: https://homosaurus.org/v3/homoit0003171

Femininities
type: Concept
issued: 2019-05-14
modified: 2025-02-23
replaces: femininity
comment: Culture-specific sets of attributes, behaviors, and roles generally associated with women or girls.
alternative label: Effeminacy
alternative label: Femininity
broader: https://homosaurus.org/v3/homoit0000568
change note: Version 3.7.0
has top concept: Gender
in scheme: v3
narrower: https://homosaurus.org/v3/homoit0001821
narrower: https://homosaurus.org/v3/homoit0002043
related: https://homosaurus.org/v3/homoit0000047
related: https://homosaurus.org/v3/homoit0000440
related: https://homosaurus.org/v3/homoit0000577
related: https://homosaurus.org/v3/homoit0000995
related: https://homosaurus.org/v3/homoit0001382

Egg donors
type: Concept
issued: 2019-05-14
modified: 2025-02-23
replaces: eggDonors
comment: Individuals of any gender who donate their own eggs for the purpose of inducing pregnancy.
broader: https://homosaurus.org/v3/homoit0000364
change note: Version 3.7.0
has top concept: Donors
in scheme: v3
related: https://homosaurus.org/v3/homoit0000583
related: https://homosaurus.org/v3/homoit0000864
related: https://homosaurus.org/v3/homoit0001347
related: https://homosaurus.org/v3/homoit0002627

Internalized homophobia
type: Concept
issued: 2019-05-14
modified: 2025-02-23
replaces: internalisedHomophobia
comment: This term is often used to describe internalized oppression held by and about LGBTQ+ people in general. It can also describe the more specific phenomenon in which gay men internalize or adopt homophobic beliefs (i.e., negative perceptions of and intolerance toward gay men and homosexuality) as a result of being raised or socialized within a homophobic environment or culture.
alternative label: Ego-dystonic homophobia
broader: https://homosaurus.org/v3/homoit0000646
broader: https://homosaurus.org/v3/homoit0002590
change note: Version 3.7.0
has top concept: LGBTQ+ phobia
in scheme: v3
narrower: https://homosaurus.org/v3/homoit0003093
preferred label: Internalised homophobia
related: https://homosaurus.org/v3/homoit0000345
related: https://homosaurus.org/v3/homoit0000392
related: https://homosaurus.org/v3/homoit0000699
related: https://homosaurus.org/v3/homoit0000936

Ego-dystonic sexual orientation
type: Concept
issued: 2019-05-14
modified: 2025-02-23
replaces: ego-dystonicSexualOrientation
comment: Internal conflict caused by having a sexual identity or attraction that is at odds with one’s idealized self-image.
alternative label: Ego-dystonic homosexuality
broader: https://homosaurus.org/v3/homoit0001011
change note: Version 3.7.0
has top concept: Mental disorders
in scheme: v3
related: https://homosaurus.org/v3/homoit0000303
related: https://homosaurus.org/v3/homoit0000391

LGBTQ+ older people
type: Concept
issued: 2019-05-14
modified: 2025-02-23
replaces: olderPeopleLGBTQ
comment: LGBTQ+ people who are advanced in age, typically defined as older than 60 years of age.
alternative label: Elderly (LGBTQ)
alternative label: Senior citizens (LGBTQ)
alternative label: Seniors (LGBTQ)
alternative label: Older people (LGBTQ)
broader: https://homosaurus.org/v3/homoit0000915
change note: Version 3.7.0
has top concept: LGBTQ+ people
in scheme: v3
narrower: https://homosaurus.org/v3/homoit0001054
narrower: https://homosaurus.org/v3/homoit0001055
narrower: https://homosaurus.org/v3/homoit0001056
narrower: https://homosaurus.org/v3/homoit0001057
narrower: https://homosaurus.org/v3/homoit0001058
related: https://homosaurus.org/v3/homoit0000856
related: https://homosaurus.org/v3/homoit0000931

Electroshock therapy
type: Concept
issued: 2019-05-14
modified: 2025-02-23
replaces: electroshockTherapy
comment: A form of psychiatric treatment for major depression, bipolar depression, and other mental health conditions that usually consists of brief electrical pulses to the brain through electrodes on the head that induce controlled seizures. Electroshock therapy has historically been used as an attempt to "cure" homosexuality and other non-normative sexualities and sexual practices.
alternative label: Electric shock therapy
alternative label: Electroconvulsive therapy
broader: https://homosaurus.org/v3/homoit0001366
change note: Version 3.7.0
has top concept: Medical care
in scheme: v3
related: https://homosaurus.org/v3/homoit0000349

Eonism
type: Concept
issued: 2019-05-14
modified: 2025-02-23
replaces: eonism
comment: Historical term used to describe people assigned male at birth who adopt feminine behaviors.
broader: https://homosaurus.org/v3/homoit0000568
broader: https://homosaurus.org/v3/homoit0000878
broader: https://homosaurus.org/v3/homoit0001006
change note: Version 3.7.0
has top concept: Gender
in scheme: v3
related: https://homosaurus.org/v3/homoit0000318
related: https://homosaurus.org/v3/homoit0000396
related: https://homosaurus.org/v3/homoit0001296
related: https://homosaurus.org/v3/homoit0001463
related: https://homosaurus.org/v3/homoit0001468
related: https://homosaurus.org/v3/homoit0001469

Eonist people
type: Concept
issued: 2019-05-14
modified: 2025-02-23
replaces: eonistPeople
comment: Historical term for people assigned male at birth who adopt feminine behaviors.
broader: https://homosaurus.org/v3/homoit0000878
change note: Version 3.7.0
has top concept: LGBTQ+ historical terms
in scheme: v3
related: https://homosaurus.org/v3/homoit0000316
related: https://homosaurus.org/v3/homoit0000395
related: https://homosaurus.org/v3/homoit0001378

Erectile dysfunction
type: Concept
issued: 2019-05-14
modified: 2025-02-23
replaces: erectileDysfunction
comment: Persistent difficulties in achieving or maintaining erections, typically for sexual activities.
alternative label: Impotence
broader: https://homosaurus.org/v3/homoit0001291
change note: Version 3.7.0
has top concept: Sexual dysfunction
in scheme: v3
related: https://homosaurus.org/v3/homoit0000399
related: https://homosaurus.org/v3/homoit0000400
related: https://homosaurus.org/v3/homoit0003058

Erection pills
type: Concept
issued: 2019-05-14
modified: 2025-02-23
replaces: erectionPills
comment: Medications used to relax muscles in the penis, increasing blood flow to allow for an erection in response to sexual stimuli.
broader: https://homosaurus.org/v3/homoit0001007
change note: Version 3.7.0
has top concept: Medical care
in scheme: v3
related: https://homosaurus.org/v3/homoit0000398
related: https://homosaurus.org/v3/homoit0000400
related: https://homosaurus.org/v3/homoit0002289

Erotic massage
type: Concept
issued: 2019-05-14
modified: 2025-02-23
replaces: eroticMassage
comment: Massage intended to enhance sexual arousal.
broader: https://homosaurus.org/v3/homoit0000998
broader: https://homosaurus.org/v3/homoit0001267
broader: https://homosaurus.org/v3/homoit0001299
change note: Version 3.7.0
has top concept: Massage
in scheme: v3
related: https://homosaurus.org/v3/homoit0000610
related: https://homosaurus.org/v3/homoit0000988
related: https://homosaurus.org/v3/homoit0003796

Escort services
type: Concept
issued: 2019-05-14
modified: 2025-02-23
replaces: escortServices
comment: Agencies that serve to connect paying clients with escorts offering services by appointment. Escort services may be less stigmatized than other forms of sex work, in part because it tends to be safer for escorts and because some escorts offer a broader range of services, including accompaniment or entertainment without the promise of sexual contact. However, the tendency to frame escorting as separate from or superior to other forms of sex work obscures the labor undertaken by escorts and perpetuates discrimination against the most marginalized and vulnerable sex workers.
broader: https://homosaurus.org/v3/homoit0001276
change note: Version 3.7.0
has top concept: Sex industry
in scheme: v3
related: https://homosaurus.org/v3/homoit0000406

Escorts
type: Concept
issued: 2019-05-14
modified: 2025-02-23
replaces: escorts
comment: Sex workers whose clients are required to make appointments for their services. Unlike sex workers who solicit clients on the street or in institutions like brothels, escorts typically advertise their services online, whether independently or through agencies. Escorting may be less stigmatized than other forms of sex work, in part because it tends to be safer for escorts and because some escorts offer a broader range of services, including accompaniment or entertainment without the promise of sexual contact. However, the tendency to frame escorting as separate from or superior to other forms of sex work obscures the labor undertaken by escorts and perpetuates discrimination against the most marginalized and vulnerable sex workers.
alternative label: Call boys
alternative label: Call girls
broader: https://homosaurus.org/v3/homoit0003758
change note: Version 3.7.0
has top concept: Sex workers
in scheme: v3
related: https://homosaurus.org/v3/homoit0000405

Estrogen
type: Concept
issued: 2019-05-14
modified: 2025-02-23
replaces: estrogen
comment: A category of steroid hormones including estrone, estradiol, estriol, and estetrol. Estrogens are commonly utilized in feminizing hormone therapy regimens. Estrogens are produced mainly in the ovaries, in addition to the adrenal glands and fat cells. Responsible for certain secondary sexual characteristics, including breast growth, thickening of the endometrium, menstrual cycle regulation, and sperm maturation.
broader: https://homosaurus.org/v3/homoit0000317
broader: https://homosaurus.org/v3/homoit0000651
change note: Version 3.7.0
has top concept: Medical care
in scheme: v3
related: https://homosaurus.org/v3/homoit0000986
related: https://homosaurus.org/v3/homoit0001642

Etiology
type: Concept
issued: 2019-05-14
modified: 2025-02-23
replaces: etiology
comment: Inquiries and speculations regarding the causes of sexual behaviors or diseases.
broader: https://homosaurus.org/v3/homoit0001365
change note: Version 3.7.0
has top concept: Theories
in scheme: v3

Ex-gay movement
type: Concept
issued: 2019-05-14
modified: 2025-02-23
replaces: ex-gayMovement
comment: People and organizations that encourage people to resist entering or pursuing same-sex relationships, to eliminate homosexual desires, to develop heterosexual desires, and/or to enter into heterosexual relationships.
broader: https://homosaurus.org/v3/homoit0001322
change note: Version 3.7.0
has top concept: Social movements
in scheme: v3
related: https://homosaurus.org/v3/homoit0000303
related: https://homosaurus.org/v3/homoit0000619

Exhibitionism
type: Concept
issued: 2019-05-14
modified: 2025-02-23
replaces: exhibitionism
comment: A kink characterized by the sexual desire to display one's body or engage in sexual activities in public.
broader: https://homosaurus.org/v3/homoit0000442
broader: https://homosaurus.org/v3/homoit0001299
change note: Version 3.7.0
has top concept: Eroticism
in scheme: v3
related: https://homosaurus.org/v3/homoit0001142
related: https://homosaurus.org/v3/homoit0001257
related: https://homosaurus.org/v3/homoit0001283

Fa'afafine
type: Concept
issued: 2019-05-14
modified: 2025-02-23
replaces: faafafine
comment: In New Zealand, Samoan people who were assigned male at birth but behave in feminine ways and may consider themselves women.
broader: https://homosaurus.org/v3/homoit0000322
broader: https://homosaurus.org/v3/homoit0002653
change note: Version 3.7.0
has top concept: Gender
in scheme: v3
related: https://homosaurus.org/v3/homoit0000414

Fa'afatama
type: Concept
issued: 2019-05-14
modified: 2025-02-23
replaces: faafatama
comment: In New Zealand, Samoan people who were assigned female at birth but behave in masculine ways and may consider themselves men.
broader: https://homosaurus.org/v3/homoit0000322
change note: Version 3.7.0
has top concept: Gender
in scheme: v3
related: https://homosaurus.org/v3/homoit0000413

Faeries
type: Concept
issued: 2019-05-14
modified: 2025-02-23
replaces: faeries
comment: Queer people who are involved with or identify with the countercultural movement seeking to redefine queer consciousness through secular spirituality. Often but not always associated with the Radical Faeries, a loosely affiliated worldwide network that formed in the 1970s.
alternative label: Radical Faeries
alternative label: Faes
broader: https://homosaurus.org/v3/homoit0000487
broader: https://homosaurus.org/v3/homoit0001295
change note: Version 3.7.0
has top concept: Subcultures
in scheme: v3
related: https://homosaurus.org/v3/homoit0000948
related: https://homosaurus.org/v3/homoit0002230

Fag hags
type: Concept
issued: 2019-05-14
modified: 2025-02-23
replaces: fagHags
comment: Slang for heterosexual women who are friends with gay men and socialize in gay spaces.
broader: https://homosaurus.org/v3/homoit0000629
change note: Version 3.7.0
has top concept: Heterosexuals
in scheme: v3
related: https://homosaurus.org/v3/homoit0000381
related: https://homosaurus.org/v3/homoit0000455
related: https://homosaurus.org/v3/homoit0000598
related: https://homosaurus.org/v3/homoit0001133
related: https://homosaurus.org/v3/homoit0001788

Fag stags
type: Concept
issued: 2019-05-14
modified: 2025-02-23
replaces: fagStags
comment: Slang for heterosexual men who enjoy the company of gay men.
broader: https://homosaurus.org/v3/homoit0000626
change note: Version 3.7.0
has top concept: Heterosexuals
in scheme: v3
related: https://homosaurus.org/v3/homoit0000455
related: https://homosaurus.org/v3/homoit0001133

Faggots
type: Concept
issued: 2019-05-14
modified: 2025-02-23
replaces: faggots
comment: Slur used chiefly in North America to refer to gay men (or, in some cases, LGBTQ+ people in general). Some gay men have reclaimed this term and use it to describe themselves.
alternative label: Fags
broader: https://homosaurus.org/v3/homoit0000878
broader: https://homosaurus.org/v3/homoit0001559
broader: https://homosaurus.org/v3/homoit0001560
change note: Version 3.7.0
has top concept: LGBTQ+ historical terms
in scheme: v3
related: https://homosaurus.org/v3/homoit0000506

Fakaleitī
type: Concept
issued: 2019-05-14
modified: 2025-02-23
replaces: fakaleiti
comment: Tongan people assigned male at birth who behave in an effeminate manner.
alternative label: Fakaleiti
broader: https://homosaurus.org/v3/homoit0000322
broader: https://homosaurus.org/v3/homoit0002653
change note: Version 3.7.0
has top concept: Gender
in scheme: v3

Fat distribution
type: Concept
issued: 2019-05-14
modified: 2025-02-23
replaces: fatDistribution
comment: Location and arrangement of fat on the body, typically increasing during puberty as a secondary sex characteristic.
broader: https://homosaurus.org/v3/homoit0001259
change note: Version 3.7.0
has top concept: Sex (Body)
in scheme: v3

Fathers
type: Concept
issued: 2019-05-14
modified: 2025-02-23
replaces: fathers
comment: People who are fathers.
broader: https://homosaurus.org/v3/homoit0000421
change note: Version 3.7.0
has top concept: Family members
in scheme: v3
narrower: https://homosaurus.org/v3/homoit0002337
narrower: https://homosaurus.org/v3/homoit0002342
narrower: https://homosaurus.org/v3/homoit0003242
related: https://homosaurus.org/v3/homoit0000866
related: https://homosaurus.org/v3/homoit0001093

Fathers of bisexual people
type: Concept
issued: 2019-05-14
modified: 2025-02-23
replaces: fathersOfBisexualPeople
comment: People who assume the role of father to bisexual people. Only use to describe individuals who identify as fathers.
broader: https://homosaurus.org/v3/homoit0002342
change note: Version 3.7.0
has top concept: Family members
in scheme: v3

Fathers of gay men
type: Concept
issued: 2019-05-14
modified: 2025-02-23
replaces: fathersOfGayMen
comment: People who assume the role of father to gay men. Only use to describe individuals who identify as fathers.
broader: https://homosaurus.org/v3/homoit0002342
change note: Version 3.7.0
has top concept: Family members
in scheme: v3

Fathers of lesbians
type: Concept
issued: 2019-05-14
modified: 2025-02-23
replaces: fathersOfLesbians
comment: People who assume the role of father to lesbians. Only use to describe individuals who identify as fathers.
broader: https://homosaurus.org/v3/homoit0002342
change note: Version 3.7.0
has top concept: Family members
in scheme: v3

Fathers of queer people
type: Concept
issued: 2019-05-14
modified: 2025-02-23
replaces: fathersOfQueerPeople
comment: People who assume the role of father to queer people. Only use to describe individuals who identify as fathers.
broader: https://homosaurus.org/v3/homoit0002342
change note: Version 3.7.0
has top concept: Family members
in scheme: v3

Fathers of transgender people
type: Concept
issued: 2019-05-14
modified: 2025-02-23
replaces: fathersOfTransgenderPeople
comment: People who assume the role of father to transgender people. Only use to describe individuals who identify as fathers.
broader: https://homosaurus.org/v3/homoit0002342
change note: Version 3.7.0
has top concept: Family members
in scheme: v3

Women's friendships
type: Concept
issued: 2019-05-14
modified: 2025-02-23
replaces: womensFriendships
comment: Connections based on affection and trust between two or more women.
alternative label: Female friendships
broader: https://homosaurus.org/v3/homoit0000455
broader: https://homosaurus.org/v3/homoit0000649
change note: Version 3.7.0
has top concept: LGBTQ+ relationships
in scheme: v3

Female impersonators
type: Concept
issued: 2019-05-14
modified: 2025-02-23
replaces: femaleImpersonators
comment: Historical term describing performers, often male-identified people, who enact female personas for the purpose of entertainment, often for straight audiences. Eclipsed by other terms (such as drag queen) in the late 20th century.
broader: https://homosaurus.org/v3/homoit0001363
change note: Version 3.7.0
has top concept: LGBTQ+ theater
in scheme: v3
related: https://homosaurus.org/v3/homoit0000375
related: https://homosaurus.org/v3/homoit0003816

Female masculinity
type: Concept
issued: 2019-05-14
modified: 2025-02-23
replaces: femaleMasculinity
comment: Form of masculinity enacted by people with a female or feminine gender identity, often by performing masculine roles, characteristics, and styles of dress.
broader: https://homosaurus.org/v3/homoit0000995
change note: Version 3.7.0
has top concept: Gender
in scheme: v3
related: https://homosaurus.org/v3/homoit0000215
related: https://homosaurus.org/v3/homoit0000231
related: https://homosaurus.org/v3/homoit0001898

Female sex workers
type: Concept
issued: 2019-05-14
modified: 2025-02-23
replaces: femaleProstitutes
comment: Women who receive money or goods in exchange for sexual services, performances, or companionship. Use to describe women working across the broad spectrum of sex work.
alternative label: Female prostitutes
alternative label: Female prostitution
alternative label: Women prostitutes
alternative label: Women prostitution
alternative label: Working girls
alternative label: Women sex work
alternative label: Female sex work
broader: https://homosaurus.org/v3/homoit0003758
change note: Version 3.7.0
has top concept: Sex workers
in scheme: v3

FtMs
type: Concept
issued: 2019-05-14
modified: 2025-02-23
replaces: FtMs
comment: FtM (female-to-male) is a mostly historical term which has been largely replaced by “trans men.” This is due in part to the term's role in the medicalization of transgender people and the assumption that trans men were previously “female” and have become “male” (typically through hormones and/or surgery).
alternative label: Females transitioning to males
alternative label: FtM transsexuals
alternative label: F2Ms
alternative label: Transsexual men
alternative label: Female-to-male
broader: https://homosaurus.org/v3/homoit0000878
broader: https://homosaurus.org/v3/homoit0001381
broader: https://homosaurus.org/v3/homoit0001643
change note: Version 3.7.0
has top concept: LGBTQ+ historical terms
in scheme: v3
related: https://homosaurus.org/v3/homoit0000114
related: https://homosaurus.org/v3/homoit0000224
related: https://homosaurus.org/v3/homoit0000457
related: https://homosaurus.org/v3/homoit0000986
related: https://homosaurus.org/v3/homoit0001027
related: https://homosaurus.org/v3/homoit0001362

Women's movement
type: Concept
issued: 2019-05-14
modified: 2025-02-23
replaces: womensMovement
comment: Social and political movement originating in the 1800s for reforms on women’s issues stemming from social, cultural, political, and economic inequality between men and women. Feminist issues include reproductive rights, women’s liberation, and equal pay. This term encompasses the women’s movement in its entirety, including different waves of feminist thought and activism.
alternative label: Feminist movement
broader: https://homosaurus.org/v3/homoit0001322
change note: Version 3.7.0
has top concept: Social movements
in scheme: v3
related: https://homosaurus.org/v3/homoit0000437
related: https://homosaurus.org/v3/homoit0000753
related: https://homosaurus.org/v3/homoit0002290

Femmes
type: Concept
issued: 2019-05-14
modified: 2025-02-23
replaces: femmes
comment: Feminine people of any gender, though this term is commonly used in lesbian communities.
broader: https://homosaurus.org/v3/homoit0000577
broader: https://homosaurus.org/v3/homoit0001295
broader: https://homosaurus.org/v3/homoit0001304
change note: Version 3.7.0
has top concept: Role behavior
in scheme: v3
related: https://homosaurus.org/v3/homoit0000230
related: https://homosaurus.org/v3/homoit0000231
related: https://homosaurus.org/v3/homoit0000384
related: https://homosaurus.org/v3/homoit0000389
related: https://homosaurus.org/v3/homoit0000568
related: https://homosaurus.org/v3/homoit0000971
related: https://homosaurus.org/v3/homoit0001327
related: https://homosaurus.org/v3/homoit0001340
related: https://homosaurus.org/v3/homoit0002043

Femminiello
type: Concept
issued: 2019-05-14
modified: 2025-02-23
replaces: femminiello
comment: In Italy, this is a Neapolitan term for homosexual men with feminine gender expression. Often considered a third gender; associated with good luck.
broader: https://homosaurus.org/v3/homoit0000322
change note: Version 3.7.0
has top concept: Gender
in scheme: v3

Kinks and fetishes
type: Concept
issued: 2019-05-14
modified: 2025-02-23
replaces: fetishism
comment: Sexual or erotic acts, objects, and situations that are considered to be unusual within a given society.
alternative label: BDSM
alternative label: Fetish
alternative label: Fetishism
alternative label: Kink
broader: https://homosaurus.org/v3/homoit0000404
broader: https://homosaurus.org/v3/homoit0001300
change note: Version 3.7.0
has top concept: Eroticism
in scheme: v3
narrower: https://homosaurus.org/v3/homoit0000036
narrower: https://homosaurus.org/v3/homoit0000086
narrower: https://homosaurus.org/v3/homoit0000211
narrower: https://homosaurus.org/v3/homoit0000293
narrower: https://homosaurus.org/v3/homoit0000305
narrower: https://homosaurus.org/v3/homoit0000412
narrower: https://homosaurus.org/v3/homoit0000597
narrower: https://homosaurus.org/v3/homoit0001246
narrower: https://homosaurus.org/v3/homoit0001257
narrower: https://homosaurus.org/v3/homoit0001634
narrower: https://homosaurus.org/v3/homoit0003047
narrower: https://homosaurus.org/v3/homoit0003051
narrower: https://homosaurus.org/v3/homoit0003053
narrower: https://homosaurus.org/v3/homoit0003054
narrower: https://homosaurus.org/v3/homoit0003057
narrower: https://homosaurus.org/v3/homoit0003059
narrower: https://homosaurus.org/v3/homoit0003065
narrower: https://homosaurus.org/v3/homoit0003067
narrower: https://homosaurus.org/v3/homoit0003068
narrower: https://homosaurus.org/v3/homoit0003073
narrower: https://homosaurus.org/v3/homoit0003074
narrower: https://homosaurus.org/v3/homoit0003077
narrower: https://homosaurus.org/v3/homoit0003078
narrower: https://homosaurus.org/v3/homoit0003085
narrower: https://homosaurus.org/v3/homoit0003098
narrower: https://homosaurus.org/v3/homoit0003099
narrower: https://homosaurus.org/v3/homoit0003102
narrower: https://homosaurus.org/v3/homoit0003109
narrower: https://homosaurus.org/v3/homoit0003116
narrower: https://homosaurus.org/v3/homoit0003122
narrower: https://homosaurus.org/v3/homoit0003124
narrower: https://homosaurus.org/v3/homoit0003125
narrower: https://homosaurus.org/v3/homoit0003138
narrower: https://homosaurus.org/v3/homoit0003139
narrower: https://homosaurus.org/v3/homoit0003147
narrower: https://homosaurus.org/v3/homoit0001814
narrower: https://homosaurus.org/v3/homoit0003709
narrower: https://homosaurus.org/v3/homoit0003849
narrower: https://homosaurus.org/v3/homoit0003850
narrower: https://homosaurus.org/v3/homoit0003851
related: https://homosaurus.org/v3/homoit0000022
related: https://homosaurus.org/v3/homoit0000075
related: https://homosaurus.org/v3/homoit0000103
related: https://homosaurus.org/v3/homoit0000217
related: https://homosaurus.org/v3/homoit0000302
related: https://homosaurus.org/v3/homoit0000609
related: https://homosaurus.org/v3/homoit0000705
related: https://homosaurus.org/v3/homoit0001267
related: https://homosaurus.org/v3/homoit0001295
related: https://homosaurus.org/v3/homoit0001297
related: https://homosaurus.org/v3/homoit0001299
related: https://homosaurus.org/v3/homoit0003052
related: https://homosaurus.org/v3/homoit0003082
related: https://homosaurus.org/v3/homoit0003084
related: https://homosaurus.org/v3/homoit0003108
related: https://homosaurus.org/v3/homoit0003113
related: https://homosaurus.org/v3/homoit0003129
related: https://homosaurus.org/v3/homoit0003140

LGBTQ+ fiction
type: Concept
issued: 2019-05-14
modified: 2025-02-23
replaces: fictionLGBTQ
comment: Works of fiction featuring LGBTQ+ characters or themes.
alternative label: Fiction (LGBTQ)
broader: https://homosaurus.org/v3/homoit0000972
change note: Version 3.7.0
has top concept: Subcultures
in scheme: v3
narrower: https://homosaurus.org/v3/homoit0000151
narrower: https://homosaurus.org/v3/homoit0000493
narrower: https://homosaurus.org/v3/homoit0000742
narrower: https://homosaurus.org/v3/homoit0000841
narrower: https://homosaurus.org/v3/homoit0000852
narrower: https://homosaurus.org/v3/homoit0000859
narrower: https://homosaurus.org/v3/homoit0000865
narrower: https://homosaurus.org/v3/homoit0000874
narrower: https://homosaurus.org/v3/homoit0000934
narrower: https://homosaurus.org/v3/homoit0001177
narrower: https://homosaurus.org/v3/homoit0001414
narrower: https://homosaurus.org/v3/homoit0001580
narrower: https://homosaurus.org/v3/homoit0001586
narrower: https://homosaurus.org/v3/homoit0001608
narrower: https://homosaurus.org/v3/homoit0001752
narrower: https://homosaurus.org/v3/homoit0001753
narrower: https://homosaurus.org/v3/homoit0001754
narrower: https://homosaurus.org/v3/homoit0002407
narrower: https://homosaurus.org/v3/homoit0002506
narrower: https://homosaurus.org/v3/homoit0002535
narrower: https://homosaurus.org/v3/homoit0002565
related: https://homosaurus.org/v3/homoit0000249
related: https://homosaurus.org/v3/homoit0001723
related: https://homosaurus.org/v3/homoit0001751
related: https://homosaurus.org/v3/homoit0002153
related: https://homosaurus.org/v3/homoit0002159
related: https://homosaurus.org/v3/homoit0002179
related: https://homosaurus.org/v3/homoit0002180
related: https://homosaurus.org/v3/homoit0002188
related: https://homosaurus.org/v3/homoit0002632
related: https://homosaurus.org/v3/homoit0002636
related: https://homosaurus.org/v3/homoit0002637
related: https://homosaurus.org/v3/homoit0002639
related: https://homosaurus.org/v3/homoit0002640
related: https://homosaurus.org/v3/homoit0002641
related: https://homosaurus.org/v3/homoit0002646
related: https://homosaurus.org/v3/homoit0002647
related: https://homosaurus.org/v3/homoit0002649
related: https://homosaurus.org/v3/homoit0002650
related: https://homosaurus.org/v3/homoit0002651

First-wave feminism
type: Concept
issued: 2019-05-14
modified: 2025-02-23
replaces: firstWaveFeminism
comment: Period of women's rights activism in the 19th and early 20th centuries that was primarily focused on legal rights such as women's right to vote.
alternative label: First wave feminism
broader: https://homosaurus.org/v3/homoit0000437
change note: Version 3.7.0
has top concept: Feminism
in scheme: v3
related: https://homosaurus.org/v3/homoit0003172

Fisting
type: Concept
issued: 2019-05-14
modified: 2025-02-23
replaces: fisting
comment: The insertion of a hand (or fist) into the vagina or anus.
alternative label: Fist fucking
alternative label: Handballing
alternative label: Manual penetration
broader: https://homosaurus.org/v3/homoit0001299
change note: Version 3.7.0
has top concept: Sexual practices
in scheme: v3
narrower: https://homosaurus.org/v3/homoit0000042
narrower: https://homosaurus.org/v3/homoit0001486
related: https://homosaurus.org/v3/homoit0000446
related: https://homosaurus.org/v3/homoit0003107

Fingering
type: Concept
issued: 2019-05-14
modified: 2025-02-23
replaces: fingering
comment: Sexual act involving the use of and insertion of the fingers to stimulate the vagina and/or anus.
alternative label: Finger banging
alternative label: Finger fucking
broader: https://homosaurus.org/v3/homoit0000988
broader: https://homosaurus.org/v3/homoit0001487
change note: Version 3.7.0
has top concept: Sex (Act)
in scheme: v3
related: https://homosaurus.org/v3/homoit0000445

Flagellation
type: Concept
issued: 2019-05-14
modified: 2025-02-23
replaces: flagellation
comment: Consensual flogging of a person.
broader: https://homosaurus.org/v3/homoit0003048
broader: https://homosaurus.org/v3/homoit0003053
change note: Version 3.7.0
has top concept: Eroticism
in scheme: v3
related: https://homosaurus.org/v3/homoit0001503

Floggers
type: Concept
issued: 2019-05-14
modified: 2025-02-23
replaces: floggers
comment: Lightweight whips or scourges with multiple lashes that are used on oneself or a partner to increase sexual arousal.
broader: https://homosaurus.org/v3/homoit0001266
change note: Version 3.7.0
has top concept: Sex accessories
in scheme: v3

Forced castration
type: Concept
issued: 2019-05-14
modified: 2025-02-23
replaces: forcedCastration
comment: Forced or coerced removal of the testes or use of the testes, typically through surgical or chemical means, enacted by legal authorities or as a hate crime.
broader: https://homosaurus.org/v3/homoit0000056
broader: https://homosaurus.org/v3/homoit0000241
change note: Version 3.7.0
has top concept: Anti-LGBTQ+ violence
in scheme: v3

Foster parents
type: Concept
issued: 2019-05-14
modified: 2025-02-23
replaces: fosterParents
comment: A person or family unit who takes in and cares for a child or children on behalf of the state.
broader: https://homosaurus.org/v3/homoit0002372
change note: Version 3.7.0
has top concept: Family members
in scheme: v3
related: https://homosaurus.org/v3/homoit0000451

Freedom rings
type: Concept
issued: 2019-05-14
modified: 2025-02-23
replaces: freedomRings
comment: A symbol designed by David Spada that consists of six aluminum rings in colors based on the rainbow flag; typically worn as jewelry.
broader: https://homosaurus.org/v3/homoit0000954
change note: Version 3.7.0
has top concept: LGBTQ+ symbols
in scheme: v3

Fricatrices
type: Concept
issued: 2019-05-14
modified: 2025-02-23
replaces: fricatrices
comment: A historical term for lesbians. Only use in a historical context.
broader: https://homosaurus.org/v3/homoit0000878
change note: Version 3.7.0
has top concept: LGBTQ+ historical terms
in scheme: v3
related: https://homosaurus.org/v3/homoit0000556

Friendships
type: Concept
issued: 2019-05-14
modified: 2025-02-23
replaces: friendships
comment: Connections based on affection and trust between two or more people.
broader: https://homosaurus.org/v3/homoit0001237
change note: Version 3.7.0
has top concept: LGBTQ+ relationships
in scheme: v3
narrower: https://homosaurus.org/v3/homoit0000221
narrower: https://homosaurus.org/v3/homoit0000429
narrower: https://homosaurus.org/v3/homoit0000591
narrower: https://homosaurus.org/v3/homoit0000982
narrower: https://homosaurus.org/v3/homoit0001245
related: https://homosaurus.org/v3/homoit0000381
related: https://homosaurus.org/v3/homoit0000416
related: https://homosaurus.org/v3/homoit0000417
related: https://homosaurus.org/v3/homoit0000598
related: https://homosaurus.org/v3/homoit0000649
related: https://homosaurus.org/v3/homoit0003505

Frottage
type: Concept
issued: 2019-05-14
modified: 2025-02-23
replaces: frottage
comment: Non-penetrative sex act in which individuals rub parts of their body (usually the genitals) against another person's body. Not to be confused with "frotteurism" (nonconsensual frottage), though both are often abbreviated as "frot."
broader: https://homosaurus.org/v3/homoit0001267
broader: https://homosaurus.org/v3/homoit0001299
change note: Version 3.7.0
has top concept: Sex (Act)
in scheme: v3
narrower: https://homosaurus.org/v3/homoit0001667

FtXs
type: Concept
issued: 2019-05-14
modified: 2025-02-23
replaces: ftxs
comment: People who transition from female to unknown or not female.
broader: https://homosaurus.org/v3/homoit0001378
change note: Version 3.7.0
has top concept: LGBTQ+ people
in scheme: v3
related: https://homosaurus.org/v3/homoit0000436
related: https://homosaurus.org/v3/homoit0000986
related: https://homosaurus.org/v3/homoit0001027
related: https://homosaurus.org/v3/homoit0001518

Fucking
type: Concept
issued: 2019-05-14
modified: 2025-02-23
replaces: fucking
comment: Slang term (typically regarded as vulgar) for the sexual act of penetrating another individual’s mouth, anus, or vagina with a penis or dildo. May also be used to describe sex acts in general (e.g., "They were fucking.").
broader: https://homosaurus.org/v3/homoit0000280
broader: https://homosaurus.org/v3/homoit0001109
broader: https://homosaurus.org/v3/homoit0001267
broader: https://homosaurus.org/v3/homoit0001487
change note: Version 3.7.0
has top concept: Sex (Act)
in scheme: v3
narrower: https://homosaurus.org/v3/homoit0000076
related: https://homosaurus.org/v3/homoit0000588
related: https://homosaurus.org/v3/homoit0000662
related: https://homosaurus.org/v3/homoit0003107

G-spot
type: Concept
issued: 2019-05-14
modified: 2025-02-23
replaces: g-spot
comment: Commonly characterized as an erogenous area of the front anterior wall of the vagina that, when stimulated, can lead to sexual arousal, orgasms, and/or ejaculation.
broader: https://homosaurus.org/v3/homoit0000282
broader: https://homosaurus.org/v3/homoit0001488
change note: Version 3.7.0
has top concept: Erogenous body parts
in scheme: v3
related: https://homosaurus.org/v3/homoit0001062

Galli
type: Concept
issued: 2019-05-14
modified: 2025-02-23
replaces: galli
comment: A term originating in Ancient Rome that describes eunuch priestesses who were voluntarily castrated as part of an annual celebration.
broader: https://homosaurus.org/v3/homoit0000322
change note: Version 3.7.0
has top concept: Gender
in scheme: v3

Gay activism
type: Concept
issued: 2019-05-14
modified: 2025-02-23
replaces: gayActivism
comment: Direct action and organizing to achieve political or social change and acceptance for gay men.
broader: https://homosaurus.org/v3/homoit0000006
change note: Version 3.7.0
has top concept: LGBTQ+ activism
in scheme: v3
related: https://homosaurus.org/v3/homoit0000518

African American gay men
type: Concept
issued: 2019-05-14
modified: 2025-02-23
replaces: gayAfricanAmericans
comment: Gay men of African descent born in the United States or gay men born in African countries who live in or have a strong connection to the United States. Use for individuals who self-identity as African American. Follow the individual’s preference for African American or Black whenever possible.
alternative label: Gay African American people
alternative label: Gay African Americans
broader: https://homosaurus.org/v3/homoit0000015
change note: Version 3.7.0
has top concept: LGBTQ+ people
in scheme: v3
related: https://homosaurus.org/v3/homoit0000365

Afro-Canadian gay men
type: Concept
issued: 2019-05-14
modified: 2025-02-23
replaces: gayAfroCanadians
comment: Gay men of African descent born in Canada or gay men born in African countries who live in or have a strong connection to Canada. Use for individuals who self-identify as Afro-Canadian.
alternative label: Gay Afro-Canadian people
alternative label: Gay Afro-Canadians
broader: https://homosaurus.org/v3/homoit0000016
change note: Version 3.7.0
has top concept: LGBTQ+ people
in scheme: v3

Afro-Caribbean gay men
type: Concept
issued: 2019-05-14
modified: 2025-02-23
replaces: gayAfroCaribbeans
comment: Gay men of African descent born in the Caribbean or gay men born in African countries who live in or have a strong connection to the Caribbean. Only use for individuals who self-identify as Afro-Caribbean.
alternative label: Gay Afro-Caribbean men
alternative label: Gay Afro-Caribbeans
broader: https://homosaurus.org/v3/homoit0000017
change note: Version 3.7.0
has top concept: LGBTQ+ people
in scheme: v3

Afro-European gay men
type: Concept
issued: 2019-05-14
modified: 2025-02-23
replaces: gayAfroEuropeans
comment: Gay men of African descent born in European countries or gay men born in African countries who live in or have a strong connection to Europe. Only use for individuals who self-identify as Afro-European.
alternative label: Gay Afro-European men
alternative label: Gay Afro-Europeans
broader: https://homosaurus.org/v3/homoit0000018
change note: Version 3.7.0
has top concept: LGBTQ+ people
in scheme: v3

Afro-Latin American gay men
type: Concept
issued: 2019-05-14
modified: 2025-02-23
replaces: gayAfroLatinAmericans
comment: Gay men of African descent born in Latin American countries or gay men born in African countries who live in or have a strong connection to Latin America. Only use for individuals who self-identify as Afro-Latin American.
alternative label: Gay Afro-Latin American men
alternative label: Gay Afro-Latin Americans
broader: https://homosaurus.org/v3/homoit0000019
change note: Version 3.7.0
has top concept: LGBTQ+ people
in scheme: v3

Gay archives
type: Concept
issued: 2019-05-14
modified: 2025-02-23
replaces: gayArchives
comment: Collections of records and materials relating to gay men or gay communities; can include a variety of organizations and institutions from community to government archives.
broader: https://homosaurus.org/v3/homoit0000066
change note: Version 3.7.0
has top concept: LGBTQ+ cultural heritage institutions
in scheme: v3

Gay artists
type: Concept
issued: 2019-05-14
modified: 2025-02-23
replaces: gayArtists
comment: Gay men who practice any of various creative arts.
broader: https://homosaurus.org/v3/homoit0000070
change note: Version 3.7.0
has top concept: LGBTQ+ people
in scheme: v3

Asian American gay men
type: Concept
issued: 2019-05-14
modified: 2025-02-23
replaces: gayAsianAmericans
comment: Gay men of Asian heritage or descent born in the United States or born in Asian countries who live in or have a strong connection to the United States. Only use for individuals who self-identify as Asian American.
alternative label: Gay Asian American people
alternative label: Gay Asian Americans
broader: https://homosaurus.org/v3/homoit0000073
broader: https://homosaurus.org/v3/homoit0000472
change note: Version 3.7.0
has top concept: LGBTQ+ people
in scheme: v3

Asian gay men
type: Concept
issued: 2019-05-14
modified: 2025-02-23
replaces: gayAsians
comment: Gay men of Asian heritage or descent, living in Asia or part of the Asian diaspora. Only use for people who self-identify as Asian.
alternative label: Gaysians
alternative label: Gay Asians
broader: https://homosaurus.org/v3/homoit0000074
change note: Version 3.7.0
has top concept: LGBTQ+ people
in scheme: v3
narrower: https://homosaurus.org/v3/homoit0000471

Gay atheists
type: Concept
issued: 2019-05-14
modified: 2025-02-23
replaces: gayAtheists
comment: Gay men who are atheists.
broader: https://homosaurus.org/v3/homoit0000082
change note: Version 3.7.0
has top concept: LGBTQ+ people
in scheme: v3

Gay bars
type: Concept
issued: 2019-05-14
modified: 2025-02-23
replaces: gayBars
comment: Drinking establishments that primarily cater to gay men.
broader: https://homosaurus.org/v3/homoit0000100
change note: Version 3.7.0
has top concept: LGBTQ+ meeting places
in scheme: v3
narrower: https://homosaurus.org/v3/homoit0003718
related: https://homosaurus.org/v3/homoit0000087
related: https://homosaurus.org/v3/homoit0000485
related: https://homosaurus.org/v3/homoit0000925
related: https://homosaurus.org/v3/homoit0001553

Gay saunas
type: Concept
issued: 2019-05-14
modified: 2025-02-23
replaces: gaySaunas
comment: Commercial saunas or bathhouses intended for gay men to meet and engage in sexual activities.
alternative label: Gay bathhouses
alternative label: Gay baths
broader: https://homosaurus.org/v3/homoit0000011
broader: https://homosaurus.org/v3/homoit0000909
broader: https://homosaurus.org/v3/homoit0000974
change note: Version 3.7.0
has top concept: Sex industry
in scheme: v3
narrower: https://homosaurus.org/v3/homoit0000595
related: https://homosaurus.org/v3/homoit0001142
related: https://homosaurus.org/v3/homoit0001270
related: https://homosaurus.org/v3/homoit0002382
related: https://homosaurus.org/v3/homoit0003079

Gay beaches
type: Concept
issued: 2019-05-14
modified: 2025-02-23
replaces: gayBeaches
comment: Beaches set aside for use by gay men or beaches known to be frequented by gay men.
broader: https://homosaurus.org/v3/homoit0000104
change note: Version 3.7.0
has top concept: LGBTQ+ meeting places
in scheme: v3

Black gay men
type: Concept
issued: 2019-05-14
modified: 2025-02-23
replaces: gayBlackPeople
comment: Black men who are gay. Use only for individuals who self-identity as Black. Follow the individual’s preference for African American or Black whenever possible.
alternative label: Gay Black men
broader: https://homosaurus.org/v3/homoit0000208
change note: Version 3.7.0
has top concept: LGBTQ+ people
in scheme: v3

Gay bookshops
type: Concept
issued: 2019-05-14
modified: 2025-02-23
replaces: gayBookshops
comment: Bookshops that sell materials intended for use by gay men or addressing topics related to gay men.
broader: https://homosaurus.org/v3/homoit0000216
change note: Version 3.7.0
has top concept: LGBTQ+ bookshops
in scheme: v3

Gay boys
type: Concept
issued: 2019-05-14
modified: 2025-02-23
replaces: gayBoys
comment: Boys (typically children younger than 18) who are gay.
broader: https://homosaurus.org/v3/homoit0000220
broader: https://homosaurus.org/v3/homoit0000544
change note: Version 3.7.0
has top concept: Family members
in scheme: v3
related: https://homosaurus.org/v3/homoit0000481
related: https://homosaurus.org/v3/homoit0000496
related: https://homosaurus.org/v3/homoit0000506
related: https://homosaurus.org/v3/homoit0002363

Gay Buddhists
type: Concept
issued: 2019-05-14
modified: 2025-02-23
replaces: gayBuddhists
comment: Gay men who are Buddhist.
broader: https://homosaurus.org/v3/homoit0000225
change note: Version 3.7.0
has top concept: LGBTQ+ religious people
in scheme: v3

Gay characters
type: Concept
issued: 2019-05-14
modified: 2025-02-23
replaces: gayCharacters
comment: Characters in creative works who are gay men.
broader: https://homosaurus.org/v3/homoit0000249
change note: Version 3.7.0
has top concept: LGBTQ+ characters
in scheme: v3
related: https://homosaurus.org/v3/homoit0000479
related: https://homosaurus.org/v3/homoit0000506
related: https://homosaurus.org/v3/homoit0000544

Gay choruses
type: Concept
issued: 2019-05-14
modified: 2025-02-23
replaces: gayChoruses
comment: Organized groups of gay men who sing together.
alternative label: Gay choirs
broader: https://homosaurus.org/v3/homoit0000833
change note: Version 3.7.0
has top concept: LGBTQ+ choruses
in scheme: v3
related: https://homosaurus.org/v3/homoit0000730

Gay Christians
type: Concept
issued: 2019-05-14
modified: 2025-02-23
replaces: gayChristians
comment: Gay men who are Christian.
broader: https://homosaurus.org/v3/homoit0000265
change note: Version 3.7.0
has top concept: LGBTQ+ religious people
in scheme: v3

Gay clergy
type: Concept
issued: 2019-05-14
modified: 2025-02-23
replaces: gayClergy
comment: Gay men who are ordained for religious duties, particularly in the Christian Church.
alternative label: Gay pastors
broader: https://homosaurus.org/v3/homoit0001624
change note: Version 3.7.0
has top concept: LGBTQ+ clergy
in scheme: v3
narrower: https://homosaurus.org/v3/homoit0000524
related: https://homosaurus.org/v3/homoit0000142
related: https://homosaurus.org/v3/homoit0000244
related: https://homosaurus.org/v3/homoit0000732
related: https://homosaurus.org/v3/homoit0001169
related: https://homosaurus.org/v3/homoit0001402

Gay community
type: Concept
issued: 2019-05-14
modified: 2025-02-23
replaces: gayCommunity
comment: Groups of people who share the experience of being gay men.
broader: https://homosaurus.org/v3/homoit0000297
change note: Version 3.7.0
has top concept: LGBTQ+ communities
in scheme: v3
related: https://homosaurus.org/v3/homoit0000474
related: https://homosaurus.org/v3/homoit0000486
related: https://homosaurus.org/v3/homoit0000506
related: https://homosaurus.org/v3/homoit0000594
related: https://homosaurus.org/v3/homoit0000804
related: https://homosaurus.org/v3/homoit0000805
related: https://homosaurus.org/v3/homoit0000806
related: https://homosaurus.org/v3/homoit0000807
related: https://homosaurus.org/v3/homoit0000882
related: https://homosaurus.org/v3/homoit0001789

Gay community centers
type: Concept
issued: 2019-05-14
modified: 2025-02-23
replaces: gayCommunityCentres
comment: Spaces in which people from gay communities meet for social, education, recreational, or organizing activities.
broader: https://homosaurus.org/v3/homoit0000298
change note: Version 3.7.0
has top concept: LGBTQ+ centers
in scheme: v3
preferred label: Gay community centres
related: https://homosaurus.org/v3/homoit0000485
related: https://homosaurus.org/v3/homoit0000510

Gay culture
type: Concept
issued: 2019-05-14
modified: 2025-02-23
replaces: gayCulture
comment: Use to describe cultural experiences shared by members of gay communities or products of gay culture (e.g., art and media created by and for gay men, activism focused on gay issues, slang commonly used in gay communities, etc.).
broader: https://homosaurus.org/v3/homoit0001831
change note: Version 3.7.0
has top concept: Subcultures
in scheme: v3
narrower: https://homosaurus.org/v3/homoit0000105
narrower: https://homosaurus.org/v3/homoit0000267
narrower: https://homosaurus.org/v3/homoit0000321
narrower: https://homosaurus.org/v3/homoit0000415
narrower: https://homosaurus.org/v3/homoit0000535
narrower: https://homosaurus.org/v3/homoit0001063
narrower: https://homosaurus.org/v3/homoit0001145
narrower: https://homosaurus.org/v3/homoit0001148
narrower: https://homosaurus.org/v3/homoit0001479
narrower: https://homosaurus.org/v3/homoit0001508
narrower: https://homosaurus.org/v3/homoit0001788
related: https://homosaurus.org/v3/homoit0000238
related: https://homosaurus.org/v3/homoit0001295
related: https://homosaurus.org/v3/homoit0001654
related: https://homosaurus.org/v3/homoit0001832
related: https://homosaurus.org/v3/homoit0001833
related: https://homosaurus.org/v3/homoit0002230

Gay discos
type: Concept
issued: 2019-05-14
modified: 2025-02-23
replaces: gayDiscos
comment: Nightlife entertainment venues or clubs where people dance to recorded music; use in reference to discos that primarily cater to gay men.
alternative label: Gay discotheques
alternative label: Gay night clubs
alternative label: Gay nightclubs
broader: https://homosaurus.org/v3/homoit0000909
change note: Version 3.7.0
has top concept: LGBTQ+ night life
in scheme: v3
related: https://homosaurus.org/v3/homoit0000100

Gay drama
type: Concept
issued: 2019-05-14
modified: 2025-02-23
replaces: gayDrama
comment: Works of fiction written to be performed; use in reference to dramatic works focusing on gay characters or themes.
broader: https://homosaurus.org/v3/homoit0000376
change note: Version 3.7.0
has top concept: Subcultures
in scheme: v3
related: https://homosaurus.org/v3/homoit0001725

Gay information centers
type: Concept
issued: 2019-05-14
modified: 2025-02-23
replaces: gayInformationCentres
comment: Institutions providing education, support, and information about gay men and gay communities to gay men.
broader: https://homosaurus.org/v3/homoit0000660
change note: Version 3.7.0
has top concept: LGBTQ+ centers
in scheme: v3
preferred label: Gay information centres
related: https://homosaurus.org/v3/homoit0000510

Gay families
type: Concept
issued: 2019-05-14
modified: 2025-02-23
replaces: gayFamilies
comment: Families, whether biological, adoptive, or chosen, in which one or more individuals identify as gay men.
broader: https://homosaurus.org/v3/homoit0000420
change note: Version 3.7.0
has top concept: LGBTQ+ families
in scheme: v3
related: https://homosaurus.org/v3/homoit0000258
related: https://homosaurus.org/v3/homoit0000492

Gay parents
type: Concept
issued: 2019-05-14
modified: 2025-02-23
replaces: gayParents
comment: Gay men who are parents.
alternative label: Gay fathers
broader: https://homosaurus.org/v3/homoit0000506
broader: https://homosaurus.org/v3/homoit0001075
change note: Version 3.7.0
has top concept: LGBTQ+ people
in scheme: v3
related: https://homosaurus.org/v3/homoit0000258
related: https://homosaurus.org/v3/homoit0000491

Gay fiction
type: Concept
issued: 2019-05-14
modified: 2025-02-23
replaces: gayFiction
comment: Written works describing imagined events or people; use in reference to fictional works focusing on gay characters or themes.
broader: https://homosaurus.org/v3/homoit0000443
change note: Version 3.7.0
has top concept: Subcultures
in scheme: v3
related: https://homosaurus.org/v3/homoit0001725
related: https://homosaurus.org/v3/homoit0001752
related: https://homosaurus.org/v3/homoit0001753
related: https://homosaurus.org/v3/homoit0001754
related: https://homosaurus.org/v3/homoit0002170
related: https://homosaurus.org/v3/homoit0002217

Gay for pay
type: Concept
issued: 2019-05-14
modified: 2025-02-23
replaces: gayForPay
comment: Sex workers who identify as heterosexual but are paid to peform as if they are gay or lesbian.
comment: Sex workers, including porn stars, who identify as heterosexual but are paid to peform as if they are homosexual.
broader: https://homosaurus.org/v3/homoit0001276
change note: Version 3.7.0
has top concept: Sex industry
in scheme: v3
related: https://homosaurus.org/v3/homoit0001127
related: https://homosaurus.org/v3/homoit0003758

Gay identity
type: Concept
issued: 2019-05-14
modified: 2025-02-23
replaces: gayIdentity
comment: Term used to describe the sexual identity of men and mascs who are sexually and/or romantically attracted to other men and mascs. Do not use as a broader term for LGBTQ+ people.
broader: https://homosaurus.org/v3/homoit0001295
change note: Version 3.7.0
has top concept: Sexual identity
in scheme: v3
related: https://homosaurus.org/v3/homoit0000479
related: https://homosaurus.org/v3/homoit0000506
related: https://homosaurus.org/v3/homoit0000544

Jewish gay men
type: Concept
issued: 2019-05-14
modified: 2025-02-23
replaces: gayJews
comment: Gay men who are Jewish.
alternative label: Gay Jews
alternative label: Jewish gay people
alternative label: Jewish gays
broader: https://homosaurus.org/v3/homoit0000682
change note: Version 3.7.0
has top concept: LGBTQ+ people
in scheme: v3

Latino/a/x gay men
type: Concept
issued: 2019-05-14
modified: 2025-02-23
replaces: gayLatinos
comment: Latin American men who are gay; only use to describe individuals who self-identify as Latino, Latina, or Latinx. Do not conflate with Chicano/a/x or Hispanic.
alternative label: Gay Latine
alternative label: Gay Latinos
alternative label: Gay Latinx
alternative label: Latine gay men
alternative label: Latino gay men
alternative label: Latinx gay men
broader: https://homosaurus.org/v3/homoit0000253
change note: Version 3.7.0
has top concept: LGBTQ+ people
in scheme: v3

Lesbian-gay relations
type: Concept
issued: 2019-05-14
modified: 2025-02-23
replaces: lesbian-gayRelations
comment: Connections between individuals and communities of lesbians and gay men, including historic and ongoing solidarity, advocacy, and activism.
alternative label: Gay-lesbian relations
broader: https://homosaurus.org/v3/homoit0000575
change note: Version 3.7.0
has top concept: LGBTQ+ social processes
in scheme: v3
related: https://homosaurus.org/v3/homoit0000506
related: https://homosaurus.org/v3/homoit0000556

Gay liberation
type: Concept
issued: 2019-05-14
modified: 2025-02-23
replaces: gayLiberation
comment: Movement of the late 1960s and early to mid 1970s that urged lesbians and gay men to “come out" and publicly reveal their sexuality to family, friends, and colleagues as a form of activism and as a means of countering shame with pride.
alternative label: Gay liberation movement
broader: https://homosaurus.org/v3/homoit0000947
change note: Version 3.7.0
has top concept: LGBTQ+ social processes
in scheme: v3
related: https://homosaurus.org/v3/homoit0000510
related: https://homosaurus.org/v3/homoit0000748
related: https://homosaurus.org/v3/homoit0000753
related: https://homosaurus.org/v3/homoit0000857
related: https://homosaurus.org/v3/homoit0001341

Gay libraries
type: Concept
issued: 2019-05-14
modified: 2025-02-23
replaces: gayLibraries
comment: Libraries that hold materials primarily pertaining to gay men or intended for use by gay men.
broader: https://homosaurus.org/v3/homoit0000968
change note: Version 3.7.0
has top concept: LGBTQ+ cultural heritage institutions
in scheme: v3

Gay literature
type: Concept
issued: 2019-05-14
modified: 2025-02-23
replaces: gayLiterature
comment: Written literary works about gay men, gay characters, or gay themes.
broader: https://homosaurus.org/v3/homoit0000972
change note: Version 3.7.0
has top concept: Subcultures
in scheme: v3
related: https://homosaurus.org/v3/homoit0001725

Gay couples
type: Concept
issued: 2019-05-14
modified: 2025-02-23
replaces: gayMaleCouples
comment: Partnerships in which both people are gay men.
broader: https://homosaurus.org/v3/homoit0000310
change note: Version 3.7.0
has top concept: LGBTQ+ relationships
in scheme: v3

Same-sex marriage
type: Concept
issued: 2019-05-14
modified: 2025-02-23
replaces: same-sexMarriage
comment: Legal union between two people of the same sex who are in a partnership. In the United States, same-sex marriage differs from civil unions in that the former is recognized at the federal level, whereas the latter is only recognized at the state level and may not be recognized by other states.
alternative label: Gay marriage
alternative label: Lesbian marriage
broader: https://homosaurus.org/v3/homoit0000990
change note: Version 3.7.0
has top concept: Living arrangements
in scheme: v3
related: https://homosaurus.org/v3/homoit0000844
related: https://homosaurus.org/v3/homoit0001514

Gay dominants
type: Concept
issued: 2019-05-14
modified: 2025-02-23
replaces: gayMasters
comment: Gay men who are part of the BDSM scene and assume the dominant role in sexual relationships with a master/slave dynamic.
broader: https://homosaurus.org/v3/homoit0000999
change note: Version 3.7.0
has top concept: Sexual identity
in scheme: v3

Gay men
type: Concept
issued: 2019-05-14
modified: 2025-02-23
replaces: gayMen
comment: Men who self-identify as gay and belong to gay communities. Predominately used to describe men who are exclusively or primarily romantically and/or sexually attracted to other men. While "gay" is often used as an identifier by people of all genders, this term specifically refers to gay men.
alternative label: Gays
broader: https://homosaurus.org/v3/homoit0000915
broader: https://homosaurus.org/v3/homoit0001008
broader: https://homosaurus.org/v3/homoit0001297
change note: Version 3.7.0
has top concept: LGBTQ+ people
in scheme: v3
narrower: https://homosaurus.org/v3/homoit0000089
narrower: https://homosaurus.org/v3/homoit0000105
narrower: https://homosaurus.org/v3/homoit0000284
narrower: https://homosaurus.org/v3/homoit0000286
narrower: https://homosaurus.org/v3/homoit0000492
narrower: https://homosaurus.org/v3/homoit0000978
narrower: https://homosaurus.org/v3/homoit0001055
narrower: https://homosaurus.org/v3/homoit0001063
narrower: https://homosaurus.org/v3/homoit0001145
narrower: https://homosaurus.org/v3/homoit0001148
narrower: https://homosaurus.org/v3/homoit0001479
narrower: https://homosaurus.org/v3/homoit0001508
narrower: https://homosaurus.org/v3/homoit0003037
related: https://homosaurus.org/v3/homoit0000418
related: https://homosaurus.org/v3/homoit0000479
related: https://homosaurus.org/v3/homoit0000481
related: https://homosaurus.org/v3/homoit0000485
related: https://homosaurus.org/v3/homoit0000496
related: https://homosaurus.org/v3/homoit0000499
related: https://homosaurus.org/v3/homoit0000509
related: https://homosaurus.org/v3/homoit0000544
related: https://homosaurus.org/v3/homoit0000646
related: https://homosaurus.org/v3/homoit0000647
related: https://homosaurus.org/v3/homoit0001009
related: https://homosaurus.org/v3/homoit0001104
related: https://homosaurus.org/v3/homoit0001185
related: https://homosaurus.org/v3/homoit0001258
related: https://homosaurus.org/v3/homoit0002170

Gay men in the military
type: Concept
issued: 2019-05-14
modified: 2025-02-23
replaces: gayMenInTheMilitary
comment: Gay men serving in state and national armed forces.
broader: https://homosaurus.org/v3/homoit0001100
change note: Version 3.7.0
has top concept: Legal status
in scheme: v3

Gay men of color
type: Concept
issued: 2019-05-14
modified: 2025-02-23
replaces: gayMenOfColour
comment: Primarily used in the United States, this term refers to gay men who are not white and who identify as people of color.
broader: https://homosaurus.org/v3/homoit0001101
change note: Version 3.7.0
has top concept: LGBTQ+ people
in scheme: v3
preferred label: Gay men of colour

Parents of gay men
type: Concept
issued: 2019-05-14
modified: 2025-02-23
replaces: parentsOfGayMen
comment: People who act as parents to one or more gay man. For parents who are themselves gay, use the term "Gay parents."
alternative label: Gay men's parents
broader: https://homosaurus.org/v3/homoit0002224
change note: Version 3.7.0
has top concept: Family members
in scheme: v3
related: https://homosaurus.org/v3/homoit0000506

Gay movement
type: Concept
issued: 2019-05-14
modified: 2025-02-23
replaces: gayMovement
comment: Umbrella term for activism focused on the rights of gay men and issues faced by gay communities.
alternative label: Gay organisations
alternative label: Gay organizations
broader: https://homosaurus.org/v3/homoit0001026
change note: Version 3.7.0
has top concept: Social movements
in scheme: v3
narrower: https://homosaurus.org/v3/homoit0000549
related: https://homosaurus.org/v3/homoit0000486
related: https://homosaurus.org/v3/homoit0000490
related: https://homosaurus.org/v3/homoit0000500
related: https://homosaurus.org/v3/homoit0000521
related: https://homosaurus.org/v3/homoit0000528
related: https://homosaurus.org/v3/homoit0000545

Gay museums
type: Concept
issued: 2019-05-14
modified: 2025-02-23
replaces: gayMuseums
comment: Institutions dedicated to the storage, exhibition, conservation, and preservation of materials relating to gay men or gay history.
broader: https://homosaurus.org/v3/homoit0001030
change note: Version 3.7.0
has top concept: LGBTQ+ cultural heritage institutions
in scheme: v3

Gay Muslims
type: Concept
issued: 2019-05-14
modified: 2025-02-23
replaces: gayMuslims
comment: Gay men who are Muslim.
broader: https://homosaurus.org/v3/homoit0001032
change note: Version 3.7.0
has top concept: LGBTQ+ religious people
in scheme: v3

Native American gay men
type: Concept
issued: 2019-05-14
modified: 2025-02-23
replaces: gayNativeAmericans
comment: People who are part of the Native peoples of the continental United States and Canada (excluding Inuit people) and self-identity as gay men. Use more specific terms when available.
alternative label: American Indian gay men
alternative label: Gay American Indians
alternative label: Gay Native Americans
broader: https://homosaurus.org/v3/homoit0001037
change note: Version 3.7.0
has top concept: LGBTQ+ people
in scheme: v3

Gay newsletters
type: Concept
issued: 2019-05-14
modified: 2025-02-23
replaces: gayNewsletters
comment: Serialized print or digital periodicals created by or for gay men, often with the purpose of sharing news and information related to gay communities and issues.
broader: https://homosaurus.org/v3/homoit0000521
broader: https://homosaurus.org/v3/homoit0001041
change note: Version 3.7.0
has top concept: LGBTQ+ press
in scheme: v3
related: https://homosaurus.org/v3/homoit0000515

Gay newspapers
type: Concept
issued: 2019-05-14
modified: 2025-02-23
replaces: gayNewspapers
comment: Serialized print or digital publications about gay men or gay issues (and typically produced by gay men or gay organizations) that contain news, articles, columns, correspondence, and advertisements.
broader: https://homosaurus.org/v3/homoit0000521
broader: https://homosaurus.org/v3/homoit0001042
change note: Version 3.7.0
has top concept: LGBTQ+ press
in scheme: v3
related: https://homosaurus.org/v3/homoit0000514

Gay Pagans
type: Concept
issued: 2019-05-14
modified: 2025-02-23
replaces: gayPagans
comment: Gay men who are members of polytheistic religions or other religions outside of the dominant culture that typically incorporate nature worship and/or the sacred feminine, such as Wicca, Druidry, Heathenry, etc. Use to describe gay men who self-identify as Pagan.
broader: https://homosaurus.org/v3/homoit0001069
change note: Version 3.7.0
has top concept: LGBTQ+ religious people
in scheme: v3
related: https://homosaurus.org/v3/homoit0001909

Gay poetry
type: Concept
issued: 2019-05-14
modified: 2025-02-23
replaces: gayPoetry
comment: Literary work, typically written in verse, that focuses on gay characters, themes, or identity.
broader: https://homosaurus.org/v3/homoit0001118
change note: Version 3.7.0
has top concept: Subcultures
in scheme: v3
related: https://homosaurus.org/v3/homoit0001725

Gay political activists
type: Concept
issued: 2019-05-14
modified: 2025-02-23
replaces: gayPoliticalActivists
comment: Gay men working to bring about political or social change through public organizing.
broader: https://homosaurus.org/v3/homoit0000007
change note: Version 3.7.0
has top concept: LGBTQ+ people
in scheme: v3
related: https://homosaurus.org/v3/homoit0000462

Gay political groups
type: Concept
issued: 2019-05-14
modified: 2025-02-23
replaces: gayPoliticalGroups
comment: Organized groups centered on political change and action for gay rights that may or may not be aligned with major political parties.
broader: https://homosaurus.org/v3/homoit0003521
change note: Version 3.7.0
has top concept: LGBTQ+ political groups
in scheme: v3

Gay porn films
type: Concept
issued: 2019-05-14
modified: 2025-02-23
replaces: gayPornFilms
comment: Erotic or sexually explicit films featuring gay men.
broader: https://homosaurus.org/v3/homoit0000013
broader: https://homosaurus.org/v3/homoit0002331
broader: https://homosaurus.org/v3/homoit0002608
change note: Version 3.7.0
has top concept: Subcultures
in scheme: v3
related: https://homosaurus.org/v3/homoit0002547

Gay press
type: Concept
issued: 2019-05-14
modified: 2025-02-23
replaces: gayPress
comment: Newspapers, magazines, or other publishing outlets aimed at gay audiences and/or operated by gay men.
broader: https://homosaurus.org/v3/homoit0001132
change note: Version 3.7.0
has top concept: LGBTQ+ press
in scheme: v3
narrower: https://homosaurus.org/v3/homoit0000514
narrower: https://homosaurus.org/v3/homoit0000515
narrower: https://homosaurus.org/v3/homoit0003156
related: https://homosaurus.org/v3/homoit0000510
related: https://homosaurus.org/v3/homoit0000896

Gay pride
type: Concept
issued: 2019-05-14
modified: 2025-02-23
replaces: gayPride
comment: The recognition and celebration of gay people and culture, thereby affirming the visibility, dignity, and diversity of gay communities. This term can be used to refer to gay men specifically, but it is often used as an umbrella term for LGBTQ+ pride as a whole, particularly in historical contexts.
broader: https://homosaurus.org/v3/homoit0003653
change note: Version 3.7.0
has top concept: LGBTQ+ pride
in scheme: v3

Gay Pride Week
type: Concept
issued: 2019-05-14
modified: 2025-02-23
replaces: gayPrideWeek
comment: A period of public recognition and celebration of LGBTQ+ people and culture, usually organized over the course of a week with local events, parades, marches, and rallies. Gay pride week occurs at different times during the year in different places but is typically held in June in the United States to commemorate the Stonewall uprising.
alternative label: Pink Saturday
alternative label: Pink Week
alternative label: Pride Week
broader: https://homosaurus.org/v3/homoit0003654
change note: Version 3.7.0
has top concept: LGBTQ+ pride
in scheme: v3

Gay priests
type: Concept
issued: 2019-05-14
modified: 2025-02-23
replaces: gayPriests
comment: Gay men who are ordained as priests in different denominations of the Christian Church.
broader: https://homosaurus.org/v3/homoit0000484
change note: Version 3.7.0
has top concept: LGBTQ+ clergy
in scheme: v3

Gay sex workers
type: Concept
issued: 2019-05-14
modified: 2025-02-23
replaces: gayProstitutes
comment: Gay men who receive money or goods in exchange for sexual services, performances, or companionship. Use to describe gay men working across the broad spectrum of sex work.
alternative label: Gay prostitutes
alternative label: Gay prostitution
alternative label: Gay sex work
broader: https://homosaurus.org/v3/homoit0001277
change note: Version 3.7.0
has top concept: Sex workers
in scheme: v3

Gay Protestants
type: Concept
issued: 2019-05-14
modified: 2025-02-23
replaces: gayProtestants
comment: Gay men who are members of the Protestant Church.
broader: https://homosaurus.org/v3/homoit0001137
change note: Version 3.7.0
has top concept: LGBTQ+ religious people
in scheme: v3

Gay publishers
type: Concept
issued: 2019-05-14
modified: 2025-02-23
replaces: gayPublishers
comment: Companies and organizations that publish materials for gay communities or addressing gay issues.
broader: https://homosaurus.org/v3/homoit0001144
change note: Version 3.7.0
has top concept: LGBTQ+ publishers
in scheme: v3

Gay radio
type: Concept
issued: 2019-05-14
modified: 2025-02-23
replaces: gayRadio
comment: Auditory content broadcast on the radio (analog or digital) about gay men and gay issues.
broader: https://homosaurus.org/v3/homoit0001231
change note: Version 3.7.0
has top concept: LGBTQ+ radio
in scheme: v3
related: https://homosaurus.org/v3/homoit0000510

Gay relationships
type: Concept
issued: 2019-05-14
modified: 2025-02-23
replaces: gayRelationships
comment: Ongoing connections (romantic, sexual, or platonic) between two or more gay men.
broader: https://homosaurus.org/v3/homoit0001237
change note: Version 3.7.0
has top concept: LGBTQ+ relationships
in scheme: v3
related: https://homosaurus.org/v3/homoit0000182
related: https://homosaurus.org/v3/homoit0001205
related: https://homosaurus.org/v3/homoit0001442

Gay rights
type: Concept
issued: 2019-05-14
modified: 2025-02-23
replaces: gayRights
comment: Legal, social, or ethical principles of freedom or entitlement held by gay men.
broader: https://homosaurus.org/v3/homoit0000276
change note: Version 3.7.0
has top concept: Human rights
in scheme: v3

Gay Roman Catholics
type: Concept
issued: 2019-05-14
modified: 2025-02-23
replaces: gayRomanCatholics
comment: Gay men who are members of the Roman Catholic Church.
broader: https://homosaurus.org/v3/homoit0001244
change note: Version 3.7.0
has top concept: LGBTQ+ religious people
in scheme: v3

Gay slang
type: Concept
issued: 2019-05-14
modified: 2025-02-23
replaces: gaySlang
comment: Colloquial or informal language related to gay men or used by gay men.
alternative label: Gay speak
broader: https://homosaurus.org/v3/homoit0000487
broader: https://homosaurus.org/v3/homoit0001317
change note: Version 3.7.0
has top concept: Subcultures
in scheme: v3
related: https://homosaurus.org/v3/homoit0002230

Gay sons
type: Concept
issued: 2019-05-14
modified: 2025-02-23
replaces: gaySons
comment: Sons who identify as gay men.
broader: https://homosaurus.org/v3/homoit0001329
change note: Version 3.7.0
has top concept: LGBTQ+ people
in scheme: v3

Gay sports clubs
type: Concept
issued: 2019-05-14
modified: 2025-02-23
replaces: gaySportsClubs
comment: Groups of gay men formed for the purpose of playing sports; includes professional and amateur sports clubs.
broader: https://homosaurus.org/v3/homoit0000950
change note: Version 3.7.0
has top concept: LGBTQ+ clubs and organizations
in scheme: v3
related: https://homosaurus.org/v3/homoit0001931

Gay-straight alliances
type: Concept
issued: 2019-05-14
modified: 2025-02-23
replaces: gay-straightAlliances
comment: Alliances to make schools, sports clubs, etc. safe and welcoming to all people regardless of sexual orientation or gender identity.
alternative label: GSAs
broader: https://homosaurus.org/v3/homoit0000947
change note: Version 3.7.0
has top concept: LGBTQ+ social processes
in scheme: v3
related: https://homosaurus.org/v3/homoit0000038
related: https://homosaurus.org/v3/homoit0000873
related: https://homosaurus.org/v3/homoit0001026
related: https://homosaurus.org/v3/homoit0003693

Gay studies
type: Concept
issued: 2019-05-14
modified: 2025-02-23
replaces: gayStudies
comment: Academic field of research and study about gay men, gay identity, and gay communities.
broader: https://homosaurus.org/v3/homoit0000579
change note: Version 3.7.0
has top concept: Gender studies
in scheme: v3
related: https://homosaurus.org/v3/homoit0000187
related: https://homosaurus.org/v3/homoit0000781
related: https://homosaurus.org/v3/homoit0001210
related: https://homosaurus.org/v3/homoit0001447

Gay survivors of hate crimes
type: Concept
issued: 2019-05-14
modified: 2025-02-23
replaces: gaySurvivorsOfHateCrimes
comment: Gay men who have experienced and survived hate crimes; follow the individual's preference for "victims" or "survivors" whenever possible.
broader: https://homosaurus.org/v3/homoit0000551
broader: https://homosaurus.org/v3/homoit0001349
change note: Version 3.7.0
has top concept: LGBTQ+ people
in scheme: v3

Gay survivors of rape
type: Concept
issued: 2019-05-14
modified: 2025-02-23
replaces: gaySurvivorsOfRape
comment: Gay men who have experienced and survived rape; follow the individual's preference for "victims" or "survivors" whenever possible.
broader: https://homosaurus.org/v3/homoit0000552
broader: https://homosaurus.org/v3/homoit0001350
change note: Version 3.7.0
has top concept: LGBTQ+ people
in scheme: v3

Gay survivors of sexual abuse
type: Concept
issued: 2019-05-14
modified: 2025-02-23
replaces: gaySurvivorsOfSexualAbuse
comment: Gay men who have experienced and survived sexual abuse; follow the individual's preference for "victims" or "survivors" whenever possible.
broader: https://homosaurus.org/v3/homoit0000550
broader: https://homosaurus.org/v3/homoit0001351
change note: Version 3.7.0
has top concept: LGBTQ+ people
in scheme: v3

Gay survivors of war
type: Concept
issued: 2019-05-14
modified: 2025-02-23
replaces: gaySurvivorsOfWar
comment: Gay men who have experienced and survived war; follow the individual's preference for "victims" or "survivors" whenever possible.
broader: https://homosaurus.org/v3/homoit0000553
broader: https://homosaurus.org/v3/homoit0001352
change note: Version 3.7.0
has top concept: LGBTQ+ people
in scheme: v3

Gay youth
type: Concept
issued: 2019-05-14
modified: 2025-02-23
replaces: gayYouth
comment: Gay people between the ages of childhood and adulthood.
alternative label: Gay teenagers
alternative label: Gay adolescents
alternative label: Gay teens
broader: https://homosaurus.org/v3/homoit0001521
change note: Version 3.7.0
has top concept: Youth
in scheme: v3
narrower: https://homosaurus.org/v3/homoit0000479
related: https://homosaurus.org/v3/homoit0000481
related: https://homosaurus.org/v3/homoit0000496
related: https://homosaurus.org/v3/homoit0000506
related: https://homosaurus.org/v3/homoit0000557

Gay television
type: Concept
issued: 2019-05-14
modified: 2025-02-23
replaces: gayTelevision
comment: Television shows featuring gay men or themes.
broader: https://homosaurus.org/v3/homoit0001359
change note: Version 3.7.0
has top concept: LGBTQ+ television
in scheme: v3
related: https://homosaurus.org/v3/homoit0000510

Gay theater
type: Concept
issued: 2019-05-14
modified: 2025-02-23
replaces: gayTheatre
comment: Works in the performance arts that focus on gay characters, communities, or issues.
broader: https://homosaurus.org/v3/homoit0001363
change note: Version 3.7.0
has top concept: LGBTQ+ theater
in scheme: v3
preferred label: Gay theatre
related: https://homosaurus.org/v3/homoit0000547
related: https://homosaurus.org/v3/homoit0000788
related: https://homosaurus.org/v3/homoit0000922

Gay trade union groups
type: Concept
issued: 2019-05-14
modified: 2025-02-23
replaces: gayTradeUnionGroups
comment: Organized groups of gay workers who are united to make decisions relating to the conditions affecting their labor.
broader: https://homosaurus.org/v3/homoit0000510
change note: Version 3.7.0
has top concept: Social movements
in scheme: v3
related: https://homosaurus.org/v3/homoit0000791

Gay victims of sexual abuse
type: Concept
issued: 2019-05-14
modified: 2025-02-23
replaces: gayVictimsOfSexualAbuse
comment: Gay men who have experienced sexual abuse and may or may not have survived; follow the individual's preference for "victims" or "survivors" whenever possible.
broader: https://homosaurus.org/v3/homoit0000959
change note: Version 3.7.0
has top concept: LGBTQ+ people
in scheme: v3
narrower: https://homosaurus.org/v3/homoit0000542

Gay victims of hate crimes
type: Concept
issued: 2019-05-14
modified: 2025-02-23
replaces: gayVictimsOfHateCrimes
comment: Gay men who have experienced hate crimes and may or may not have survived; follow the individual's preference for "victims" or "survivors" whenever possible.
broader: https://homosaurus.org/v3/homoit0000613
change note: Version 3.7.0
has top concept: LGBTQ+ people
in scheme: v3
narrower: https://homosaurus.org/v3/homoit0000540

Gay victims of rape
type: Concept
issued: 2019-05-14
modified: 2025-02-23
replaces: gayVictimsOfRape
comment: Gay men who have experienced rape and may or may not have survived; follow the individual's preference for "victims" or "survivors" whenever possible.
broader: https://homosaurus.org/v3/homoit0000958
change note: Version 3.7.0
has top concept: LGBTQ+ people
in scheme: v3
narrower: https://homosaurus.org/v3/homoit0000541

Gay victims of war
type: Concept
issued: 2019-05-14
modified: 2025-02-23
replaces: gayVictimsOfWar
comment: Gay men who have experienced war and may or may not have survived; follow the individual's preference for "victims" or "survivors" whenever possible.
broader: https://homosaurus.org/v3/homoit0000961
change note: Version 3.7.0
has top concept: LGBTQ+ people
in scheme: v3
narrower: https://homosaurus.org/v3/homoit0000543

Gay victims' rights
type: Concept
issued: 2019-05-14
modified: 2025-02-23
replaces: gayVictimsRights
comment: Gay men's legal rights to be informed, present, and heard within the criminal justice system after having been harmed or injured as the result of of a crime, accident, or other event.
broader: https://homosaurus.org/v3/homoit0001492
change note: Version 3.7.0
has top concept: Law
in scheme: v3

White gay men
type: Concept
issued: 2019-05-14
modified: 2025-02-23
replaces: gayWhitePeople
comment: Gay men who are white.
alternative label: Caucasian gay men
alternative label: Gay Caucasian men
alternative label: Gay white men
broader: https://homosaurus.org/v3/homoit0000243
change note: Version 3.7.0
has top concept: White LGBTQ+ people
in scheme: v3

Lesbians
type: Concept
issued: 2019-05-14
modified: 2025-02-23
replaces: lesbians
comment: Individuals who self-identify as lesbian and belong to lesbian communities. The term has been predominately used to describe women who are exclusively or primarily romantically and/or sexually attracted to other women. However, not all lesbians are women, and gender non-conforming people who belong to lesbian communities have often identified as lesbian.
alternative label: Gay women
alternative label: Lesbian women
alternative label: Lesbian people
broader: https://homosaurus.org/v3/homoit0000915
broader: https://homosaurus.org/v3/homoit0001297
change note: Version 3.7.0
has top concept: LGBTQ+ people
in scheme: v3
narrower: https://homosaurus.org/v3/homoit0000088
narrower: https://homosaurus.org/v3/homoit0000287
narrower: https://homosaurus.org/v3/homoit0000786
narrower: https://homosaurus.org/v3/homoit0000971
narrower: https://homosaurus.org/v3/homoit0001056
narrower: https://homosaurus.org/v3/homoit0003040
related: https://homosaurus.org/v3/homoit0000040
related: https://homosaurus.org/v3/homoit0000058
related: https://homosaurus.org/v3/homoit0000215
related: https://homosaurus.org/v3/homoit0000231
related: https://homosaurus.org/v3/homoit0000384
related: https://homosaurus.org/v3/homoit0000454
related: https://homosaurus.org/v3/homoit0000499
related: https://homosaurus.org/v3/homoit0000647
related: https://homosaurus.org/v3/homoit0000729
related: https://homosaurus.org/v3/homoit0000744
related: https://homosaurus.org/v3/homoit0000799
related: https://homosaurus.org/v3/homoit0000802
related: https://homosaurus.org/v3/homoit0000803
related: https://homosaurus.org/v3/homoit0001105
related: https://homosaurus.org/v3/homoit0001227
related: https://homosaurus.org/v3/homoit0001327
related: https://homosaurus.org/v3/homoit0001340
related: https://homosaurus.org/v3/homoit0001472
related: https://homosaurus.org/v3/homoit0001509
related: https://homosaurus.org/v3/homoit0001510
related: https://homosaurus.org/v3/homoit0002178

Gay youth literature
type: Concept
issued: 2019-05-14
modified: 2025-02-23
replaces: gayYouthLiterature
comment: Written literary works for an audience of readers from 12-18 years of age, also known as young adult literature or YA; use in reference to youth literature focusing on gay characters or themes.
broader: https://homosaurus.org/v3/homoit0001522
change note: Version 3.7.0
has top concept: Subcultures
in scheme: v3
related: https://homosaurus.org/v3/homoit0000544
related: https://homosaurus.org/v3/homoit0002152

Gender affirming surgery
type: Concept
issued: 2019-05-14
modified: 2025-02-23
replaces: genderConfirmingSurgery
comment: Any of various surgeries undertaken to affirm an individual's gender. Most often applied to transgender people, but may also refer to certain procedures undergone by cisgender and intersex people.
alternative label: Gender affirmation surgery
alternative label: Gender confirmation surgery
alternative label: Gender realignment surgery
alternative label: Gender reassignment surgery
alternative label: Sex reassignment surgery
alternative label: SRS
alternative label: Gender confirming surgery
broader: https://homosaurus.org/v3/homoit0001004
broader: https://homosaurus.org/v3/homoit0003657
change note: Version 3.7.0
has top concept: Medical care
in scheme: v3
narrower: https://homosaurus.org/v3/homoit0000584
narrower: https://homosaurus.org/v3/homoit0001040
narrower: https://homosaurus.org/v3/homoit0001837
narrower: https://homosaurus.org/v3/homoit0001840
narrower: https://homosaurus.org/v3/homoit0001842
narrower: https://homosaurus.org/v3/homoit0001843
narrower: https://homosaurus.org/v3/homoit0001894
related: https://homosaurus.org/v3/homoit0000560
related: https://homosaurus.org/v3/homoit0001049
related: https://homosaurus.org/v3/homoit0001129
related: https://homosaurus.org/v3/homoit0001131
related: https://homosaurus.org/v3/homoit0001378
related: https://homosaurus.org/v3/homoit0001381
related: https://homosaurus.org/v3/homoit0001464
related: https://homosaurus.org/v3/homoit0001465
related: https://homosaurus.org/v3/homoit0003504

Gender bending
type: Concept
issued: 2019-05-14
modified: 2025-02-23
replaces: genderBending
comment: The practice of transgressing or "bending" expected gender roles, which often involves adopting or exaggerating stereotypically feminine or masculine traits to expose them as artificial. Gender bending is similar to drag, though drag is often associated with artistic or stage performances, whereas gender bending is typically enacted in everyday life.
broader: https://homosaurus.org/v3/homoit0000568
change note: Version 3.7.0
has top concept: Gender
in scheme: v3
related: https://homosaurus.org/v3/homoit0000047
related: https://homosaurus.org/v3/homoit0000577
related: https://homosaurus.org/v3/homoit0001756
related: https://homosaurus.org/v3/homoit0001816

Gender blending
type: Concept
issued: 2019-05-14
modified: 2025-02-23
replaces: genderBlending
comment: Gender expression that involves blending dress and behaviors associated with different genders. Do not use to describe the identities of genderqueer or non-binary people.
broader: https://homosaurus.org/v3/homoit0000568
change note: Version 3.7.0
has top concept: Gender
in scheme: v3

Genderism
type: Concept
issued: 2019-05-14
modified: 2025-02-23
replaces: genderism
comment: The systematic belief that there are only two genders (men and women) and that individuals must conform to the gender they were assigned at or shortly after birth.
alternative label: Gender discrimination
broader: https://homosaurus.org/v3/homoit0000920
change note: Version 3.7.0
has top concept: LGBTQ+ phobia
in scheme: v3
narrower: https://homosaurus.org/v3/homoit0003158
related: https://homosaurus.org/v3/homoit0000560
related: https://homosaurus.org/v3/homoit0000571
related: https://homosaurus.org/v3/homoit0001278
related: https://homosaurus.org/v3/homoit0003519

Gender diversity
type: Concept
issued: 2019-05-14
modified: 2025-02-23
replaces: genderDiversity
comment: An umbrella term encompassing a range of gender identities.
broader: https://homosaurus.org/v3/homoit0000358
change note: Version 3.7.0
has top concept: Diversity
in scheme: v3
related: https://homosaurus.org/v3/homoit0000560
related: https://homosaurus.org/v3/homoit0000568
related: https://homosaurus.org/v3/homoit0000571
related: https://homosaurus.org/v3/homoit0001048
related: https://homosaurus.org/v3/homoit0001378
related: https://homosaurus.org/v3/homoit0001817

Gender expression
type: Concept
issued: 2019-05-14
modified: 2025-02-23
replaces: genderExpression
comment: Term used to describe the way individuals express their gender identity through their appearance and behaviors, including gestures, movement, dress, and grooming.
broader: https://homosaurus.org/v3/homoit0000560
change note: Version 3.7.0
has top concept: Gender
in scheme: v3
narrower: https://homosaurus.org/v3/homoit0000047
narrower: https://homosaurus.org/v3/homoit0000114
narrower: https://homosaurus.org/v3/homoit0000289
narrower: https://homosaurus.org/v3/homoit0000318
narrower: https://homosaurus.org/v3/homoit0000366
narrower: https://homosaurus.org/v3/homoit0000367
narrower: https://homosaurus.org/v3/homoit0000389
narrower: https://homosaurus.org/v3/homoit0000395
narrower: https://homosaurus.org/v3/homoit0000562
narrower: https://homosaurus.org/v3/homoit0000564
narrower: https://homosaurus.org/v3/homoit0000576
narrower: https://homosaurus.org/v3/homoit0000606
narrower: https://homosaurus.org/v3/homoit0000995
narrower: https://homosaurus.org/v3/homoit0001067
narrower: https://homosaurus.org/v3/homoit0001469
narrower: https://homosaurus.org/v3/homoit0001476
narrower: https://homosaurus.org/v3/homoit0001496
narrower: https://homosaurus.org/v3/homoit0001756
narrower: https://homosaurus.org/v3/homoit0001790
narrower: https://homosaurus.org/v3/homoit0001816
narrower: https://homosaurus.org/v3/homoit0001820
narrower: https://homosaurus.org/v3/homoit0001821
narrower: https://homosaurus.org/v3/homoit0001852
narrower: https://homosaurus.org/v3/homoit0001899
related: https://homosaurus.org/v3/homoit0000105
related: https://homosaurus.org/v3/homoit0000231
related: https://homosaurus.org/v3/homoit0000321
related: https://homosaurus.org/v3/homoit0000326
related: https://homosaurus.org/v3/homoit0000440
related: https://homosaurus.org/v3/homoit0000566
related: https://homosaurus.org/v3/homoit0000567
related: https://homosaurus.org/v3/homoit0000571
related: https://homosaurus.org/v3/homoit0000577
related: https://homosaurus.org/v3/homoit0000581
related: https://homosaurus.org/v3/homoit0001063
related: https://homosaurus.org/v3/homoit0001145
related: https://homosaurus.org/v3/homoit0001148
related: https://homosaurus.org/v3/homoit0001479
related: https://homosaurus.org/v3/homoit0001508
related: https://homosaurus.org/v3/homoit0002256
related: https://homosaurus.org/v3/homoit0002589
related: https://homosaurus.org/v3/homoit0002699
related: https://homosaurus.org/v3/homoit0002700
related: https://homosaurus.org/v3/homoit0003066
related: https://homosaurus.org/v3/homoit0003126

Genderfluid identity
type: Concept
issued: 2019-05-14
modified: 2025-02-23
replaces: genderfluid
comment: A gender identity in which an individual's gender varies over time and across circumstances; some genderfluid people may identify as a mixture of more than one gender simultaneously.
alternative label: Genderfluidity
broader: https://homosaurus.org/v3/homoit0000571
change note: Version 3.7.0
has top concept: Gender
in scheme: v3
related: https://homosaurus.org/v3/homoit0000110
related: https://homosaurus.org/v3/homoit0000570

Genderfluid people
type: Concept
issued: 2019-05-14
modified: 2025-02-23
replaces: genderfluidPeople
comment: People who identify as different genders at different times, including multiple genders at once or none at all. Only use to describe people who self-identify as genderfluid.
broader: https://homosaurus.org/v3/homoit0001378
broader: https://homosaurus.org/v3/homoit0001817
change note: Version 3.7.0
has top concept: LGBTQ+ people
in scheme: v3
related: https://homosaurus.org/v3/homoit0000111
related: https://homosaurus.org/v3/homoit0000569
related: https://homosaurus.org/v3/homoit0000571

Gender identity
type: Concept
issued: 2019-05-14
modified: 2025-02-23
replaces: genderIdentity
comment: A person’s experience of having a particular gender, which may or may not correspond with the gender or sex they were assigned at birth. Not to be used to describe solely women’s experiences or women’s studies.
alternative label: Gender-variant identity
broader: https://homosaurus.org/v3/homoit0000560
change note: Version 3.7.0
has top concept: Gender
in scheme: v3
narrower: https://homosaurus.org/v3/homoit0000078
narrower: https://homosaurus.org/v3/homoit0000110
narrower: https://homosaurus.org/v3/homoit0000322
narrower: https://homosaurus.org/v3/homoit0000569
narrower: https://homosaurus.org/v3/homoit0001008
narrower: https://homosaurus.org/v3/homoit0001071
narrower: https://homosaurus.org/v3/homoit0001415
narrower: https://homosaurus.org/v3/homoit0001473
narrower: https://homosaurus.org/v3/homoit0001509
narrower: https://homosaurus.org/v3/homoit0001670
narrower: https://homosaurus.org/v3/homoit0001756
narrower: https://homosaurus.org/v3/homoit0001918
narrower: https://homosaurus.org/v3/homoit0001920
narrower: https://homosaurus.org/v3/homoit0001921
narrower: https://homosaurus.org/v3/homoit0001922
narrower: https://homosaurus.org/v3/homoit0001923
narrower: https://homosaurus.org/v3/homoit0001925
narrower: https://homosaurus.org/v3/homoit0001927
related: https://homosaurus.org/v3/homoit0000021
related: https://homosaurus.org/v3/homoit0000271
related: https://homosaurus.org/v3/homoit0000342
related: https://homosaurus.org/v3/homoit0000563
related: https://homosaurus.org/v3/homoit0000565
related: https://homosaurus.org/v3/homoit0000566
related: https://homosaurus.org/v3/homoit0000567
related: https://homosaurus.org/v3/homoit0000568
related: https://homosaurus.org/v3/homoit0000570
related: https://homosaurus.org/v3/homoit0000577
related: https://homosaurus.org/v3/homoit0000580
related: https://homosaurus.org/v3/homoit0001016
related: https://homosaurus.org/v3/homoit0001048
related: https://homosaurus.org/v3/homoit0001295
related: https://homosaurus.org/v3/homoit0001378
related: https://homosaurus.org/v3/homoit0001463
related: https://homosaurus.org/v3/homoit0001465
related: https://homosaurus.org/v3/homoit0001563
related: https://homosaurus.org/v3/homoit0001671
related: https://homosaurus.org/v3/homoit0001817
related: https://homosaurus.org/v3/homoit0002256
related: https://homosaurus.org/v3/homoit0002699
related: https://homosaurus.org/v3/homoit0002700

Gender identity disorder
type: Concept
issued: 2019-05-14
modified: 2025-02-23
replaces: genderIdentityDisorder
comment: An obsolete psychological diagnosis that medicalizes trans identities and practices; only use in historical contexts.
broader: https://homosaurus.org/v3/homoit0001006
change note: Version 3.7.0
has top concept: Medical care
in scheme: v3
related: https://homosaurus.org/v3/homoit0000567
related: https://homosaurus.org/v3/homoit0001378
related: https://homosaurus.org/v3/homoit0001381

Gender markers
type: Concept
issued: 2019-05-14
modified: 2025-02-23
replaces: genderMarkers
comment: Markers used to designate an individual's gender on official documentation, including passports, birth certificates, driver’s licenses, etc. Different jurisdictions vary significantly in the number and types of gender markers they allow on official documentation.
broader: https://homosaurus.org/v3/homoit0000119
broader: https://homosaurus.org/v3/homoit0000377
broader: https://homosaurus.org/v3/homoit0001092
change note: Version 3.7.0
has top concept: Legal status
in scheme: v3
narrower: https://homosaurus.org/v3/homoit0002884
related: https://homosaurus.org/v3/homoit0000120
related: https://homosaurus.org/v3/homoit0000311
related: https://homosaurus.org/v3/homoit0001005
related: https://homosaurus.org/v3/homoit0001324
related: https://homosaurus.org/v3/homoit0001378
related: https://homosaurus.org/v3/homoit0001465
related: https://homosaurus.org/v3/homoit0003503

Gender non-conforming people
type: Concept
issued: 2019-05-14
modified: 2025-02-23
replaces: genderNonConformingPeople
comment: People who identify outside, transgress, or do not conform to a given culture's gender roles or expectations. Only use in reference to people who self-identity as gender non-conforming. Do not use to describe cisgender people whose dress or behaviors do not conform to gender roles or expectations.
broader: https://homosaurus.org/v3/homoit0001817
change note: Version 3.7.0
has top concept: Gender minorities
in scheme: v3
related: https://homosaurus.org/v3/homoit0001378
related: https://homosaurus.org/v3/homoit0001756
related: https://homosaurus.org/v3/homoit0001922

Gender relations
type: Concept
issued: 2019-05-14
modified: 2025-02-23
replaces: genderRelations
comment: The culturally specific rights, responsibilities, and connections afforded to individuals or communities of one gender by individuals or communities of another gender.
broader: https://homosaurus.org/v3/homoit0000947
change note: Version 3.7.0
has top concept: LGBTQ+ social processes
in scheme: v3
narrower: https://homosaurus.org/v3/homoit0000499
related: https://homosaurus.org/v3/homoit0000560
related: https://homosaurus.org/v3/homoit0000577
related: https://homosaurus.org/v3/homoit0000578
related: https://homosaurus.org/v3/homoit0000778
related: https://homosaurus.org/v3/homoit0002589

Gender swapping
type: Concept
issued: 2019-05-14
modified: 2025-02-23
replaces: genderSwapping
comment: A media trope (commonly used in fanfiction and fanart) in which one or more characters switch binary sexes (e.g., a cisgender man transforms into a cisgender woman), often temporarily.
alternative label: Gender roleplay
broader: https://homosaurus.org/v3/homoit0000568
broader: https://homosaurus.org/v3/homoit0001242
change note: Version 3.7.0
has top concept: Gender
in scheme: v3
related: https://homosaurus.org/v3/homoit0000577
related: https://homosaurus.org/v3/homoit0002160
related: https://homosaurus.org/v3/homoit0002162
related: https://homosaurus.org/v3/homoit0002171
related: https://homosaurus.org/v3/homoit0002184
related: https://homosaurus.org/v3/homoit0002210

Gender roles
type: Concept
issued: 2019-05-14
modified: 2025-02-23
replaces: genderRoles
comment: Socially-determined rules or standards for gendered behaviors. Some LGBTQ+ people identify with gender roles that exist outside of the gender binary (e.g., butches, femmes, twinks, bears). Use the term "Gender role stereotypes" to describe widely held but oversimplified or offensive ideas regarding gender roles.
broader: https://homosaurus.org/v3/homoit0001241
change note: Version 3.7.0
has top concept: Role behavior
in scheme: v3
narrower: https://homosaurus.org/v3/homoit0000105
narrower: https://homosaurus.org/v3/homoit0000231
narrower: https://homosaurus.org/v3/homoit0000321
narrower: https://homosaurus.org/v3/homoit0000326
narrower: https://homosaurus.org/v3/homoit0000440
narrower: https://homosaurus.org/v3/homoit0000655
narrower: https://homosaurus.org/v3/homoit0001063
narrower: https://homosaurus.org/v3/homoit0001313
narrower: https://homosaurus.org/v3/homoit0001374
narrower: https://homosaurus.org/v3/homoit0001479
narrower: https://homosaurus.org/v3/homoit0001508
narrower: https://homosaurus.org/v3/homoit0001898
narrower: https://homosaurus.org/v3/homoit0002589
narrower: https://homosaurus.org/v3/homoit0003506
related: https://homosaurus.org/v3/homoit0000047
related: https://homosaurus.org/v3/homoit0000389
related: https://homosaurus.org/v3/homoit0000562
related: https://homosaurus.org/v3/homoit0000563
related: https://homosaurus.org/v3/homoit0000568
related: https://homosaurus.org/v3/homoit0000571
related: https://homosaurus.org/v3/homoit0000575
related: https://homosaurus.org/v3/homoit0000576
related: https://homosaurus.org/v3/homoit0000995
related: https://homosaurus.org/v3/homoit0001756
related: https://homosaurus.org/v3/homoit0001816
related: https://homosaurus.org/v3/homoit0001817
related: https://homosaurus.org/v3/homoit0001899

Genderqueer people
type: Concept
issued: 2019-05-14
modified: 2025-02-23
replaces: genderqueerPeople
comment: Individuals who self-identify as genderqueer, an umbrella term for queer or non-normative gender identities and gender expressions.
broader: https://homosaurus.org/v3/homoit0001195
broader: https://homosaurus.org/v3/homoit0001817
change note: Version 3.7.0
has top concept: LGBTQ+ people
in scheme: v3
narrower: https://homosaurus.org/v3/homoit0001668
related: https://homosaurus.org/v3/homoit0001378
related: https://homosaurus.org/v3/homoit0001921

Genetic parenthood
type: Concept
issued: 2019-05-14
modified: 2025-02-23
replaces: geneticParenthood
comment: The experience of parenthood as felt by parents who passed on genetic material to their child or children.
broader: https://homosaurus.org/v3/homoit0000116
broader: https://homosaurus.org/v3/homoit0000819
change note: Version 3.7.0
has top concept: LGBTQ+ families
in scheme: v3
related: https://homosaurus.org/v3/homoit0000364
related: https://homosaurus.org/v3/homoit0000390
related: https://homosaurus.org/v3/homoit0000587
related: https://homosaurus.org/v3/homoit0000914
related: https://homosaurus.org/v3/homoit0002621
related: https://homosaurus.org/v3/homoit0002623

Bottom surgery
type: Concept
issued: 2019-05-14
modified: 2025-02-23
replaces: genitalReconstructionSurgery
comment: Colloquial term for gender-affirming surgical alterations of the genitalia and/or reproductive organs.
alternative label: Genital reconstruction surgery
broader: https://homosaurus.org/v3/homoit0000561
change note: Version 3.7.0
has top concept: Medical care
in scheme: v3
narrower: https://homosaurus.org/v3/homoit0000658
narrower: https://homosaurus.org/v3/homoit0001060
narrower: https://homosaurus.org/v3/homoit0001097
narrower: https://homosaurus.org/v3/homoit0001844
narrower: https://homosaurus.org/v3/homoit0001845
narrower: https://homosaurus.org/v3/homoit0001846
narrower: https://homosaurus.org/v3/homoit0001847
narrower: https://homosaurus.org/v3/homoit0001848
narrower: https://homosaurus.org/v3/homoit0001850
narrower: https://homosaurus.org/v3/homoit0001851
narrower: https://homosaurus.org/v3/homoit0002840
related: https://homosaurus.org/v3/homoit0001465
related: https://homosaurus.org/v3/homoit0001840
related: https://homosaurus.org/v3/homoit0002847

Genitals
type: Concept
issued: 2019-05-14
modified: 2025-02-23
replaces: genitals
comment: General term for erogenous and/or reproductive organs (e.g., vagina, clitoris, penis).
alternative label: Genitalia
broader: https://homosaurus.org/v3/homoit0001269
change note: Version 3.7.0
has top concept: Sex (Body)
in scheme: v3
narrower: https://homosaurus.org/v3/homoit0000282
narrower: https://homosaurus.org/v3/homoit0001099
narrower: https://homosaurus.org/v3/homoit0001361
narrower: https://homosaurus.org/v3/homoit0001488
narrower: https://homosaurus.org/v3/homoit0001497
related: https://homosaurus.org/v3/homoit0000401
related: https://homosaurus.org/v3/homoit0001268
related: https://homosaurus.org/v3/homoit0003110

Gestational parenthood
type: Concept
issued: 2019-05-14
modified: 2025-02-23
replaces: gestationalParenthood
comment: The experience of parenthood as felt by a person whose uterus was utilized to nurture and develop an embryo into a baby.
broader: https://homosaurus.org/v3/homoit0000116
broader: https://homosaurus.org/v3/homoit0000819
change note: Version 3.7.0
has top concept: LGBTQ+ families
in scheme: v3
narrower: https://homosaurus.org/v3/homoit0000121
narrower: https://homosaurus.org/v3/homoit0001347
related: https://homosaurus.org/v3/homoit0000583
related: https://homosaurus.org/v3/homoit0002627
related: https://homosaurus.org/v3/homoit0002628

Getting laid
type: Concept
issued: 2019-05-14
modified: 2025-02-23
replaces: gettingLaid
comment: Slang term for the act of having sex, typically with another person.
broader: https://homosaurus.org/v3/homoit0001267
broader: https://homosaurus.org/v3/homoit0001299
change note: Version 3.7.0
has top concept: Sex (Act)
in scheme: v3
related: https://homosaurus.org/v3/homoit0000459
related: https://homosaurus.org/v3/homoit0000662

Girls
type: Concept
issued: 2019-05-14
modified: 2025-02-23
replaces: girls
comment: Children or youth, typically younger than 18 years old, who identify as girls.
broader: https://homosaurus.org/v3/homoit0000255
change note: Version 3.7.0
has top concept: Family members
in scheme: v3
narrower: https://homosaurus.org/v3/homoit0000152
narrower: https://homosaurus.org/v3/homoit0000623
narrower: https://homosaurus.org/v3/homoit0000743
narrower: https://homosaurus.org/v3/homoit0001374
narrower: https://homosaurus.org/v3/homoit0002284
related: https://homosaurus.org/v3/homoit0000563
related: https://homosaurus.org/v3/homoit0000591

Girls' friendships
type: Concept
issued: 2019-05-14
modified: 2025-02-23
replaces: girlsFriendships
comment: Connections based on affection and trust between two or more girls.
broader: https://homosaurus.org/v3/homoit0000455
broader: https://homosaurus.org/v3/homoit0000649
change note: Version 3.7.0
has top concept: LGBTQ+ relationships
in scheme: v3
related: https://homosaurus.org/v3/homoit0000590

Oral sex
type: Concept
issued: 2019-05-14
modified: 2025-02-23
replaces: oralSex
comment: Sexual activities performed using the mouth.
alternative label: Giving head
alternative label: Going down
broader: https://homosaurus.org/v3/homoit0001267
broader: https://homosaurus.org/v3/homoit0001299
change note: Version 3.7.0
has top concept: Sex (Act)
in scheme: v3
narrower: https://homosaurus.org/v3/homoit0000206
narrower: https://homosaurus.org/v3/homoit0000212
narrower: https://homosaurus.org/v3/homoit0000239
narrower: https://homosaurus.org/v3/homoit0000691
narrower: https://homosaurus.org/v3/homoit0000969
narrower: https://homosaurus.org/v3/homoit0002578
related: https://homosaurus.org/v3/homoit0000049

LGBT
type: Concept
issued: 2019-05-14
modified: 2025-02-23
replaces: LGBT
comment: Acronym used to describe lesbians, gay men, bisexual people, and transgender people as a group.
alternative label: GLBT
broader: https://homosaurus.org/v3/homoit0000805
broader: https://homosaurus.org/v3/homoit0000806
change note: Version 3.7.0
has top concept: LGBTI
in scheme: v3
narrower: https://homosaurus.org/v3/homoit0000703
narrower: https://homosaurus.org/v3/homoit0000804
related: https://homosaurus.org/v3/homoit0000143
related: https://homosaurus.org/v3/homoit0000485
related: https://homosaurus.org/v3/homoit0000733
related: https://homosaurus.org/v3/homoit0001403

Glory holes
type: Concept
issued: 2019-05-14
modified: 2025-02-23
replaces: gloryHoles
comment: Holes through walls or partitions, such as public bathroom stalls, that allow people to perform or observe sex acts, typically anonymously. Often associated with gay male culture due to the historical and ongoing use of glory holes by closeted gay men to facilitate oral or anal sex without the risk of identification or arrest.
broader: https://homosaurus.org/v3/homoit0000308
broader: https://homosaurus.org/v3/homoit0000475
broader: https://homosaurus.org/v3/homoit0001140
broader: https://homosaurus.org/v3/homoit0001358
change note: Version 3.7.0
has top concept: Sex locations
in scheme: v3
related: https://homosaurus.org/v3/homoit0001299

Urine play
type: Concept
issued: 2019-05-14
modified: 2025-02-23
replaces: waterSports
comment: Use of urine and urination for sexual or erotic pleasure.
alternative label: Golden showers
alternative label: Pissing sex
alternative label: Undinism
alternative label: Urolagnia
alternative label: Clothes wetting
alternative label: Omorashi
alternative label: Piss play
alternative label: Urophilia
alternative label: Water sports
alternative label: Watersports
broader: https://homosaurus.org/v3/homoit0000442
broader: https://homosaurus.org/v3/homoit0001267
broader: https://homosaurus.org/v3/homoit0001299
change note: Version 3.7.0
has top concept: Eroticism
in scheme: v3
related: https://homosaurus.org/v3/homoit0000305
related: https://homosaurus.org/v3/homoit0003061
related: https://homosaurus.org/v3/homoit0003062

Goldilocks (Gay culture)
type: Concept
issued: 2019-05-14
modified: 2025-02-23
replaces: goldilocks
comment: US slang term for heterosexual women who are friends with gay men in the bear community and socialize in bear spaces.
alternative label: Goldilocks
broader: https://homosaurus.org/v3/homoit0000629
change note: Version 3.7.0
has top concept: Heterosexuals
in scheme: v3
related: https://homosaurus.org/v3/homoit0000105
related: https://homosaurus.org/v3/homoit0000381
related: https://homosaurus.org/v3/homoit0000416
related: https://homosaurus.org/v3/homoit0000455
related: https://homosaurus.org/v3/homoit0001133
related: https://homosaurus.org/v3/homoit0001788

Gonadal dysgenesis
type: Concept
issued: 2019-05-14
modified: 2025-02-23
replaces: gonadalDysgenesis
comment: A term that refers to a group of different variations that affect the development of the gonads before birth.
broader: https://homosaurus.org/v3/homoit0000669
change note: Version 3.7.0
has top concept: Sex (Body)
in scheme: v3
narrower: https://homosaurus.org/v3/homoit0002867

Gonads
type: Concept
issued: 2019-05-14
modified: 2025-02-23
replaces: gonads
comment: A general term used to describe testes, ovaries, or ovotestes.
broader: https://homosaurus.org/v3/homoit0001269
change note: Version 3.7.0
has top concept: Sex (Body)
in scheme: v3
narrower: https://homosaurus.org/v3/homoit0001361
narrower: https://homosaurus.org/v3/homoit0002877
related: https://homosaurus.org/v3/homoit0001268

Grandchildren
type: Concept
issued: 2019-05-14
modified: 2025-02-23
replaces: grandchildren
comment: The children of an individual's children.
broader: https://homosaurus.org/v3/homoit0000421
change note: Version 3.7.0
has top concept: Family members
in scheme: v3
narrower: https://homosaurus.org/v3/homoit0002356
narrower: https://homosaurus.org/v3/homoit0002357

Grandparents
type: Concept
issued: 2019-05-14
modified: 2025-02-23
replaces: grandparents
comment: The parents of an individual's parents.
broader: https://homosaurus.org/v3/homoit0000421
change note: Version 3.7.0
has top concept: Family members
in scheme: v3
narrower: https://homosaurus.org/v3/homoit0002358
narrower: https://homosaurus.org/v3/homoit0002359

Group sex
type: Concept
issued: 2019-05-14
modified: 2025-02-23
replaces: groupSex
comment: Sexual activities involving multiple people, usually understood to be more than three people.
alternative label: Orgies
broader: https://homosaurus.org/v3/homoit0001299
change note: Version 3.7.0
has top concept: Sexual practices
in scheme: v3
narrower: https://homosaurus.org/v3/homoit0003128
related: https://homosaurus.org/v3/homoit0000242
related: https://homosaurus.org/v3/homoit0001123
related: https://homosaurus.org/v3/homoit0001124
related: https://homosaurus.org/v3/homoit0001272
related: https://homosaurus.org/v3/homoit0001306

Güevedoce
type: Concept
issued: 2019-05-14
modified: 2025-02-23
replaces: guevedoche
comment: In the Dominican Republic, this term refers to people who have undifferentiated genitalia and who are generally raised as female until puberty; may be considered a third gender.
alternative label: Guevedoche
broader: https://homosaurus.org/v3/homoit0000322
change note: Version 3.7.0
has top concept: Gender
in scheme: v3

Hair
type: Concept
issued: 2019-05-14
modified: 2025-02-23
replaces: hair
comment: Threadlike strands of keratin growing out of the skin on the body. Use in reference to hair as a secondary sex characteristic or as a form of self expression.
broader: https://homosaurus.org/v3/homoit0001259
change note: Version 3.7.0
has top concept: Sex (Body)
in scheme: v3
narrower: https://homosaurus.org/v3/homoit0002287

Hair removal
type: Concept
issued: 2019-05-14
modified: 2025-02-23
replaces: hairRemoval
comment: The process of removing hair from the body through shaving, waxing, depilatories, laser hair removal, etc. May have a social component related to gender identity and/or have an erotic component.
alternative label: Shaving
alternative label: Waxing
broader: https://homosaurus.org/v3/homoit0000568
change note: Version 3.7.0
has top concept: Gender
in scheme: v3
related: https://homosaurus.org/v3/homoit0001465
related: https://homosaurus.org/v3/homoit0003049

Halloween (LGBTQ+ culture)
type: Concept
issued: 2019-05-14
modified: 2025-02-23
replaces: halloween
comment: The celebration of Halloween, often called Gay Christmas, by LGBTQ+ people. Typically involves dressing in drag or elaborate costumes as a form of gender play and attending large parties in LGBTQ+ neighborhoods or establishments.
alternative label: Gay Christmas
alternative label: Gay Halloween
broader: https://homosaurus.org/v3/homoit0000861
change note: Version 3.7.0
has top concept: LGBTQ+ events
in scheme: v3
related: https://homosaurus.org/v3/homoit0001808

Handcuffs
type: Concept
issued: 2019-05-14
modified: 2025-02-23
replaces: handcuffs
comment: A restraint device designed to secure an individual’s wrists.
alternative label: Handcuff restraints
broader: https://homosaurus.org/v3/homoit0003117
change note: Version 3.7.0
has top concept: Sex accessories
in scheme: v3

Handkerchief codes
type: Concept
issued: 2019-05-14
modified: 2025-02-23
replaces: handkerchiefCodes
comment: A color-coded system to indicate preferred sexual fetishes and identify whether a person is a top/dominant or bottom/submissive.
alternative label: Hanky codes
broader: https://homosaurus.org/v3/homoit0000954
change note: Version 3.7.0
has top concept: LGBTQ+ symbols
in scheme: v3
related: https://homosaurus.org/v3/homoit0000442
related: https://homosaurus.org/v3/homoit0001267
related: https://homosaurus.org/v3/homoit0001299
related: https://homosaurus.org/v3/homoit0001304
related: https://homosaurus.org/v3/homoit0002192

Harnesses
type: Concept
issued: 2019-05-14
modified: 2025-02-23
replaces: harnesses
comment: Wearable accessories, typically consisting of leather straps and metal rings or points of attachment. May be worn as a fashion statement, to signal one's belonging to the leather or BDSM communities, or during sex to restrict movement, increase pleasure, and/or to permit the attachment of a sex accessory, such as a dildo.
broader: https://homosaurus.org/v3/homoit0001266
broader: https://homosaurus.org/v3/homoit0003059
change note: Version 3.7.0
has top concept: Sex accessories
in scheme: v3
narrower: https://homosaurus.org/v3/homoit0000252
narrower: https://homosaurus.org/v3/homoit0000354
narrower: https://homosaurus.org/v3/homoit0001367

LGBTQ+ victims of hate crimes
type: Concept
issued: 2019-05-14
modified: 2025-02-23
replaces: victimsOfHateCrimesLGBTQ
comment: LGBTQ+ people who have experienced hate crimes and may or may not have survived; follow the individual's preference for "victims" or "survivors" whenever possible.
alternative label: Hate crime victims (LGBTQ)
alternative label: Victims of hate crimes (LGBTQ)
broader: https://homosaurus.org/v3/homoit0000312
change note: Version 3.7.0
has top concept: LGBTQ+ people
in scheme: v3
narrower: https://homosaurus.org/v3/homoit0000196
narrower: https://homosaurus.org/v3/homoit0000551
narrower: https://homosaurus.org/v3/homoit0000792
narrower: https://homosaurus.org/v3/homoit0001221
narrower: https://homosaurus.org/v3/homoit0001349
narrower: https://homosaurus.org/v3/homoit0001456
narrower: https://homosaurus.org/v3/homoit0002895
narrower: https://homosaurus.org/v3/homoit0002948
related: https://homosaurus.org/v3/homoit0000059
related: https://homosaurus.org/v3/homoit0000109
related: https://homosaurus.org/v3/homoit0002732

Hemaneh
type: Concept
issued: 2019-05-14
modified: 2025-02-23
replaces: hemaneh
comment: Cheyenne term for a half-man, half-woman persona.
broader: https://homosaurus.org/v3/homoit0000322
change note: Version 3.7.0
has top concept: Gender
in scheme: v3

Herbal treatments
type: Concept
issued: 2019-05-14
modified: 2025-02-23
replaces: herbalTreatments
comment: The use of plants to improve health, prevent disease, and/or treat illness.
broader: https://homosaurus.org/v3/homoit0001366
change note: Version 3.7.0
has top concept: Medical care
in scheme: v3
related: https://homosaurus.org/v3/homoit0001047
related: https://homosaurus.org/v3/homoit0001049

Intersex people
type: Concept
issued: 2019-05-14
modified: 2025-02-23
replaces: intersexPeople
comment: Individuals born with variations in their genitalia, hormones, internal anatomy, and/or chromosomes that do not fully or exclusively conform to medical or social expectations for males or females. Only use to describe people who describe themselves as intersex.
alternative label: Hermaphrodites
alternative label: Intersexuals
alternative label: Hermaphroditic people
alternative label: Intersex-identified people
alternative label: Intersexual people
broader: https://homosaurus.org/v3/homoit0000915
change note: Version 3.7.0
has top concept: LGBTQ+ people
in scheme: v3
narrower: https://homosaurus.org/v3/homoit0000668
narrower: https://homosaurus.org/v3/homoit0000674
narrower: https://homosaurus.org/v3/homoit0002825
narrower: https://homosaurus.org/v3/homoit0003039
narrower: https://homosaurus.org/v3/homoit0003225
related: https://homosaurus.org/v3/homoit0000046
related: https://homosaurus.org/v3/homoit0000352
related: https://homosaurus.org/v3/homoit0000669
related: https://homosaurus.org/v3/homoit0000670
related: https://homosaurus.org/v3/homoit0000671
related: https://homosaurus.org/v3/homoit0000672
related: https://homosaurus.org/v3/homoit0000673
related: https://homosaurus.org/v3/homoit0001759
related: https://homosaurus.org/v3/homoit0001763
related: https://homosaurus.org/v3/homoit0001767
related: https://homosaurus.org/v3/homoit0001822
related: https://homosaurus.org/v3/homoit0002744

Heteronormativity
type: Concept
issued: 2019-05-14
modified: 2025-02-23
replaces: heteronormativity
comment: The notion or belief that heterosexuality is the normal or preferred sexual orientation.
alternative label: Heterosexual norms
broader: https://homosaurus.org/v3/homoit0001323
change note: Version 3.7.0
has top concept: Social norms
in scheme: v3
related: https://homosaurus.org/v3/homoit0000080
related: https://homosaurus.org/v3/homoit0000619
related: https://homosaurus.org/v3/homoit0000644
related: https://homosaurus.org/v3/homoit0003445

Heterosexual boys
type: Concept
issued: 2019-05-14
modified: 2025-02-23
replaces: heterosexualBoys
comment: Boys (typically children or youth younger than 18) who are heterosexual.
alternative label: Straight boys
broader: https://homosaurus.org/v3/homoit0000220
broader: https://homosaurus.org/v3/homoit0000630
broader: https://homosaurus.org/v3/homoit0002285
change note: Version 3.7.0
has top concept: Family members
in scheme: v3

Heterosexual feminism
type: Concept
issued: 2019-05-14
modified: 2025-02-23
replaces: heterosexualFeminism
comment: A form of feminism that prioritizes the experiences of heterosexual women and focuses on securing equitable economic, political, and social rights for heterosexual women. Often discussed in juxtaposition to political lesbianism.
broader: https://homosaurus.org/v3/homoit0000437
change note: Version 3.7.0
has top concept: Feminism
in scheme: v3
related: https://homosaurus.org/v3/homoit0000741
related: https://homosaurus.org/v3/homoit0001133

Heterosexual girls
type: Concept
issued: 2019-05-14
modified: 2025-02-23
replaces: heterosexualGirls
comment: Girls (typically children or youth younger than 18) who are heterosexual.
alternative label: Straight girls
broader: https://homosaurus.org/v3/homoit0000590
broader: https://homosaurus.org/v3/homoit0000630
broader: https://homosaurus.org/v3/homoit0002285
change note: Version 3.7.0
has top concept: Family members
in scheme: v3

Heterosexual identity
type: Concept
issued: 2019-05-14
modified: 2025-02-23
replaces: heterosexualIdentity
comment: Term used to describe the sexual identity of individuals who are romantically and/or sexually attracted to people assigned the “opposite” sex at birth.
broader: https://homosaurus.org/v3/homoit0001295
change note: Version 3.7.0
has top concept: Sexual identity
in scheme: v3
related: https://homosaurus.org/v3/homoit0000627

Heterosexual marriage
type: Concept
issued: 2019-05-14
modified: 2025-02-23
replaces: heterosexualMarriage
comment: The legally and formally recognized union of a heterosexual man and woman as partners in a personal relationship.
broader: https://homosaurus.org/v3/homoit0000990
change note: Version 3.7.0
has top concept: Living arrangements
in scheme: v3

Heterosexual men
type: Concept
issued: 2019-05-14
modified: 2025-02-23
replaces: heterosexualMen
comment: Men who identify as heterosexual, or straight.
alternative label: Straight men
broader: https://homosaurus.org/v3/homoit0000627
broader: https://homosaurus.org/v3/homoit0001008
change note: Version 3.7.0
has top concept: Heterosexuals
in scheme: v3
narrower: https://homosaurus.org/v3/homoit0000381
narrower: https://homosaurus.org/v3/homoit0000417

Heterosociality
type: Concept
issued: 2019-05-14
modified: 2025-02-23
replaces: heterosociality
comment: In sociology, this term is used to describe social relations and bonds between members of the opposite sex or gender in a given culture. Typically excludes romantic and sexual relationships.
alternative label: Heterosexual social relationships
alternative label: Heterosocial bonds
broader: https://homosaurus.org/v3/homoit0001237
change note: Version 3.7.0
has top concept: LGBTQ+ relationships
in scheme: v3
related: https://homosaurus.org/v3/homoit0000649

Heterosexual women
type: Concept
issued: 2019-05-14
modified: 2025-02-23
replaces: heterosexualWomen
comment: Women who identify as heterosexual, or straight.
alternative label: Straight women
broader: https://homosaurus.org/v3/homoit0000627
broader: https://homosaurus.org/v3/homoit0001509
change note: Version 3.7.0
has top concept: Heterosexuals
in scheme: v3
narrower: https://homosaurus.org/v3/homoit0000416
narrower: https://homosaurus.org/v3/homoit0000598

Heterosexual youth
type: Concept
issued: 2019-05-14
modified: 2025-02-23
replaces: heterosexualYouth
comment: Heterosexual people between the ages of childhood and adulthood.
alternative label: Straight youth
alternative label: Heterosexual adolescents
alternative label: Heterosexual teenagers
alternative label: Heterosexual teens
alternative label: Straight adolescents
alternative label: Straight teenagers
alternative label: Straight teens
broader: https://homosaurus.org/v3/homoit0000627
broader: https://homosaurus.org/v3/homoit0001520
change note: Version 3.7.0
has top concept: Heterosexuals
in scheme: v3
narrower: https://homosaurus.org/v3/homoit0000621
narrower: https://homosaurus.org/v3/homoit0000623
narrower: https://homosaurus.org/v3/homoit0002285
related: https://homosaurus.org/v3/homoit0001521

Heterosexuality
type: Concept
issued: 2019-05-14
modified: 2025-02-23
replaces: heterosexuality
comment: Romantic and sexual attraction to members of the opposite sex or gender, typically in a culture that understands sex and gender through the binary opposition of male/female or man/woman.
broader: https://homosaurus.org/v3/homoit0001298
broader: https://homosaurus.org/v3/homoit0001556
change note: Version 3.7.0
has top concept: Sexual orientation
in scheme: v3
related: https://homosaurus.org/v3/homoit0000619
related: https://homosaurus.org/v3/homoit0000627
related: https://homosaurus.org/v3/homoit0000647
related: https://homosaurus.org/v3/homoit0003445

Hijras
type: Concept
issued: 2019-05-14
modified: 2025-02-23
replaces: hijra
comment: Hindi word used in South Asia to refer to people assigned male at birth who identify as women or “not-men.”
alternative label: Jagappa
broader: https://homosaurus.org/v3/homoit0000322
change note: Version 3.7.0
has top concept: Gender
in scheme: v3
related: https://homosaurus.org/v3/homoit0000065
related: https://homosaurus.org/v3/homoit0000240
related: https://homosaurus.org/v3/homoit0000246
related: https://homosaurus.org/v3/homoit0000684
related: https://homosaurus.org/v3/homoit0000688
related: https://homosaurus.org/v3/homoit0000690
related: https://homosaurus.org/v3/homoit0000694

LGBTQ+ Hindus
type: Concept
issued: 2019-05-14
modified: 2025-02-23
replaces: LGBTQHindus
comment: LGBTQ+ people who are Hindu.
alternative label: Hindus (LGBTQ)
alternative label: LGBTQ Hindus
broader: https://homosaurus.org/v3/homoit0000928
change note: Version 3.7.0
has top concept: LGBTQ+ religious people
in scheme: v3

HIV-undetectable people
type: Concept
issued: 2019-05-14
modified: 2025-02-23
replaces: HIVUndetectablePeople
comment: People who have contracted HIV and received treatment to reduce their HIV antibodies to an amount that can no longer be detected by standard HIV tests.
broader: https://homosaurus.org/v3/homoit0000636
change note: Version 3.7.0
has top concept: HIV-positive people
in scheme: v3
related: https://homosaurus.org/v3/homoit0000005
related: https://homosaurus.org/v3/homoit0000635
related: https://homosaurus.org/v3/homoit0000639

Murders of LGBTQ+ people
type: Concept
issued: 2019-05-14
modified: 2025-02-23
replaces: murdersOfLGBTQPeople
comment: Intentional killing of LGBTQ+ people due to their gender and/or sexual identities.
alternative label: Homicides of LGBTQ people
alternative label: Murders of LGBTQ people
broader: https://homosaurus.org/v3/homoit0000059
change note: Version 3.7.0
has top concept: Anti-LGBTQ+ violence
in scheme: v3
related: https://homosaurus.org/v3/homoit0000109

Homonormativity
type: Concept
issued: 2019-05-14
modified: 2025-02-23
replaces: homonormativity
comment: The projection of heteronormative ideals and constructs onto LGBTQ+ cultures and identities, predicated on the assumption that LGBTQ+ people (particularly cisgender gay men and lesbians) must conform to the norms and values of heterosexuality (e.g., the gender binary, marriage, procreation, and monogamy) in order to be viewed as "normal" and gain social acceptance.
alternative label: Homosexual norms
broader: https://homosaurus.org/v3/homoit0001323
change note: Version 3.7.0
has top concept: Social norms
in scheme: v3
related: https://homosaurus.org/v3/homoit0000080
related: https://homosaurus.org/v3/homoit0000620

Homophiles
type: Concept
issued: 2019-05-14
modified: 2025-02-23
replaces: homophiles
comment: Outdated term for lesbians and gay men. The use of the word began to disappear with the emergence of the gay liberation movement of the late 1960s and early 1970s.
broader: https://homosaurus.org/v3/homoit0000878
change note: Version 3.7.0
has top concept: LGBTQ+ historical terms
in scheme: v3
related: https://homosaurus.org/v3/homoit0001297

Homophobia
type: Concept
issued: 2019-05-14
modified: 2025-02-23
replaces: homophobia
comment: Antagonism or disgust directed towards homosexuality as an identity or men who are perceived to be or are actually gay. Homophobia can include denial of the existence of homosexuality, stereotypes, verbal harassment, and physical violence. This term is often used colloquially to encompass all LGBTQ+ phobia.
broader: https://homosaurus.org/v3/homoit0000920
change note: Version 3.7.0
has top concept: LGBTQ+ phobia
in scheme: v3
narrower: https://homosaurus.org/v3/homoit0000391
narrower: https://homosaurus.org/v3/homoit0002174
related: https://homosaurus.org/v3/homoit0000055
related: https://homosaurus.org/v3/homoit0000056
related: https://homosaurus.org/v3/homoit0000506
related: https://homosaurus.org/v3/homoit0000619

Homosexuality
type: Concept
issued: 2019-05-14
modified: 2025-02-23
replaces: homosexuality
comment: Sexual orientation with sexual and/or romantic attraction to individuals of the same sex.
broader: https://homosaurus.org/v3/homoit0001298
broader: https://homosaurus.org/v3/homoit0001556
change note: Version 3.7.0
has top concept: Sexual orientation
in scheme: v3
narrower: https://homosaurus.org/v3/homoit0001240
related: https://homosaurus.org/v3/homoit0000204
related: https://homosaurus.org/v3/homoit0000506
related: https://homosaurus.org/v3/homoit0000556
related: https://homosaurus.org/v3/homoit0000631
related: https://homosaurus.org/v3/homoit0000799

Homosexuals
type: Concept
issued: 2019-05-14
modified: 2025-02-23
replaces: homosexuals
comment: Outdated term for lesbians and gay men.
broader: https://homosaurus.org/v3/homoit0000878
change note: Version 3.7.0
has top concept: LGBTQ+ historical terms
in scheme: v3
related: https://homosaurus.org/v3/homoit0001297
related: https://homosaurus.org/v3/homoit0001531
related: https://homosaurus.org/v3/homoit0001915

Hormone blockers
type: Concept
issued: 2019-05-14
modified: 2025-02-23
replaces: hormoneBlockers
comment: Medications used to block the body from producing certain hormones in order to replace or supplement them with other types of hormones.
broader: https://homosaurus.org/v3/homoit0000317
broader: https://homosaurus.org/v3/homoit0001007
change note: Version 3.7.0
has top concept: Medical care
in scheme: v3
narrower: https://homosaurus.org/v3/homoit0001138

Hormones
type: Concept
issued: 2019-05-14
modified: 2025-02-23
replaces: hormones
comment: Regulatory substances produced in organisms and transported throughout the body to stimulate specific cells or tissues into action. Though hormones regulate digestion, respiration, sleep, and many other bodily functions, the term is most commonly used by the general public to describe the "sex hormones," or the hormones involved in puberty and sexual development, reproduction, and sexual desire.
broader: https://homosaurus.org/v3/homoit0001269
change note: Version 3.7.0
has top concept: Sex (Body)
in scheme: v3
narrower: https://homosaurus.org/v3/homoit0000407
narrower: https://homosaurus.org/v3/homoit0001362
narrower: https://homosaurus.org/v3/homoit0002820
related: https://homosaurus.org/v3/homoit0002876

Hwame
type: Concept
issued: 2019-05-14
modified: 2025-02-23
replaces: hwame
comment: In Native American Mohave tribes, hwame are people assigned female at birth who exhibit masculine traits and are socially male.
broader: https://homosaurus.org/v3/homoit0000322
change note: Version 3.7.0
has top concept: Gender
in scheme: v3
related: https://homosaurus.org/v3/homoit0000039
related: https://homosaurus.org/v3/homoit0001480

Machismo
type: Concept
issued: 2019-05-14
modified: 2025-02-23
replaces: machismo
comment: Term originating in the early 1930s and 40s to describe a man's responsibility and pride in providing for, protecting, and defending his family. It is unclear whether the term originates in Spain or Portugal. Though there are positive sides of machismo and it remains an important part of Iberian and Latin American cultures, the concept has also been criticized for its perceived role in perpetuating misogyny, harmful gender roles, and domestic and sexual violence.
broader: https://homosaurus.org/v3/homoit0000577
change note: Version 3.7.0
has top concept: Role behavior
in scheme: v3
related: https://homosaurus.org/v3/homoit0000978
related: https://homosaurus.org/v3/homoit0000995
related: https://homosaurus.org/v3/homoit0001377

Hypospadias
type: Concept
issued: 2019-05-14
modified: 2025-02-23
replaces: hypospadias
comment: People with hypospadias are born with their urinary opening located somewhere other than the tip of the penis. In "distal hypospadias," the urinary opening is elsewhere on the glans (head) of the penis, whereas in "proximal hypospadias," it is on the underside of the penis and sometimes further back near the scrotum. Hypospadias is one of the most common and visible genital variations. People with hypospadias often have additional variations like chordee (a bend in the penis) or cryptorchidism (undescended testicles).
broader: https://homosaurus.org/v3/homoit0000669
change note: Version 3.7.0
has top concept: Sex (Body)
in scheme: v3

Hysterectomy
type: Concept
issued: 2019-05-14
modified: 2025-02-23
replaces: hysterectomy
comment: Surgical procedure to remove the uterus.
broader: https://homosaurus.org/v3/homoit0000584
change note: Version 3.7.0
has top concept: Medical care
in scheme: v3

In vitro fertilization
type: Concept
issued: 2019-05-14
modified: 2025-02-23
replaces: inVitroFertilisation
comment: Medical practice of achieving fertilization by combining sperm and eggs in laboratory settings to induce pregnancy.
alternative label: IVF
broader: https://homosaurus.org/v3/homoit0000843
broader: https://homosaurus.org/v3/homoit0002618
change note: Version 3.7.0
has top concept: LGBTQ+ family planning
in scheme: v3
narrower: https://homosaurus.org/v3/homoit0001234
preferred label: In vitro fertilisation
related: https://homosaurus.org/v3/homoit0002629

LGBTQ+ information centers
type: Concept
issued: 2019-05-14
modified: 2025-02-23
replaces: informationCentresLGBTQ
comment: An institution that locates and compiles information for the LGBTQ+ community into a central database that can be accessed by the public.
broader: https://homosaurus.org/v3/homoit0000830
change note: Version 3.7.0
has top concept: LGBTQ+ centers
in scheme: v3
narrower: https://homosaurus.org/v3/homoit0000026
narrower: https://homosaurus.org/v3/homoit0000147
narrower: https://homosaurus.org/v3/homoit0000490
narrower: https://homosaurus.org/v3/homoit0000737
narrower: https://homosaurus.org/v3/homoit0001179
narrower: https://homosaurus.org/v3/homoit0001409
narrower: https://homosaurus.org/v3/homoit0002747
narrower: https://homosaurus.org/v3/homoit0002793
preferred label: LGBTQ+ information centres
related: https://homosaurus.org/v3/homoit0000661
related: https://homosaurus.org/v3/homoit0002696

Sexual intercourse
type: Concept
issued: 2019-05-14
modified: 2025-02-23
replaces: sexualIntercourse
comment: Term used to describe sexual activity between two or more people, typically involving penetration.
broader: https://homosaurus.org/v3/homoit0001267
broader: https://homosaurus.org/v3/homoit0001299
change note: Version 3.7.0
has top concept: Sex (Act)
in scheme: v3
related: https://homosaurus.org/v3/homoit0000459
related: https://homosaurus.org/v3/homoit0000588
related: https://homosaurus.org/v3/homoit0001342

Intergenerational relationships
type: Concept
issued: 2019-05-14
modified: 2025-02-23
replaces: intergenerationalRelationships
comment: Ongoing connections (romantic, sexual, play, or platonic) between two or more people of different age groups or from different generations.
broader: https://homosaurus.org/v3/homoit0001237
change note: Version 3.7.0
has top concept: LGBTQ+ relationships
in scheme: v3
related: https://homosaurus.org/v3/homoit0000020
related: https://homosaurus.org/v3/homoit0001295
related: https://homosaurus.org/v3/homoit0001636

Internet forums
type: Concept
issued: 2019-05-14
modified: 2025-02-23
replaces: internetForums
comment: Websites designed to facilitate discussion amongst users through posted messages.
broader: https://homosaurus.org/v3/homoit0001321
change note: Version 3.7.0
has top concept: Social media
in scheme: v3
narrower: https://homosaurus.org/v3/homoit0000888

Intersexphobia
type: Concept
issued: 2019-05-14
modified: 2025-02-23
replaces: intersexphobia
comment: Antagonism or disgust directed toward intersex people or intersex variations. Intersexphobia can include the denial of the existence of intersex people, insistence that intersex variations should be forcibly "corrected," stereotypes, verbal harassment, and physical violence.
alternative label: Interphobia
broader: https://homosaurus.org/v3/homoit0000920
change note: Version 3.7.0
has top concept: LGBTQ+ phobia
in scheme: v3
narrower: https://homosaurus.org/v3/homoit0002595
related: https://homosaurus.org/v3/homoit0000352
related: https://homosaurus.org/v3/homoit0000619
related: https://homosaurus.org/v3/homoit0000670
related: https://homosaurus.org/v3/homoit0001770
related: https://homosaurus.org/v3/homoit0001893

Intersex children
type: Concept
issued: 2019-05-14
modified: 2025-02-23
replaces: intersexChildren
comment: Children younger than 18 years who describe themselves as intersex.
broader: https://homosaurus.org/v3/homoit0000256
broader: https://homosaurus.org/v3/homoit0000618
broader: https://homosaurus.org/v3/homoit0000674
change note: Version 3.7.0
has top concept: Family members
in scheme: v3
related: https://homosaurus.org/v3/homoit0001268

Intersex variations
type: Concept
issued: 2019-05-14
modified: 2025-02-23
replaces: intersexConditions
comment: Term used to refer to a wide range of variations in sex characteristics. The term "intersex conditions" is a pathologizing term used to mean people born with variations in their physical sex characteristics also known as intersex traits.
alternative label: Intersex conditions
broader: https://homosaurus.org/v3/homoit0000352
broader: https://homosaurus.org/v3/homoit0001006
change note: Version 3.7.0
has top concept: Sex (Body)
in scheme: v3
narrower: https://homosaurus.org/v3/homoit0000001
narrower: https://homosaurus.org/v3/homoit0000044
narrower: https://homosaurus.org/v3/homoit0000064
narrower: https://homosaurus.org/v3/homoit0000283
narrower: https://homosaurus.org/v3/homoit0000301
narrower: https://homosaurus.org/v3/homoit0000599
narrower: https://homosaurus.org/v3/homoit0000657
narrower: https://homosaurus.org/v3/homoit0000692
narrower: https://homosaurus.org/v3/homoit0001014
narrower: https://homosaurus.org/v3/homoit0001020
narrower: https://homosaurus.org/v3/homoit0001066
narrower: https://homosaurus.org/v3/homoit0001079
narrower: https://homosaurus.org/v3/homoit0001134
narrower: https://homosaurus.org/v3/homoit0001354
narrower: https://homosaurus.org/v3/homoit0001478
narrower: https://homosaurus.org/v3/homoit0002818
narrower: https://homosaurus.org/v3/homoit0002819
narrower: https://homosaurus.org/v3/homoit0002821
narrower: https://homosaurus.org/v3/homoit0002822
narrower: https://homosaurus.org/v3/homoit0002823
narrower: https://homosaurus.org/v3/homoit0002824
narrower: https://homosaurus.org/v3/homoit0002826
narrower: https://homosaurus.org/v3/homoit0002828
narrower: https://homosaurus.org/v3/homoit0002829
narrower: https://homosaurus.org/v3/homoit0002831
narrower: https://homosaurus.org/v3/homoit0002832
narrower: https://homosaurus.org/v3/homoit0002833
narrower: https://homosaurus.org/v3/homoit0002836
narrower: https://homosaurus.org/v3/homoit0002837
narrower: https://homosaurus.org/v3/homoit0002838
narrower: https://homosaurus.org/v3/homoit0002839
narrower: https://homosaurus.org/v3/homoit0002842
narrower: https://homosaurus.org/v3/homoit0002843
narrower: https://homosaurus.org/v3/homoit0002848
narrower: https://homosaurus.org/v3/homoit0002861
narrower: https://homosaurus.org/v3/homoit0002862
narrower: https://homosaurus.org/v3/homoit0002863
narrower: https://homosaurus.org/v3/homoit0002864
narrower: https://homosaurus.org/v3/homoit0002865
narrower: https://homosaurus.org/v3/homoit0002870
narrower: https://homosaurus.org/v3/homoit0002871
narrower: https://homosaurus.org/v3/homoit0002872
narrower: https://homosaurus.org/v3/homoit0002873
narrower: https://homosaurus.org/v3/homoit0002875
narrower: https://homosaurus.org/v3/homoit0002878
narrower: https://homosaurus.org/v3/homoit0002883
narrower: https://homosaurus.org/v3/homoit0002885
related: https://homosaurus.org/v3/homoit0000618
related: https://homosaurus.org/v3/homoit0001268
related: https://homosaurus.org/v3/homoit0001646

Intersex movement
type: Concept
issued: 2019-05-14
modified: 2025-02-23
replaces: intersexMovement
comment: Umbrella term for activism focused on the rights of intersex people and issues faced by intersex communities.
broader: https://homosaurus.org/v3/homoit0001026
change note: Version 3.7.0
has top concept: Social movements
in scheme: v3
related: https://homosaurus.org/v3/homoit0000352
related: https://homosaurus.org/v3/homoit0000618
related: https://homosaurus.org/v3/homoit0000805
related: https://homosaurus.org/v3/homoit0000807
related: https://homosaurus.org/v3/homoit0000882
related: https://homosaurus.org/v3/homoit0001322

Intersex rights
type: Concept
issued: 2019-05-14
modified: 2025-02-23
replaces: intersexRights
comment: Legal, social, or ethical principles of freedom or entitlement held by intersex people. Often used to refer to intersex people's right to bodily autonomy and, specifically, their right to delay or decline unnecessary medical interventions.
broader: https://homosaurus.org/v3/homoit0000652
change note: Version 3.7.0
has top concept: Human rights
in scheme: v3
related: https://homosaurus.org/v3/homoit0000276
related: https://homosaurus.org/v3/homoit0000618
related: https://homosaurus.org/v3/homoit0000670

Intersex youth
type: Concept
issued: 2019-05-14
modified: 2025-02-23
replaces: intersexYouth
comment: Intersex people between the age of childhood and adulthood.
alternative label: Intersex adolescents
alternative label: Intersex teenagers
alternative label: Intersex teens
broader: https://homosaurus.org/v3/homoit0000618
broader: https://homosaurus.org/v3/homoit0001520
change note: Version 3.7.0
has top concept: LGBTQ+ people
in scheme: v3
narrower: https://homosaurus.org/v3/homoit0000668
related: https://homosaurus.org/v3/homoit0001521

Intimate partner violence
type: Concept
issued: 2019-05-14
modified: 2025-02-23
replaces: intimatePartnerViolence
comment: Acts of violence or abuse directed against an individual by their current or former partner in a romantic, sexual, or play relationship.
alternative label: Intimate partner abuse
broader: https://homosaurus.org/v3/homoit0000855
change note: Version 3.7.0
has top concept: Anti-LGBTQ+ violence
in scheme: v3
related: https://homosaurus.org/v3/homoit0000918
related: https://homosaurus.org/v3/homoit0001133
related: https://homosaurus.org/v3/homoit0001293
related: https://homosaurus.org/v3/homoit0001311

Inuit LGBTQ+ people
type: Concept
issued: 2019-05-14
modified: 2025-02-23
replaces: LGBTQInuit
comment: LGBTQ+ people who are Inuit, or part of several Indigenous peoples inhabiting the Inuit homeland in the Arctic and subarctic regions of Greenland, Canada, and Alaska. Only use for people who identify as Inuit.
alternative label: Inuit (LGBTQ)
alternative label: Inuit people (LGBTQ)
alternative label: LGBTQ+ Inuit
alternative label: LGBTQ+ Inuit people
broader: https://homosaurus.org/v3/homoit0000886
change note: Version 3.7.0
has top concept: LGBTQ+ people
in scheme: v3
narrower: https://homosaurus.org/v3/homoit0001962
narrower: https://homosaurus.org/v3/homoit0001963
narrower: https://homosaurus.org/v3/homoit0001964
narrower: https://homosaurus.org/v3/homoit0001965
narrower: https://homosaurus.org/v3/homoit0001966
narrower: https://homosaurus.org/v3/homoit0001967
narrower: https://homosaurus.org/v3/homoit0002923
narrower: https://homosaurus.org/v3/homoit0003410
related: https://homosaurus.org/v3/homoit0001809
related: https://homosaurus.org/v3/homoit0001810

Inverts
type: Concept
issued: 2019-05-14
modified: 2025-02-23
replaces: inverts
comment: Outdated, historical term used for LGBTQ+ people.
alternative label: Sexual inverts
broader: https://homosaurus.org/v3/homoit0000878
change note: Version 3.7.0
has top concept: LGBTQ+ historical terms
in scheme: v3
related: https://homosaurus.org/v3/homoit0001296
related: https://homosaurus.org/v3/homoit0001297
related: https://homosaurus.org/v3/homoit0001564

Jankha
type: Concept
issued: 2019-05-14
modified: 2025-02-23
replaces: jankha
comment: In India, this term is used to describe people assigned male at birth who take on female dress and characteristics but who do not elect to receive castration.
broader: https://homosaurus.org/v3/homoit0000322
change note: Version 3.7.0
has top concept: Gender
in scheme: v3

LGBTQ+ Jehovah's Witnesses
type: Concept
issued: 2019-05-14
modified: 2025-02-23
replaces: LGBTQJehovahsWitnesses
comment: LGBTQ+ people who are Jehovah’s Witnesses.
alternative label: LGBTQ Jehova's Witnesses
alternative label: Jehova's Witnesses (LGBTQ)
alternative label: LGBTQ Jehovah's Witnesses
broader: https://homosaurus.org/v3/homoit0000265
change note: Version 3.7.0
has top concept: LGBTQ+ religious people
in scheme: v3

Jerking off
type: Concept
issued: 2019-05-14
modified: 2025-02-23
replaces: jerkingOff
comment: Slang term for masturbation; typically refers to manual stimulation of the penis.
alternative label: Jacking off
alternative label: Jerking it
broader: https://homosaurus.org/v3/homoit0001000
change note: Version 3.7.0
has top concept: Sex (Act)
in scheme: v3

Jewish LGBTQ+ people
type: Concept
issued: 2019-05-14
modified: 2025-02-23
replaces: jewsLGBTQ
comment: LGBTQ+ people who are Jewish.
alternative label: Jews (LGBTQ)
alternative label: LGBTQ+ Jews
broader: https://homosaurus.org/v3/homoit0000860
broader: https://homosaurus.org/v3/homoit0000928
change note: Version 3.7.0
has top concept: LGBTQ+ people
in scheme: v3
narrower: https://homosaurus.org/v3/homoit0000154
narrower: https://homosaurus.org/v3/homoit0000497
narrower: https://homosaurus.org/v3/homoit0000745
narrower: https://homosaurus.org/v3/homoit0001180
narrower: https://homosaurus.org/v3/homoit0001416
narrower: https://homosaurus.org/v3/homoit0002767
narrower: https://homosaurus.org/v3/homoit0002908
narrower: https://homosaurus.org/v3/homoit0003411

Jizz
type: Concept
issued: 2019-05-14
modified: 2025-02-23
replaces: jizz
comment: Slang term for semen; primarily used in the United States.
broader: https://homosaurus.org/v3/homoit0003061
change note: Version 3.7.0
has top concept: Body fluids
in scheme: v3
related: https://homosaurus.org/v3/homoit0000323
related: https://homosaurus.org/v3/homoit0000589
related: https://homosaurus.org/v3/homoit0000610
related: https://homosaurus.org/v3/homoit0001062
related: https://homosaurus.org/v3/homoit0001284
related: https://homosaurus.org/v3/homoit0001288
related: https://homosaurus.org/v3/homoit0003128

Jogappa
type: Concept
issued: 2019-05-14
modified: 2025-02-23
replaces: jogappa
comment: In India, this term is used to describe people assigned male at birth who become genderfluid in a spiritual conversion.
broader: https://homosaurus.org/v3/homoit0000322
change note: Version 3.7.0
has top concept: Gender
in scheme: v3
related: https://homosaurus.org/v3/homoit0000632

Kabuki
type: Concept
issued: 2019-05-14
modified: 2025-02-23
replaces: kabuki
comment: A form of theatre in Japan that often features crossdressing actors. Historically, female performers played both male and female roles, but women were later banned from performing and were replaced with male performers who played both male and female roles.
broader: https://homosaurus.org/v3/homoit0001363
change note: Version 3.7.0
has top concept: LGBTQ+ theater
in scheme: v3
related: https://homosaurus.org/v3/homoit0000318

Katoey
type: Concept
issued: 2019-05-14
modified: 2025-02-23
replaces: katoey
comment: In Thailand, this term refers to a range of people of non-normative gender expressions, including intersex people, transgender women, and effeminate gay men. Some regard this term as outdated and offensive, while others self-identify with it. Only use to describe people who self-identify as katoey.
alternative label: Ladyboy
alternative label: Kathoey
broader: https://homosaurus.org/v3/homoit0000322
broader: https://homosaurus.org/v3/homoit0001297
change note: Version 3.7.0
has top concept: Gender
in scheme: v3
related: https://homosaurus.org/v3/homoit0000340
related: https://homosaurus.org/v3/homoit0001373

Khusra
type: Concept
issued: 2019-05-14
modified: 2025-02-23
replaces: khusra
comment: A term used in Pakistan and Northern India to describe third-gender people, typically people assigned male at birth who identify as female.
broader: https://homosaurus.org/v3/homoit0000322
change note: Version 3.7.0
has top concept: Gender
in scheme: v3
related: https://homosaurus.org/v3/homoit0000632

Khwaja sira
type: Concept
issued: 2019-05-14
modified: 2025-02-23
replaces: khawajaSara
comment: An umbrella term used in Pakistan and South Asia to describe people assigned male at birth who identify as women, intersex, or third gender.
alternative label: Khawaja sara
alternative label: Khwaja sara
alternative label: Khawaja sira
broader: https://homosaurus.org/v3/homoit0000322
change note: Version 3.7.0
has top concept: Gender
in scheme: v3

Kinnar
type: Concept
issued: 2019-05-14
modified: 2025-02-23
replaces: kinnar
comment: A variant term for hijra used in northern India.
broader: https://homosaurus.org/v3/homoit0000322
change note: Version 3.7.0
has top concept: Gender
in scheme: v3
related: https://homosaurus.org/v3/homoit0000632

Kissing
type: Concept
issued: 2019-05-14
modified: 2025-02-23
replaces: kissing
comment: Touching or pressing one's lips to another person or an object to communicate a greeting, affection, reverence, love, or sexual desire.
broader: https://homosaurus.org/v3/homoit0000593
broader: https://homosaurus.org/v3/homoit0001112
broader: https://homosaurus.org/v3/homoit0001267
broader: https://homosaurus.org/v3/homoit0001299
change note: Version 3.7.0
has top concept: Sex (Act)
in scheme: v3

Klinefelter syndrome
type: Concept
issued: 2019-05-14
modified: 2025-02-23
replaces: klinefelterSyndrome
comment: People with Klinefelter syndrome develop with an extra copy of the X chromosome, resulting in a 47XXY pattern (instead of the typical 46XY). These individuals might have smaller-than-typical testes that produce lower amounts of testosterone and/or sperm, and they may start puberty later than typical (or may not go through puberty without hormone therapy). They may grow taller than usual, may develop breast tissue, and often experience infertility. This variation often does not cause obvious physical differences, and many people do not realize they have it.
alternative label: 47XXY
broader: https://homosaurus.org/v3/homoit0000669
change note: Version 3.7.0
has top concept: Sex (Body)
in scheme: v3

Köçek
type: Concept
issued: 2019-05-14
modified: 2025-02-23
replaces: köçek
comment: Turkish term for male dancers who crossdress in feminine attire for entertainment purposes.
broader: https://homosaurus.org/v3/homoit0000322
change note: Version 3.7.0
has top concept: Gender
in scheme: v3

Kothis
type: Concept
issued: 2019-05-14
modified: 2025-02-23
replaces: kothi
comment: In South Asia, this term is used to describe people who are assigned male at birth who exhibit feminine characteristics. Please note that not all kothis identify as hijra or transgender.
broader: https://homosaurus.org/v3/homoit0000322
change note: Version 3.7.0
has top concept: Gender
in scheme: v3
related: https://homosaurus.org/v3/homoit0000632

Khteuy
type: Concept
issued: 2019-05-14
modified: 2025-02-23
replaces: kteuy
comment: Khmer term for third sex people. Can be considered outdated and offensive.
alternative label: Kteuy
broader: https://homosaurus.org/v3/homoit0000322
broader: https://homosaurus.org/v3/homoit0001560
change note: Version 3.7.0
has top concept: Gender
in scheme: v3
related: https://homosaurus.org/v3/homoit0001253
related: https://homosaurus.org/v3/homoit0001338

Labrys
type: Concept
issued: 2019-05-14
modified: 2025-02-23
replaces: labrys
comment: Symbol used to represent lesbianism and feminism.
broader: https://homosaurus.org/v3/homoit0000954
change note: Version 3.7.0
has top concept: LGBTQ+ symbols
in scheme: v3

Lakin-on
type: Concept
issued: 2019-05-14
modified: 2025-02-23
replaces: lakinOn
comment: Cebuano term for women who are attracted to women and take on male personas and cultural work.
broader: https://homosaurus.org/v3/homoit0000322
change note: Version 3.7.0
has top concept: Gender
in scheme: v3

Lambda
type: Concept
issued: 2019-05-14
modified: 2025-02-23
replaces: lambda
comment: Symbol for lesbian and gay rights.
broader: https://homosaurus.org/v3/homoit0000954
change note: Version 3.7.0
has top concept: LGBTQ+ symbols
in scheme: v3

Latex gloves
type: Concept
issued: 2019-05-14
modified: 2025-02-23
replaces: latexGloves
comment: Protective coverings for the hands made from latex, a thin-plastic like material; often used as a barrier to protect against STIs while engaging in safer sex practices.
broader: https://homosaurus.org/v3/homoit0001266
broader: https://homosaurus.org/v3/homoit0003111
change note: Version 3.7.0
has top concept: Sex accessories
in scheme: v3
related: https://homosaurus.org/v3/homoit0001251

LBT
type: Concept
issued: 2019-05-14
modified: 2025-02-23
replaces: LBT
comment: Acronym used to describe lesbians, bisexuals, and transgender people as a group.
broader: https://homosaurus.org/v3/homoit0000594
change note: Version 3.7.0
has top concept: LGBTI
in scheme: v3

Leashes
type: Concept
issued: 2019-05-14
modified: 2025-02-23
replaces: leashes
comment: A length of rope or similar material used to control an individual, often to increase sexual arousal.
broader: https://homosaurus.org/v3/homoit0001266
change note: Version 3.7.0
has top concept: Sex accessories
in scheme: v3
related: https://homosaurus.org/v3/homoit0001238

Leather community
type: Concept
issued: 2019-05-14
modified: 2025-02-23
replaces: leatherCommunity
comment: An LGBTQ+ subculture that celebrates sexual freedom, kinks and fetishes with its own fashions (especially leather garments), clubs, and events.
alternative label: Leather scene
alternative label: Leather lifestyle
alternative label: Leather
broader: https://homosaurus.org/v3/homoit0000297
broader: https://homosaurus.org/v3/homoit0001345
change note: Version 3.7.0
has top concept: LGBTQ+ communities
in scheme: v3
narrower: https://homosaurus.org/v3/homoit0000217
narrower: https://homosaurus.org/v3/homoit0000706
narrower: https://homosaurus.org/v3/homoit0000707
narrower: https://homosaurus.org/v3/homoit0000708
narrower: https://homosaurus.org/v3/homoit0000709
narrower: https://homosaurus.org/v3/homoit0000710
narrower: https://homosaurus.org/v3/homoit0001145
narrower: https://homosaurus.org/v3/homoit0003083
narrower: https://homosaurus.org/v3/homoit0003086
narrower: https://homosaurus.org/v3/homoit0003087
narrower: https://homosaurus.org/v3/homoit0003088
related: https://homosaurus.org/v3/homoit0000103
related: https://homosaurus.org/v3/homoit0000363
related: https://homosaurus.org/v3/homoit0000442
related: https://homosaurus.org/v3/homoit0000906
related: https://homosaurus.org/v3/homoit0000999
related: https://homosaurus.org/v3/homoit0001247
related: https://homosaurus.org/v3/homoit0001318
related: https://homosaurus.org/v3/homoit0001553
related: https://homosaurus.org/v3/homoit0003052
related: https://homosaurus.org/v3/homoit0003059
related: https://homosaurus.org/v3/homoit0003065
related: https://homosaurus.org/v3/homoit0003080
related: https://homosaurus.org/v3/homoit0003084
related: https://homosaurus.org/v3/homoit0003104
related: https://homosaurus.org/v3/homoit0003106
related: https://homosaurus.org/v3/homoit0003140

Leather daddies
type: Concept
issued: 2019-05-14
modified: 2025-02-23
replaces: leatherDaddies
comment: People who participate in leather communities and identify as leather daddies.
broader: https://homosaurus.org/v3/homoit0000705
broader: https://homosaurus.org/v3/homoit0003086
change note: Version 3.7.0
has top concept: LGBTQ+ communities
in scheme: v3
related: https://homosaurus.org/v3/homoit0000707
related: https://homosaurus.org/v3/homoit0000708
related: https://homosaurus.org/v3/homoit0000709
related: https://homosaurus.org/v3/homoit0000710
related: https://homosaurus.org/v3/homoit0003087
related: https://homosaurus.org/v3/homoit0003088

Leather families
type: Concept
issued: 2019-05-14
modified: 2025-02-23
replaces: leatherFamilies
comment: Multiple people who participate in leather communities and identify as a leather family.
alternative label: Leather household
broader: https://homosaurus.org/v3/homoit0000705
broader: https://homosaurus.org/v3/homoit0003086
change note: Version 3.7.0
has top concept: LGBTQ+ communities
in scheme: v3
related: https://homosaurus.org/v3/homoit0000706
related: https://homosaurus.org/v3/homoit0000708
related: https://homosaurus.org/v3/homoit0000709
related: https://homosaurus.org/v3/homoit0000710
related: https://homosaurus.org/v3/homoit0003087
related: https://homosaurus.org/v3/homoit0003088

Leather mommies
type: Concept
issued: 2019-05-14
modified: 2025-02-23
replaces: leatherMommies
comment: People who participate in leather communities and identify as leather mommies.
broader: https://homosaurus.org/v3/homoit0000705
broader: https://homosaurus.org/v3/homoit0003086
change note: Version 3.7.0
has top concept: LGBTQ+ communities
in scheme: v3
related: https://homosaurus.org/v3/homoit0000706
related: https://homosaurus.org/v3/homoit0000707
related: https://homosaurus.org/v3/homoit0000709
related: https://homosaurus.org/v3/homoit0000710
related: https://homosaurus.org/v3/homoit0003087
related: https://homosaurus.org/v3/homoit0003088

Leathermen
type: Concept
issued: 2019-05-14
modified: 2025-02-23
replaces: leathermen
comment: People who participate in leather communities and identify as leathermen.
broader: https://homosaurus.org/v3/homoit0000705
broader: https://homosaurus.org/v3/homoit0003086
change note: Version 3.7.0
has top concept: LGBTQ+ communities
in scheme: v3
related: https://homosaurus.org/v3/homoit0000706
related: https://homosaurus.org/v3/homoit0000707
related: https://homosaurus.org/v3/homoit0000708
related: https://homosaurus.org/v3/homoit0000710
related: https://homosaurus.org/v3/homoit0003087
related: https://homosaurus.org/v3/homoit0003088

Leatherwomen
type: Concept
issued: 2019-05-14
modified: 2025-02-23
replaces: leatherwomen
comment: People who participate in leather communities and identify as leatherwomen.
alternative label: Leatherdykes
broader: https://homosaurus.org/v3/homoit0000705
broader: https://homosaurus.org/v3/homoit0003086
change note: Version 3.7.0
has top concept: LGBTQ+ communities
in scheme: v3
related: https://homosaurus.org/v3/homoit0000706
related: https://homosaurus.org/v3/homoit0000707
related: https://homosaurus.org/v3/homoit0000708
related: https://homosaurus.org/v3/homoit0000709
related: https://homosaurus.org/v3/homoit0003087
related: https://homosaurus.org/v3/homoit0003088

Legal name
type: Concept
issued: 2019-05-14
modified: 2025-02-23
replaces: legalName
comment: Use in reference to laws and regulations concerning the name assigned to an individual at birth.
broader: https://homosaurus.org/v3/homoit0000918
change note: Version 3.7.0
has top concept: Law
in scheme: v3
related: https://homosaurus.org/v3/homoit0000119
related: https://homosaurus.org/v3/homoit0000247
related: https://homosaurus.org/v3/homoit0000377
related: https://homosaurus.org/v3/homoit0001053
related: https://homosaurus.org/v3/homoit0001092
related: https://homosaurus.org/v3/homoit0003503

Lesbian activism
type: Concept
issued: 2019-05-14
modified: 2025-02-23
replaces: lesbianActivism
comment: Direct action and organizing to achieve political or social change and acceptance for lesbians.
broader: https://homosaurus.org/v3/homoit0000006
change note: Version 3.7.0
has top concept: LGBTQ+ activism
in scheme: v3
related: https://homosaurus.org/v3/homoit0000763

African American lesbians
type: Concept
issued: 2019-05-14
modified: 2025-02-23
replaces: lesbianAfricanAmericans
comment: Lesbians of African descent born in the United States or lesbians born in African countries who live in or have a strong connection to the United States. Use for individuals who self-identity as African American. Follow the individual’s preference for African American or Black whenever possible.
alternative label: Lesbian African Americans
broader: https://homosaurus.org/v3/homoit0000015
change note: Version 3.7.0
has top concept: LGBTQ+ people
in scheme: v3

Afro-Canadian lesbians
type: Concept
issued: 2019-05-14
modified: 2025-02-23
replaces: lesbianAfroCanadians
comment: Lesbians of African descent born in Canada or lesbians born in African countries who live in or have a strong connection to Canada. Use for individuals who self-identify as Afro-Canadian.
alternative label: Lesbian Afro-Canadians
broader: https://homosaurus.org/v3/homoit0000016
change note: Version 3.7.0
has top concept: LGBTQ+ people
in scheme: v3

Afro-Caribbean lesbians
type: Concept
issued: 2019-05-14
modified: 2025-02-23
replaces: lesbianAfroCaribbeans
comment: Lesbians of African descent born in the Caribbean or lesbians born in African countries who live in or have a strong connection to the Caribbean. Only use for individuals who self-identify as Afro-Caribbean.
alternative label: Lesbian Afro-Caribbeans
broader: https://homosaurus.org/v3/homoit0000017
change note: Version 3.7.0
has top concept: LGBTQ+ people
in scheme: v3

Afro-European lesbians
type: Concept
issued: 2019-05-14
modified: 2025-02-23
replaces: lesbianAfroEuropeans
comment: Lesbians of African descent born in European countries or lesbians born in African countries who live in or have a strong connection to Europe. Only use for individuals who self-identify as Afro-European.
alternative label: Lesbian Afro-Europeans
broader: https://homosaurus.org/v3/homoit0000018
change note: Version 3.7.0
has top concept: LGBTQ+ people
in scheme: v3

Afro-Latin American lesbians
type: Concept
issued: 2019-05-14
modified: 2025-02-23
replaces: lesbianAfroLatinAmericans
comment: Lesbians of African descent born in Latin American countries or lesbians born in African countries who live in or have a strong connection to Latin America. Only use for individuals who self-identify as Afro-Latin American.
alternative label: Lesbian Afro-Latin Americans
broader: https://homosaurus.org/v3/homoit0000019
change note: Version 3.7.0
has top concept: LGBTQ+ people
in scheme: v3

Lesbian archives
type: Concept
issued: 2019-05-14
modified: 2025-02-23
replaces: lesbianArchives
comment: Collections of records and materials relating to lesbians or lesbian communities; can include a variety of organizations and institutions from community to government archives.
broader: https://homosaurus.org/v3/homoit0000066
change note: Version 3.7.0
has top concept: LGBTQ+ cultural heritage institutions
in scheme: v3

Lesbian artists
type: Concept
issued: 2019-05-14
modified: 2025-02-23
replaces: lesbianArtists
comment: Lesbians who practice any of various creative arts.
broader: https://homosaurus.org/v3/homoit0000070
change note: Version 3.7.0
has top concept: LGBTQ+ people
in scheme: v3

Asian American lesbians
type: Concept
issued: 2019-05-14
modified: 2025-02-23
replaces: lesbianAsianAmericans
comment: Lesbians of Asian heritage or descent born in the United States or born in Asian countries who live in or have a strong connection to the United States. Only use for individuals who self-identify as Asian American.
alternative label: Lesbian Asian Americans
broader: https://homosaurus.org/v3/homoit0000073
broader: https://homosaurus.org/v3/homoit0000722
change note: Version 3.7.0
has top concept: LGBTQ+ people
in scheme: v3

Asian lesbians
type: Concept
issued: 2019-05-14
modified: 2025-02-23
replaces: lesbianAsians
comment: Lesbians of Asian heritage or descent, living in Asia or part of the Asian diaspora. Only use for people who self-identify as Asian.
alternative label: Lesbian Asians
broader: https://homosaurus.org/v3/homoit0000074
change note: Version 3.7.0
has top concept: LGBTQ+ people
in scheme: v3
narrower: https://homosaurus.org/v3/homoit0000721

Lesbian atheists
type: Concept
issued: 2019-05-14
modified: 2025-02-23
replaces: lesbianAtheists
comment: Lesbians who are atheists.
broader: https://homosaurus.org/v3/homoit0000082
change note: Version 3.7.0
has top concept: LGBTQ+ people
in scheme: v3

Lesbian bars
type: Concept
issued: 2019-05-14
modified: 2025-02-23
replaces: lesbianBars
comment: Drinking establishments that primarily cater to lesbians.
broader: https://homosaurus.org/v3/homoit0000100
change note: Version 3.7.0
has top concept: LGBTQ+ meeting places
in scheme: v3
narrower: https://homosaurus.org/v3/homoit0003719
related: https://homosaurus.org/v3/homoit0000733
related: https://homosaurus.org/v3/homoit0000925

Lesbian beaches
type: Concept
issued: 2019-05-14
modified: 2025-02-23
replaces: lesbianBeaches
comment: Beaches set aside for use by lesbians or beaches known to be frequented by lesbians.
broader: https://homosaurus.org/v3/homoit0000104
change note: Version 3.7.0
has top concept: LGBTQ+ meeting places
in scheme: v3

Black lesbians
type: Concept
issued: 2019-05-14
modified: 2025-02-23
replaces: lesbianBlackPeople
comment: Black people who are lesbians. Use only for individuals who self-identity as Black. Follow the individual’s preference for African American or Black whenever possible.
broader: https://homosaurus.org/v3/homoit0000208
change note: Version 3.7.0
has top concept: LGBTQ+ people
in scheme: v3

Lesbian bookshops
type: Concept
issued: 2019-05-14
modified: 2025-02-23
replaces: lesbianBookshops
comment: Bookshops that sell materials intended for use by lesbians or addressing topics related to lesbian communities.
broader: https://homosaurus.org/v3/homoit0000216
change note: Version 3.7.0
has top concept: LGBTQ+ bookshops
in scheme: v3
related: https://homosaurus.org/v3/homoit0001511

Lesbian Buddhists
type: Concept
issued: 2019-05-14
modified: 2025-02-23
replaces: lesbianBuddhists
comment: Lesbians who are Buddhist.
broader: https://homosaurus.org/v3/homoit0000225
change note: Version 3.7.0
has top concept: LGBTQ+ religious people
in scheme: v3

Lesbian characters
type: Concept
issued: 2019-05-14
modified: 2025-02-23
replaces: lesbianCharacters
comment: Characters in creative works who are lesbians.
broader: https://homosaurus.org/v3/homoit0000249
change note: Version 3.7.0
has top concept: LGBTQ+ characters
in scheme: v3
related: https://homosaurus.org/v3/homoit0000556
related: https://homosaurus.org/v3/homoit0000786

Lesbian choruses
type: Concept
issued: 2019-05-14
modified: 2025-02-23
replaces: lesbianChoruses
comment: Organized groups of lesbians who sing together.
alternative label: Lesbian choirs
broader: https://homosaurus.org/v3/homoit0000382
broader: https://homosaurus.org/v3/homoit0000833
change note: Version 3.7.0
has top concept: Subcultures
in scheme: v3
related: https://homosaurus.org/v3/homoit0000482

Lesbian Christians
type: Concept
issued: 2019-05-14
modified: 2025-02-23
replaces: lesbianChristians
comment: Lesbians who are Christian.
broader: https://homosaurus.org/v3/homoit0000265
change note: Version 3.7.0
has top concept: LGBTQ+ religious people
in scheme: v3

Lesbian clergy
type: Concept
issued: 2019-05-14
modified: 2025-02-23
replaces: lesbianClergy
comment: Lesbians who are ordained for religious duties, particularly in the Christian Church.
alternative label: Lesbian pastors
broader: https://homosaurus.org/v3/homoit0001624
change note: Version 3.7.0
has top concept: LGBTQ+ clergy
in scheme: v3
related: https://homosaurus.org/v3/homoit0000142
related: https://homosaurus.org/v3/homoit0000244
related: https://homosaurus.org/v3/homoit0000484
related: https://homosaurus.org/v3/homoit0001169
related: https://homosaurus.org/v3/homoit0001402

Lesbian community
type: Concept
issued: 2019-05-14
modified: 2025-02-23
replaces: lesbianCommunity
comment: Groups of people who share the experience of being lesbians.
broader: https://homosaurus.org/v3/homoit0000297
change note: Version 3.7.0
has top concept: LGBTQ+ communities
in scheme: v3
related: https://homosaurus.org/v3/homoit0000594
related: https://homosaurus.org/v3/homoit0000724
related: https://homosaurus.org/v3/homoit0000734
related: https://homosaurus.org/v3/homoit0000804
related: https://homosaurus.org/v3/homoit0000805
related: https://homosaurus.org/v3/homoit0000806
related: https://homosaurus.org/v3/homoit0000807
related: https://homosaurus.org/v3/homoit0000882
related: https://homosaurus.org/v3/homoit0001789

Lesbian community centers
type: Concept
issued: 2019-05-14
modified: 2025-02-23
replaces: lesbianCommunityCentres
comment: Spaces in which people from lesbian communities meet for social, education, recreational, or organizing activities.
broader: https://homosaurus.org/v3/homoit0000298
change note: Version 3.7.0
has top concept: LGBTQ+ centers
in scheme: v3
preferred label: Lesbian community centres
related: https://homosaurus.org/v3/homoit0000733
related: https://homosaurus.org/v3/homoit0000753

Lesbian couples
type: Concept
issued: 2019-05-14
modified: 2025-02-23
replaces: lesbianCouples
comment: Partnerships in which both people are lesbians.
broader: https://homosaurus.org/v3/homoit0000310
change note: Version 3.7.0
has top concept: LGBTQ+ relationships
in scheme: v3
related: https://homosaurus.org/v3/homoit0000218

Lesbian daughters
type: Concept
issued: 2019-05-14
modified: 2025-02-23
replaces: lesbianDaughters
comment: Daughters who identify as lesbians.
broader: https://homosaurus.org/v3/homoit0000330
change note: Version 3.7.0
has top concept: LGBTQ+ people
in scheme: v3

Lesbian information centers
type: Concept
issued: 2019-05-14
modified: 2025-02-23
replaces: lesbianInformationCentres
comment: Institutions providing education, support, and information about lesbian identity and lesbian communities to lesbians.
broader: https://homosaurus.org/v3/homoit0000660
change note: Version 3.7.0
has top concept: LGBTQ+ centers
in scheme: v3
preferred label: Lesbian information centres
related: https://homosaurus.org/v3/homoit0000753

Lesbian dominatrices
type: Concept
issued: 2019-05-14
modified: 2025-02-23
replaces: lesbianDominatrices
comment: Women who take a dominant role in BDSM activities; use for dominatrices who identify as lesbians.
broader: https://homosaurus.org/v3/homoit0000363
change note: Version 3.7.0
has top concept: Relationship minorities
in scheme: v3
related: https://homosaurus.org/v3/homoit0000148
related: https://homosaurus.org/v3/homoit0001175
related: https://homosaurus.org/v3/homoit0001410

Lesbian drama
type: Concept
issued: 2019-05-14
modified: 2025-02-23
replaces: lesbianDrama
comment: Works of fiction written to be performed; use in reference to dramatic works focusing on lesbian characters or themes.
broader: https://homosaurus.org/v3/homoit0000376
change note: Version 3.7.0
has top concept: Subcultures
in scheme: v3
related: https://homosaurus.org/v3/homoit0001724

Lesbian families
type: Concept
issued: 2019-05-14
modified: 2025-02-23
replaces: lesbianFamilies
comment: Families, whether biological, adoptive, or chosen, in which one or more individuals identify as lesbian.
broader: https://homosaurus.org/v3/homoit0000420
change note: Version 3.7.0
has top concept: LGBTQ+ families
in scheme: v3
related: https://homosaurus.org/v3/homoit0000259

Lesbian feminism
type: Concept
issued: 2019-05-14
modified: 2025-02-23
replaces: lesbianFeminism
comment: A cultural movement and critical perspective that arose in the 1970s and 1980s primarily in North America and Western Europe as a result of dissatisfaction with the women's liberation movement and the gay liberation movement. Lesbian feminism encourages women to focus their efforts, activities, and relationships toward other women rather than men, often advocating for lesbianism as the logical result of feminism.
broader: https://homosaurus.org/v3/homoit0000437
change note: Version 3.7.0
has top concept: Feminism
in scheme: v3
related: https://homosaurus.org/v3/homoit0000622
related: https://homosaurus.org/v3/homoit0000753
related: https://homosaurus.org/v3/homoit0003169

Lesbian fiction
type: Concept
issued: 2019-05-14
modified: 2025-02-23
replaces: lesbianFiction
comment: Written works describing imagined events or people; use in reference to fictional works focusing on lesbian characters or themes.
broader: https://homosaurus.org/v3/homoit0000443
broader: https://homosaurus.org/v3/homoit0002162
change note: Version 3.7.0
has top concept: Subcultures
in scheme: v3
related: https://homosaurus.org/v3/homoit0001724
related: https://homosaurus.org/v3/homoit0001752
related: https://homosaurus.org/v3/homoit0001753
related: https://homosaurus.org/v3/homoit0001754
related: https://homosaurus.org/v3/homoit0002178
related: https://homosaurus.org/v3/homoit0002220
related: https://homosaurus.org/v3/homoit0003507
related: https://homosaurus.org/v3/homoit0003508

Lesbian girls
type: Concept
issued: 2019-05-14
modified: 2025-02-23
replaces: lesbianGirls
comment: Girls (typically children younger than 18) who are lesbians.
broader: https://homosaurus.org/v3/homoit0000590
broader: https://homosaurus.org/v3/homoit0000786
change note: Version 3.7.0
has top concept: Family members
in scheme: v3
related: https://homosaurus.org/v3/homoit0002362

Lesbian identity
type: Concept
issued: 2019-05-14
modified: 2025-02-23
replaces: lesbianIdentity
comment: Term used to describe the sexual identity of women and femmes who are romantically and/or sexually attracted to other women and femmes. However, not all lesbians are women, and gender non-conforming people who belong to lesbian communities have often identified as lesbian.
broader: https://homosaurus.org/v3/homoit0001295
change note: Version 3.7.0
has top concept: Sexual identity
in scheme: v3
related: https://homosaurus.org/v3/homoit0000556
related: https://homosaurus.org/v3/homoit0000786

Jewish lesbians
type: Concept
issued: 2019-05-14
modified: 2025-02-23
replaces: lesbianJews
comment: Lesbians who are Jewish.
alternative label: Lesbian Jews
broader: https://homosaurus.org/v3/homoit0000682
change note: Version 3.7.0
has top concept: LGBTQ+ people
in scheme: v3

Lesbian land
type: Concept
issued: 2019-05-14
modified: 2025-02-23
replaces: lesbianLand
comment: Rural communities populated only by lesbians.
broader: https://homosaurus.org/v3/homoit0000778
change note: Version 3.7.0
has top concept: Lesbian separatism
in scheme: v3
related: https://homosaurus.org/v3/homoit0000753

Latino/a/x lesbians
type: Concept
issued: 2019-05-14
modified: 2025-02-23
replaces: lesbianLatinas
comment: Latin American people who are lesbians; only use to describe individuals who self-identify as Latino, Latina, or Latinx. Do not conflate with Chicano/a/x or Hispanic.
alternative label: Latina lesbians
alternative label: Latine lesbians
alternative label: Latino lesbians
alternative label: Latinx lesbians
alternative label: Lesbian Latinas
alternative label: Lesbian Latine
alternative label: Lesbian Latinos
broader: https://homosaurus.org/v3/homoit0000253
change note: Version 3.7.0
has top concept: LGBTQ+ people
in scheme: v3

Lesbian liberation
type: Concept
issued: 2019-05-14
modified: 2025-02-23
replaces: lesbianLiberation
comment: Liberation movement that began in the 1970s to direct more attention to lesbian and feminist issues within the larger gay liberation movement and in national discourse.
broader: https://homosaurus.org/v3/homoit0000947
change note: Version 3.7.0
has top concept: LGBTQ+ social processes
in scheme: v3
related: https://homosaurus.org/v3/homoit0000500

Lesbian libraries
type: Concept
issued: 2019-05-14
modified: 2025-02-23
replaces: lesbianLibraries
comment: Libraries that hold materials primarily pertaining to lesbians or intended for use by lesbians.
broader: https://homosaurus.org/v3/homoit0000968
broader: https://homosaurus.org/v3/homoit0001513
change note: Version 3.7.0
has top concept: LGBTQ+ cultural heritage institutions
in scheme: v3

Lesbian literature
type: Concept
issued: 2019-05-14
modified: 2025-02-23
replaces: lesbianLiterature
comment: Written literary works about lesbian characters or themes.
broader: https://homosaurus.org/v3/homoit0000972
change note: Version 3.7.0
has top concept: Subcultures
in scheme: v3
related: https://homosaurus.org/v3/homoit0001724

Lesbian mistresses
type: Concept
issued: 2019-05-14
modified: 2025-02-23
replaces: lesbianMistresses
comment: Lesbians who are part of the BDSM scene and assume the mistress role in sexual relationships with a mistress/submissive dynamic.
broader: https://homosaurus.org/v3/homoit0001018
change note: Version 3.7.0
has top concept: Sexual identity
in scheme: v3
related: https://homosaurus.org/v3/homoit0000161
related: https://homosaurus.org/v3/homoit0001186
related: https://homosaurus.org/v3/homoit0001421

Lesbian parents
type: Concept
issued: 2019-05-14
modified: 2025-02-23
replaces: lesbianParents
comment: Lesbians who are parents.
broader: https://homosaurus.org/v3/homoit0001075
change note: Version 3.7.0
has top concept: LGBTQ+ families
in scheme: v3
related: https://homosaurus.org/v3/homoit0000259
related: https://homosaurus.org/v3/homoit0001021
related: https://homosaurus.org/v3/homoit0002585

Lesbian movement
type: Concept
issued: 2019-05-14
modified: 2025-02-23
replaces: lesbianMovement
comment: Umbrella term for activism focused on the rights of lesbians and issues faced by lesbian communities.
alternative label: Lesbian organisations
alternative label: Lesbian organizations
broader: https://homosaurus.org/v3/homoit0001026
change note: Version 3.7.0
has top concept: Social movements
in scheme: v3
narrower: https://homosaurus.org/v3/homoit0000791
related: https://homosaurus.org/v3/homoit0000438
related: https://homosaurus.org/v3/homoit0000500
related: https://homosaurus.org/v3/homoit0000734
related: https://homosaurus.org/v3/homoit0000737
related: https://homosaurus.org/v3/homoit0000741
related: https://homosaurus.org/v3/homoit0000746
related: https://homosaurus.org/v3/homoit0000757
related: https://homosaurus.org/v3/homoit0000766
related: https://homosaurus.org/v3/homoit0000772
related: https://homosaurus.org/v3/homoit0000787
related: https://homosaurus.org/v3/homoit0003169

Lesbian museums
type: Concept
issued: 2019-05-14
modified: 2025-02-23
replaces: lesbianMuseums
comment: Institutions dedicated to the storage, exhibition, conservation, and preservation of materials relating to lesbians and lesbian history.
broader: https://homosaurus.org/v3/homoit0001030
change note: Version 3.7.0
has top concept: LGBTQ+ cultural heritage institutions
in scheme: v3

Women's music
type: Concept
issued: 2019-05-14
modified: 2025-02-23
replaces: womensMusic
comment: Genre of music by women, for women, and about women that emerged in the 1960s and 1970s as a form of musical expression of the second-wave feminist movement.
alternative label: Lesbian music
alternative label: Wimmin's music
alternative label: Women-identified music
alternative label: Womyn's music
broader: https://homosaurus.org/v3/homoit0000382
change note: Version 3.7.0
has top concept: Subcultures
in scheme: v3
related: https://homosaurus.org/v3/homoit0001515
related: https://homosaurus.org/v3/homoit0003166

Lesbian Muslims
type: Concept
issued: 2019-05-14
modified: 2025-02-23
replaces: lesbianMuslims
comment: Lesbians who are Muslim.
broader: https://homosaurus.org/v3/homoit0001032
change note: Version 3.7.0
has top concept: LGBTQ+ religious people
in scheme: v3

Lesbian nation
type: Concept
issued: 2019-05-14
modified: 2025-02-23
replaces: lesbianNation
comment: An imagined autonomous, international lesbian community that is set apart from men.
broader: https://homosaurus.org/v3/homoit0000778
change note: Version 3.7.0
has top concept: Lesbian separatism
in scheme: v3
related: https://homosaurus.org/v3/homoit0000753

Native American lesbians
type: Concept
issued: 2019-05-14
modified: 2025-02-23
replaces: lesbianNativeAmericans
comment: People who are part of the Native peoples of the continental United States and Canada (excluding Inuit people) and self-identity as lesbians. Use more specific terms when available.
alternative label: American Indian lesbians
alternative label: Lesbian Native Americans
broader: https://homosaurus.org/v3/homoit0001037
change note: Version 3.7.0
has top concept: LGBTQ+ people
in scheme: v3

Lesbian newsletters
type: Concept
issued: 2019-05-14
modified: 2025-02-23
replaces: lesbianNewsletters
comment: Serialized print or digital periodicals created by or for lesbians, often with the purpose of sharing news and information related to lesbian communities and lesbian issues.
broader: https://homosaurus.org/v3/homoit0000766
broader: https://homosaurus.org/v3/homoit0001041
change note: Version 3.7.0
has top concept: LGBTQ+ press
in scheme: v3
related: https://homosaurus.org/v3/homoit0000760

Lesbian newspapers
type: Concept
issued: 2019-05-14
modified: 2025-02-23
replaces: lesbianNewspapers
comment: Serialized print or digital publications about lesbians or lesbian issues (and typically produced by lesbians or lesbian organizations) that contain news, articles, columns, correspondence, and advertisements.
broader: https://homosaurus.org/v3/homoit0000766
broader: https://homosaurus.org/v3/homoit0001042
change note: Version 3.7.0
has top concept: LGBTQ+ press
in scheme: v3
related: https://homosaurus.org/v3/homoit0000759

Lesbian Pagans
type: Concept
issued: 2019-05-14
modified: 2025-02-23
replaces: lesbianPagans
comment: Lesbians who are members of polytheistic religions or other religions outside of the dominant culture that typically incorporate nature worship and/or the sacred feminine, such as Wicca, Druidry, Heathenry, etc. Use to describe lesbians who self-identify as Pagan.
broader: https://homosaurus.org/v3/homoit0001069
change note: Version 3.7.0
has top concept: LGBTQ+ religious people
in scheme: v3
related: https://homosaurus.org/v3/homoit0001908

Lesbian poetry
type: Concept
issued: 2019-05-14
modified: 2025-02-23
replaces: lesbianPoetry
comment: Literary work, typically written in verse, that focuses on lesbian characters, lesbian themes, or lesbian identity.
broader: https://homosaurus.org/v3/homoit0001118
change note: Version 3.7.0
has top concept: Subcultures
in scheme: v3
related: https://homosaurus.org/v3/homoit0001724

Lesbian political activists
type: Concept
issued: 2019-05-14
modified: 2025-02-23
replaces: lesbianPoliticalActivists
comment: Lesbians working to bring about political or social change through public organizing.
broader: https://homosaurus.org/v3/homoit0000007
change note: Version 3.7.0
has top concept: LGBTQ+ people
in scheme: v3
related: https://homosaurus.org/v3/homoit0000713

Lesbian political groups
type: Concept
issued: 2019-05-14
modified: 2025-02-23
replaces: lesbianPoliticalGroups
comment: Organized groups centered on political change and action for lesbian rights; may include advocating for lesbianism as a political and feminist choice against sexism.
broader: https://homosaurus.org/v3/homoit0003521
change note: Version 3.7.0
has top concept: LGBTQ+ political groups
in scheme: v3

Lesbian porn films
type: Concept
issued: 2019-05-14
modified: 2025-02-23
replaces: lesbianPornFilms
comment: Erotic or sexually explicit films featuring lesbians.
broader: https://homosaurus.org/v3/homoit0000013
broader: https://homosaurus.org/v3/homoit0002329
broader: https://homosaurus.org/v3/homoit0002607
change note: Version 3.7.0
has top concept: Subcultures
in scheme: v3
related: https://homosaurus.org/v3/homoit0002546

Lesbian press
type: Concept
issued: 2019-05-14
modified: 2025-02-23
replaces: lesbianPress
comment: Newspapers, magazines, or other publishing outlets aimed at lesbian audiences and/or operated by lesbians.
broader: https://homosaurus.org/v3/homoit0001132
change note: Version 3.7.0
has top concept: LGBTQ+ press
in scheme: v3
narrower: https://homosaurus.org/v3/homoit0000759
narrower: https://homosaurus.org/v3/homoit0000760
narrower: https://homosaurus.org/v3/homoit0003155
related: https://homosaurus.org/v3/homoit0000753
related: https://homosaurus.org/v3/homoit0000896

Lesbian pride
type: Concept
issued: 2019-05-14
modified: 2025-02-23
replaces: lesbianPride
comment: The recognition and celebration of lesbians and lesbian culture, thereby affirming the visibility, dignity, and diversity of lesbian communities.
broader: https://homosaurus.org/v3/homoit0003653
change note: Version 3.7.0
has top concept: LGBTQ+ pride
in scheme: v3

Lesbian sex workers
type: Concept
issued: 2019-05-14
modified: 2025-02-23
replaces: lesbianProstitutes
comment: Lesbians who receive money or goods in exchange for sexual services, performances, or companionship. Use to describe lesbians working across the broad spectrum of sex work.
alternative label: Lesbian prostitutes
alternative label: Lesbian prostitution
alternative label: Lesbian sex work
broader: https://homosaurus.org/v3/homoit0001277
change note: Version 3.7.0
has top concept: Sex workers
in scheme: v3

Lesbian Protestants
type: Concept
issued: 2019-05-14
modified: 2025-02-23
replaces: lesbianProtestants
comment: Lesbians who are members of the Protestant Church.
broader: https://homosaurus.org/v3/homoit0001137
change note: Version 3.7.0
has top concept: LGBTQ+ religious people
in scheme: v3

Lesbian publishers
type: Concept
issued: 2019-05-14
modified: 2025-02-23
replaces: lesbianPublishers
comment: Companies and organizations that publish materials for lesbian communities or addressing lesbian issues.
broader: https://homosaurus.org/v3/homoit0001144
change note: Version 3.7.0
has top concept: LGBTQ+ publishers
in scheme: v3

Lesbian radio
type: Concept
issued: 2019-05-14
modified: 2025-02-23
replaces: lesbianRadio
comment: Auditory content broadcast on the radio (analog or digital) about lesbians and lesbian issues.
broader: https://homosaurus.org/v3/homoit0001231
change note: Version 3.7.0
has top concept: LGBTQ+ radio
in scheme: v3
related: https://homosaurus.org/v3/homoit0000753

Lesbian relationships
type: Concept
issued: 2019-05-14
modified: 2025-02-23
replaces: lesbianRelationships
comment: Ongoing connections (romantic, sexual, or platonic) between two or more lesbians.
broader: https://homosaurus.org/v3/homoit0001237
change note: Version 3.7.0
has top concept: LGBTQ+ relationships
in scheme: v3
related: https://homosaurus.org/v3/homoit0000182
related: https://homosaurus.org/v3/homoit0001205
related: https://homosaurus.org/v3/homoit0001442

Lesbian rights
type: Concept
issued: 2019-05-14
modified: 2025-02-23
replaces: lesbianRights
comment: Legal, social, or ethical principles of freedom or entitlement held by lesbians.
broader: https://homosaurus.org/v3/homoit0000276
change note: Version 3.7.0
has top concept: Human rights
in scheme: v3

Lesbian Roman Catholics
type: Concept
issued: 2019-05-14
modified: 2025-02-23
replaces: lesbianRomanCatholics
comment: Lesbians who are members of the Roman Catholic Church.
broader: https://homosaurus.org/v3/homoit0001244
change note: Version 3.7.0
has top concept: LGBTQ+ religious people
in scheme: v3

Lesbian slang
type: Concept
issued: 2019-05-14
modified: 2025-02-23
replaces: lesbianSlang
comment: Colloquial or informal language related to lesbians or used by lesbians.
broader: https://homosaurus.org/v3/homoit0000382
broader: https://homosaurus.org/v3/homoit0001317
change note: Version 3.7.0
has top concept: Subcultures
in scheme: v3
related: https://homosaurus.org/v3/homoit0000215
related: https://homosaurus.org/v3/homoit0002288

Lesbian sports clubs
type: Concept
issued: 2019-05-14
modified: 2025-02-23
replaces: lesbianSportsClubs
comment: Groups of lesbians formed for the purpose of playing sports; includes professional and amateur sports clubs.
broader: https://homosaurus.org/v3/homoit0000950
change note: Version 3.7.0
has top concept: LGBTQ+ clubs and organizations
in scheme: v3
related: https://homosaurus.org/v3/homoit0001930

Lesbian studies
type: Concept
issued: 2019-05-14
modified: 2025-02-23
replaces: lesbianStudies
comment: Academic field of research and study about lesbian identity and lesbian communities.
broader: https://homosaurus.org/v3/homoit0000579
change note: Version 3.7.0
has top concept: Gender studies
in scheme: v3
related: https://homosaurus.org/v3/homoit0000187
related: https://homosaurus.org/v3/homoit0000539
related: https://homosaurus.org/v3/homoit0001210
related: https://homosaurus.org/v3/homoit0001447

Lesbian survivors of hate crimes
type: Concept
issued: 2019-05-14
modified: 2025-02-23
replaces: lesbianSurvivorsOfHateCrimes
comment: Lesbians who have experienced and survived hate crimes; follow the individual's preference for "victims" or "survivors" whenever possible.
broader: https://homosaurus.org/v3/homoit0000792
broader: https://homosaurus.org/v3/homoit0001349
change note: Version 3.7.0
has top concept: LGBTQ+ people
in scheme: v3

Lesbian survivors of rape
type: Concept
issued: 2019-05-14
modified: 2025-02-23
replaces: lesbianSurvivorsOfRape
comment: Lesbians who have experienced and survived rape; follow the individual's preference for "victims" or "survivors" whenever possible.
broader: https://homosaurus.org/v3/homoit0000793
broader: https://homosaurus.org/v3/homoit0001350
change note: Version 3.7.0
has top concept: LGBTQ+ people
in scheme: v3
related: https://homosaurus.org/v3/homoit0000306

Lesbian survivors of sexual abuse
type: Concept
issued: 2019-05-14
modified: 2025-02-23
replaces: lesbianSurvivorsOfSexualAbuse
comment: Lesbians who have experienced and survived sexual abuse; follow the individual's preference for "victims" or "survivors" whenever possible.
broader: https://homosaurus.org/v3/homoit0000794
broader: https://homosaurus.org/v3/homoit0001351
change note: Version 3.7.0
has top concept: LGBTQ+ people
in scheme: v3

Lesbian survivors of war
type: Concept
issued: 2019-05-14
modified: 2025-02-23
replaces: lesbianSurvivorsOfWar
comment: Lesbians who have experienced and survived war; follow the individual's preference for "victims" or "survivors" whenever possible.
broader: https://homosaurus.org/v3/homoit0000795
broader: https://homosaurus.org/v3/homoit0001352
change note: Version 3.7.0
has top concept: LGBTQ+ people
in scheme: v3

Lesbian youth
type: Concept
issued: 2019-05-14
modified: 2025-02-23
replaces: lesbianYouth
comment: Lesbians who are between the ages of childhood and adulthood.
alternative label: Lesbian teenagers
alternative label: Lesbian adolescents
alternative label: Lesbian teens
broader: https://homosaurus.org/v3/homoit0000556
broader: https://homosaurus.org/v3/homoit0001521
change note: Version 3.7.0
has top concept: LGBTQ+ people
in scheme: v3
narrower: https://homosaurus.org/v3/homoit0000743
related: https://homosaurus.org/v3/homoit0000729
related: https://homosaurus.org/v3/homoit0000744
related: https://homosaurus.org/v3/homoit0000798

Lesbian television
type: Concept
issued: 2019-05-14
modified: 2025-02-23
replaces: lesbianTelevision
comment: Television shows featuring lesbian characters or themes.
broader: https://homosaurus.org/v3/homoit0001359
change note: Version 3.7.0
has top concept: LGBTQ+ television
in scheme: v3
related: https://homosaurus.org/v3/homoit0000753

Lesbian theater
type: Concept
issued: 2019-05-14
modified: 2025-02-23
replaces: lesbianTheatre
comment: Works in the performance arts that focus on lesbian characters, lesbian communities, or lesbian issues.
broader: https://homosaurus.org/v3/homoit0001363
change note: Version 3.7.0
has top concept: LGBTQ+ theater
in scheme: v3
preferred label: Lesbian theatre
related: https://homosaurus.org/v3/homoit0000546
related: https://homosaurus.org/v3/homoit0000789
related: https://homosaurus.org/v3/homoit0000922

Lesbian trade union groups
type: Concept
issued: 2019-05-14
modified: 2025-02-23
replaces: lesbianTradeUnionGroups
comment: Organized groups of lesbian workers who are united to make decisions relating to the conditions affecting their labor.
broader: https://homosaurus.org/v3/homoit0000753
change note: Version 3.7.0
has top concept: Social movements
in scheme: v3
related: https://homosaurus.org/v3/homoit0000549

Lesbian victims of hate crimes
type: Concept
issued: 2019-05-14
modified: 2025-02-23
replaces: lesbianVictimsOfHateCrimes
comment: Lesbians who have experienced hate crimes and may or may not have survived; follow the individual's preference for "victims" or "survivors" whenever possible.
broader: https://homosaurus.org/v3/homoit0000613
change note: Version 3.7.0
has top concept: LGBTQ+ people
in scheme: v3
narrower: https://homosaurus.org/v3/homoit0000782

Lesbian victims of rape
type: Concept
issued: 2019-05-14
modified: 2025-02-23
replaces: lesbianVictimsOfRape
comment: Lesbians who have experienced rape and may or may not have survived; follow the individual's preference for "victims" or "survivors" whenever possible.
broader: https://homosaurus.org/v3/homoit0000958
change note: Version 3.7.0
has top concept: LGBTQ+ people
in scheme: v3
narrower: https://homosaurus.org/v3/homoit0000783
related: https://homosaurus.org/v3/homoit0000306

Lesbian victims of sexual abuse
type: Concept
issued: 2019-05-14
modified: 2025-02-23
replaces: lesbianVictimsOfSexualAbuse
comment: Lesbians who have experienced sexual abuse and may or may not have survived; follow the individual's preference for "victims" or "survivors" whenever possible.
broader: https://homosaurus.org/v3/homoit0000959
change note: Version 3.7.0
has top concept: LGBTQ+ people
in scheme: v3
narrower: https://homosaurus.org/v3/homoit0000784

Lesbian victims of war
type: Concept
issued: 2019-05-14
modified: 2025-02-23
replaces: lesbianVictimsOfWar
comment: Lesbians who have experienced war and may or may not have survived; follow the individual's preference for "victims" or "survivors" whenever possible.
broader: https://homosaurus.org/v3/homoit0000961
change note: Version 3.7.0
has top concept: LGBTQ+ people
in scheme: v3
narrower: https://homosaurus.org/v3/homoit0000785

Lesbian victims' rights
type: Concept
issued: 2019-05-14
modified: 2025-02-23
replaces: lesbianVictimsRights
comment: Lesbians' legal rights to be informed, present, and heard within the criminal justice system after having been harmed or injured as the result of of a crime, accident, or other event.
broader: https://homosaurus.org/v3/homoit0001492
change note: Version 3.7.0
has top concept: Law
in scheme: v3

White lesbians
type: Concept
issued: 2019-05-14
modified: 2025-02-23
replaces: lesbianWhitePeople
comment: Lesbians who are white.
alternative label: Caucasian lesbians
broader: https://homosaurus.org/v3/homoit0000243
change note: Version 3.7.0
has top concept: White LGBTQ+ people
in scheme: v3

Lesbian youth literature
type: Concept
issued: 2019-05-14
modified: 2025-02-23
replaces: lesbianYouthLiterature
comment: Written literary works for an audience of readers from 12-18 years of age, also known as young adult literature or YA; use in reference to youth literature focusing on lesbian characters or themes.
broader: https://homosaurus.org/v3/homoit0001522
change note: Version 3.7.0
has top concept: Subcultures
in scheme: v3
related: https://homosaurus.org/v3/homoit0000786

Lesbianism
type: Concept
issued: 2019-05-14
modified: 2025-02-23
replaces: lesbianism
comment: Sexual orientation of women and femmes who are sexually and/or romantically attracted to other women and femmes. However, not all lesbians are women, and gender non-conforming people who belong to lesbian communities have often identified as lesbian.
broader: https://homosaurus.org/v3/homoit0001298
change note: Version 3.7.0
has top concept: Sexual orientation
in scheme: v3
related: https://homosaurus.org/v3/homoit0000204
related: https://homosaurus.org/v3/homoit0000556
related: https://homosaurus.org/v3/homoit0000647
related: https://homosaurus.org/v3/homoit0001669

Lesbians in the military
type: Concept
issued: 2019-05-14
modified: 2025-02-23
replaces: lesbiansInTheMilitary
comment: Lesbians serving in state and national armed forces.
broader: https://homosaurus.org/v3/homoit0001100
change note: Version 3.7.0
has top concept: Legal status
in scheme: v3

Lesbians of color
type: Concept
issued: 2019-05-14
modified: 2025-02-23
replaces: lesbiansOfColour
comment: Primarily used in the United States, this term refers to lesbians who are not white and who identify as people of color.
broader: https://homosaurus.org/v3/homoit0001101
change note: Version 3.7.0
has top concept: LGBTQ+ people
in scheme: v3
preferred label: Lesbians of colour

Parents of lesbians
type: Concept
issued: 2019-05-14
modified: 2025-02-23
replaces: parentsOfLesbians
comment: People who act as parents to one or more lesbian. For parents who are themselves lesbians, use the term "Lesbian parents."
alternative label: Lesbians' parents
broader: https://homosaurus.org/v3/homoit0002224
change note: Version 3.7.0
has top concept: Family members
in scheme: v3
related: https://homosaurus.org/v3/homoit0000556

Lesbophobia
type: Concept
issued: 2019-05-14
modified: 2025-02-23
replaces: lesbophobia
comment: Antagonism or disgust directed towards lesbianism as an identity or lesbians due to their sexuality, perceived or actual. Lesbophobia can include denial of the existence of lesbianism, stereotypes, verbal harassment, and physical violence.
broader: https://homosaurus.org/v3/homoit0000920
change note: Version 3.7.0
has top concept: LGBTQ+ phobia
in scheme: v3
narrower: https://homosaurus.org/v3/homoit0002591
related: https://homosaurus.org/v3/homoit0000057
related: https://homosaurus.org/v3/homoit0000058
related: https://homosaurus.org/v3/homoit0000556
related: https://homosaurus.org/v3/homoit0000619

LGB
type: Concept
issued: 2019-05-14
modified: 2025-02-23
replaces: LGB
comment: Acronym used to describe lesbians, gay people, and bisexuals as a group. This acronym has often been used to exclude transgender people.
broader: https://homosaurus.org/v3/homoit0000594
broader: https://homosaurus.org/v3/homoit0000805
broader: https://homosaurus.org/v3/homoit0000806
broader: https://homosaurus.org/v3/homoit0000807
broader: https://homosaurus.org/v3/homoit0000882
change note: Version 3.7.0
has top concept: LGBTI
in scheme: v3
related: https://homosaurus.org/v3/homoit0000143
related: https://homosaurus.org/v3/homoit0000485
related: https://homosaurus.org/v3/homoit0000733
related: https://homosaurus.org/v3/homoit0001403

LGBTQ
type: Concept
issued: 2019-05-14
modified: 2025-02-23
replaces: LGBTQ
comment: Acronym used to describe lesbians, gay men, bisexual people, transgender people, and queer people as a group.
broader: https://homosaurus.org/v3/homoit0000807
broader: https://homosaurus.org/v3/homoit0000882
change note: Version 3.7.0
has top concept: 2SLGBTQ+
in scheme: v3
narrower: https://homosaurus.org/v3/homoit0000594
narrower: https://homosaurus.org/v3/homoit0000804
related: https://homosaurus.org/v3/homoit0000143
related: https://homosaurus.org/v3/homoit0000485
related: https://homosaurus.org/v3/homoit0000733
related: https://homosaurus.org/v3/homoit0001170
related: https://homosaurus.org/v3/homoit0001403

LGBTQ+
type: Concept
issued: 2019-05-14
modified: 2025-02-23
replaces: LGBTQ+
comment: Acronym used to describe lesbians, gay men, bisexual people, transgender people, queer people, and any other sexual and gender minorities as a group.
broader: https://homosaurus.org/v3/homoit0001789
change note: Version 3.7.0
has top concept: 2SLGBTQ+
in scheme: v3
narrower: https://homosaurus.org/v3/homoit0000804
narrower: https://homosaurus.org/v3/homoit0000806
related: https://homosaurus.org/v3/homoit0000004
related: https://homosaurus.org/v3/homoit0000143
related: https://homosaurus.org/v3/homoit0000485
related: https://homosaurus.org/v3/homoit0000672
related: https://homosaurus.org/v3/homoit0000733
related: https://homosaurus.org/v3/homoit0001170
related: https://homosaurus.org/v3/homoit0001290
related: https://homosaurus.org/v3/homoit0001403

LGBTQ+ action campaigns
type: Concept
issued: 2019-05-14
modified: 2025-02-23
replaces: LGBTQActionCampaigns
comment: A series of organized events or efforts centered around raising awareness or achieving a particular political, social, or cultural goal or action benefiting LGBTQ+ people and communities.
alternative label: LGBTQ action campaigns
broader: https://homosaurus.org/v3/homoit0000853
change note: Version 3.7.0
has top concept: LGBTQ+ activism
in scheme: v3
narrower: https://homosaurus.org/v3/homoit0000851

LGBTQ+ adoption
type: Concept
issued: 2019-05-14
modified: 2025-02-23
replaces: LGBTQAdoption
comment: Adoption of a child or children, either by legal or informal processes, by LGBTQ+ people.
alternative label: LGBTQ adoption
broader: https://homosaurus.org/v3/homoit0000864
change note: Version 3.7.0
has top concept: LGBTQ+ family planning
in scheme: v3
narrower: https://homosaurus.org/v3/homoit0000304
narrower: https://homosaurus.org/v3/homoit0000811
narrower: https://homosaurus.org/v3/homoit0000812
narrower: https://homosaurus.org/v3/homoit0000821
related: https://homosaurus.org/v3/homoit0000009
related: https://homosaurus.org/v3/homoit0000010
related: https://homosaurus.org/v3/homoit0000121
related: https://homosaurus.org/v3/homoit0000254
related: https://homosaurus.org/v3/homoit0000260
related: https://homosaurus.org/v3/homoit0000420
related: https://homosaurus.org/v3/homoit0000810
related: https://homosaurus.org/v3/homoit0000870
related: https://homosaurus.org/v3/homoit0000914
related: https://homosaurus.org/v3/homoit0000918
related: https://homosaurus.org/v3/homoit0001075

LGBTQ+ adoptive families
type: Concept
issued: 2019-05-14
modified: 2025-02-23
replaces: LGBTQAdoptiveFamilies
comment: Families including adopted children in which one or more individuals identify as LGBTQ+.
alternative label: LGBTQ adoptive families
broader: https://homosaurus.org/v3/homoit0000420
change note: Version 3.7.0
has top concept: LGBTQ+ families
in scheme: v3
narrower: https://homosaurus.org/v3/homoit0000811
narrower: https://homosaurus.org/v3/homoit0000866
narrower: https://homosaurus.org/v3/homoit0000905
related: https://homosaurus.org/v3/homoit0000809
related: https://homosaurus.org/v3/homoit0000812

LGBTQ+ adoptive parenthood
type: Concept
issued: 2019-05-14
modified: 2025-02-23
replaces: LGBTQAdoptiveParenthood
comment: The experiences involved in adoptive parenting, as experienced by LGBTQ+ people.
alternative label: LGBTQ adoptive parenthood
broader: https://homosaurus.org/v3/homoit0000809
broader: https://homosaurus.org/v3/homoit0000810
broader: https://homosaurus.org/v3/homoit0000914
change note: Version 3.7.0
has top concept: LGBTQ+ family planning
in scheme: v3
related: https://homosaurus.org/v3/homoit0000420
related: https://homosaurus.org/v3/homoit0000864
related: https://homosaurus.org/v3/homoit0000870
related: https://homosaurus.org/v3/homoit0000871
related: https://homosaurus.org/v3/homoit0000918
related: https://homosaurus.org/v3/homoit0000945
related: https://homosaurus.org/v3/homoit0001001
related: https://homosaurus.org/v3/homoit0001075
related: https://homosaurus.org/v3/homoit0001093

LGBTQ+ adoptive parents
type: Concept
issued: 2019-05-14
modified: 2025-02-23
replaces: LGBTQAdoptiveParents
comment: Parents who adopt and who are LGBTQ+ people.
alternative label: LGBTQ adoptive parents
broader: https://homosaurus.org/v3/homoit0000420
broader: https://homosaurus.org/v3/homoit0000809
broader: https://homosaurus.org/v3/homoit0000914
broader: https://homosaurus.org/v3/homoit0001075
change note: Version 3.7.0
has top concept: LGBTQ+ families
in scheme: v3
related: https://homosaurus.org/v3/homoit0000010
related: https://homosaurus.org/v3/homoit0000121
related: https://homosaurus.org/v3/homoit0000810
related: https://homosaurus.org/v3/homoit0000872

LGBTQ+ art censorship
type: Concept
issued: 2019-05-14
modified: 2025-02-23
replaces: LGBTQArtCensorship
comment: Suppression or prohibition of art by LGBTQ+ artists or about LGBTQ+ issues; includes censorship on the basis of religious, moral, political, and/or social objections.
alternative label: LGBTQ art censorship
broader: https://homosaurus.org/v3/homoit0000829
change note: Version 3.7.0
has top concept: Censorship
in scheme: v3
related: https://homosaurus.org/v3/homoit0000816

LGBTQ+ arts
type: Concept
issued: 2019-05-14
modified: 2025-02-23
replaces: LGBTQArts
comment: Umbrella term for different forms of creative activity, including visual, material, and performing arts, by LGBTQ+ artists or about LGBTQ+ topics and communities. Use a more specific term if possible.
alternative label: LGBTQ arts
broader: https://homosaurus.org/v3/homoit0001831
change note: Version 3.7.0
has top concept: Subcultures
in scheme: v3
narrower: https://homosaurus.org/v3/homoit0001031
narrower: https://homosaurus.org/v3/homoit0002327
narrower: https://homosaurus.org/v3/homoit0002579
narrower: https://homosaurus.org/v3/homoit0002596
narrower: https://homosaurus.org/v3/homoit0002598
narrower: https://homosaurus.org/v3/homoit0002599
narrower: https://homosaurus.org/v3/homoit0002600
narrower: https://homosaurus.org/v3/homoit0002601
narrower: https://homosaurus.org/v3/homoit0002602
narrower: https://homosaurus.org/v3/homoit0002603
narrower: https://homosaurus.org/v3/homoit0002604
narrower: https://homosaurus.org/v3/homoit0002605
narrower: https://homosaurus.org/v3/homoit0002886
narrower: https://homosaurus.org/v3/homoit0003610
narrower: https://homosaurus.org/v3/homoit0003662
related: https://homosaurus.org/v3/homoit0000008
related: https://homosaurus.org/v3/homoit0000070
related: https://homosaurus.org/v3/homoit0000367
related: https://homosaurus.org/v3/homoit0000403
related: https://homosaurus.org/v3/homoit0000815
related: https://homosaurus.org/v3/homoit0000833
related: https://homosaurus.org/v3/homoit0000869
related: https://homosaurus.org/v3/homoit0000908
related: https://homosaurus.org/v3/homoit0000922
related: https://homosaurus.org/v3/homoit0000972
related: https://homosaurus.org/v3/homoit0001051
related: https://homosaurus.org/v3/homoit0001052
related: https://homosaurus.org/v3/homoit0001363
related: https://homosaurus.org/v3/homoit0001755
related: https://homosaurus.org/v3/homoit0002201
related: https://homosaurus.org/v3/homoit0002597

LGBTQ+ biological parents
type: Concept
issued: 2019-05-14
modified: 2025-02-23
replaces: LGBTQBiologicalParents
comment: Biological or genetic parents who are LGBTQ+ people. For adoption contexts, use LGBTQ+ birth parents.
alternative label: LGBTQ biological parents
broader: https://homosaurus.org/v3/homoit0000420
broader: https://homosaurus.org/v3/homoit0001075
change note: Version 3.7.0
has top concept: LGBTQ+ families
in scheme: v3
narrower: https://homosaurus.org/v3/homoit0000116
narrower: https://homosaurus.org/v3/homoit0000583
narrower: https://homosaurus.org/v3/homoit0000587
related: https://homosaurus.org/v3/homoit0000121
related: https://homosaurus.org/v3/homoit0000864
related: https://homosaurus.org/v3/homoit0000914

Biracial LGBTQ+ people
type: Concept
issued: 2019-05-14
modified: 2025-02-23
replaces: LGBTQBiracialPeople
comment: LGBTQ+ people who belong to two or more racial groups. Only use to describe people who self-identify as biracial.
alternative label: Bi-racial people (LGBTQ)
alternative label: Biracial people (LGBTQ)
alternative label: Bi-racial LGBTQ+ people
alternative label: LGBTQ+ bi-racial people
alternative label: LGBTQ+ biracial people
broader: https://homosaurus.org/v3/homoit0001101
change note: Version 3.7.0
has top concept: LGBTQ+ people
in scheme: v3
narrower: https://homosaurus.org/v3/homoit0001796
narrower: https://homosaurus.org/v3/homoit0001797
narrower: https://homosaurus.org/v3/homoit0001798
narrower: https://homosaurus.org/v3/homoit0001799
narrower: https://homosaurus.org/v3/homoit0001800
narrower: https://homosaurus.org/v3/homoit0002904
narrower: https://homosaurus.org/v3/homoit0002961
narrower: https://homosaurus.org/v3/homoit0003399

LGBTQ+ birth parents
type: Concept
issued: 2019-05-14
modified: 2025-02-23
replaces: LGBTQBirthParents
comment: In an adoption context, biological or genetic parents who are LGBTQ+ people.
alternative label: LGBTQ birth parents
broader: https://homosaurus.org/v3/homoit0000121
broader: https://homosaurus.org/v3/homoit0000809
broader: https://homosaurus.org/v3/homoit0001075
change note: Version 3.7.0
has top concept: LGBTQ+ families
in scheme: v3

LGBTQ+ blind people
type: Concept
issued: 2019-05-14
modified: 2025-02-23
replaces: LGBTQBlindPeople
comment: LGBTQ+ people with significant or total loss of vision.
alternative label: Blind people (LGBTQ)
alternative label: Blind LGBTQ+ people
broader: https://homosaurus.org/v3/homoit0001854
change note: Version 3.7.0
has top concept: LGBTQ+ people
in scheme: v3
narrower: https://homosaurus.org/v3/homoit0001872
narrower: https://homosaurus.org/v3/homoit0001873
narrower: https://homosaurus.org/v3/homoit0001874
narrower: https://homosaurus.org/v3/homoit0001875
narrower: https://homosaurus.org/v3/homoit0001876
narrower: https://homosaurus.org/v3/homoit0002783
narrower: https://homosaurus.org/v3/homoit0002932
related: https://homosaurus.org/v3/homoit0002683

LGBTQ+ blogs
type: Concept
issued: 2019-05-14
modified: 2025-02-23
replaces: LGBTQBlogs
comment: Websites featuring informal, often personal writing and reflections created by LGBTQ+ people or about LGBTQ+ communities and issues.
alternative label: LGBTQ blogs
broader: https://homosaurus.org/v3/homoit0000210
broader: https://homosaurus.org/v3/homoit0000946
change note: Version 3.7.0
has top concept: Social media
in scheme: v3
narrower: https://homosaurus.org/v3/homoit0001983

LGBTQ+ blood donors
type: Concept
issued: 2019-05-14
modified: 2025-02-23
replaces: LGBTQBloodDonors
comment: LGBTQ+ people who give blood for transfusion and medical purposes.
alternative label: LGBTQ blood donors
broader: https://homosaurus.org/v3/homoit0000364
change note: Version 3.7.0
has top concept: Donors
in scheme: v3

LGBTQ+ book censorship
type: Concept
issued: 2019-05-14
modified: 2025-02-23
replaces: LGBTQBookCensorship
comment: The suppression or prohibition of written texts by LGBTQ+ authors and/or about LGBTQ+ issues due to religious, moral, political, and/or social objections.
alternative label: LGBTQ book censorship
broader: https://homosaurus.org/v3/homoit0000829
change note: Version 3.7.0
has top concept: Censorship
in scheme: v3
related: https://homosaurus.org/v3/homoit0000827
related: https://homosaurus.org/v3/homoit0000831
related: https://homosaurus.org/v3/homoit0003617

LGBTQ+ book clubs
type: Concept
issued: 2019-05-14
modified: 2025-02-23
replaces: LGBTQBookClubs
comment: Groups of people gathering regularly to read and discuss written works; use in reference to book clubs with primarily LGBTQ+ membership or book clubs focused on books by LGBTQ+ authors or featuring LGBTQ+ characters and themes.
alternative label: LGBTQ book clubs
broader: https://homosaurus.org/v3/homoit0000836
change note: Version 3.7.0
has top concept: LGBTQ+ clubs and organizations
in scheme: v3
related: https://homosaurus.org/v3/homoit0000827

LGBTQ+ cartoons
type: Concept
issued: 2019-05-14
modified: 2025-02-23
replaces: LGBTQCartoons
comment: Satirical drawings created by LGBTQ+ cartoonists or that depict someone or something relating to LGBTQ+ culture.
alternative label: LGBTQ cartoons
broader: https://homosaurus.org/v3/homoit0000841
change note: Version 3.7.0
has top concept: Subcultures
in scheme: v3
related: https://homosaurus.org/v3/homoit0002144
related: https://homosaurus.org/v3/homoit0002172

LGBTQ+ censorship
type: Concept
issued: 2019-05-14
modified: 2025-02-23
replaces: LGBTQCensorship
comment: Suppression or prohibition of the discussion, education, or circulation of information related to LGBTQ+ people and identities in media, schools, and/or in the general public.
alternative label: LGBTQ censorship
broader: https://homosaurus.org/v3/homoit0000245
change note: Version 3.7.0
has top concept: Censorship
in scheme: v3
narrower: https://homosaurus.org/v3/homoit0000815
narrower: https://homosaurus.org/v3/homoit0000825
narrower: https://homosaurus.org/v3/homoit0000867

LGBTQ+ challenged books
type: Concept
issued: 2019-05-14
modified: 2025-02-23
replaces: LGBTQChallengedBooks
comment: Books about LGBTQ+ people and issues or written by LGBTQ+ authors that individuals or organizations have attempted to restrict or remove from school curricula, library circulation, or sale.
alternative label: LGBTQ challenged books
broader: https://homosaurus.org/v3/homoit0000827
change note: Version 3.7.0
has top concept: LGBTQ+ books
in scheme: v3
related: https://homosaurus.org/v3/homoit0000825

LGBTQ+ chatrooms
type: Concept
issued: 2019-05-14
modified: 2025-02-23
replaces: LGBTQChatrooms
comment: Online websites or applications for virtual, instant communication; use in reference to chatrooms focusing on LGBTQ+ communities or issues, as well as chatrooms with primarily LGBTQ+ members.
alternative label: LGBTQ chatrooms
broader: https://homosaurus.org/v3/homoit0000250
broader: https://homosaurus.org/v3/homoit0000946
change note: Version 3.7.0
has top concept: Social media
in scheme: v3

LGBTQ+ chosen families
type: Concept
issued: 2019-05-14
modified: 2025-02-23
replaces: LGBTQChosenFamilies
comment: Groups of LGBTQ+ people who have intentionally chosen to nurture, support, and love one another as family, whether or not they have biological or legal relationships.
alternative label: LGBTQ chosen families
broader: https://homosaurus.org/v3/homoit0000420
change note: Version 3.7.0
has top concept: LGBTQ+ families
in scheme: v3
narrower: https://homosaurus.org/v3/homoit0000094
narrower: https://homosaurus.org/v3/homoit0000371

LGBTQ+ civil disobedience
type: Concept
issued: 2019-05-14
modified: 2025-02-23
replaces: LGBTQCivilDisobedience
comment: The active, professed refusal of LGBTQ+ people to obey certain laws or governmental orders as a form of activism and resistance.
alternative label: LGBTQ civil disobedience
broader: https://homosaurus.org/v3/homoit0000853
change note: Version 3.7.0
has top concept: LGBTQ+ activism
in scheme: v3
related: https://homosaurus.org/v3/homoit0000068

LGBTQ+ co-fathers
type: Concept
issued: 2019-05-14
modified: 2025-02-23
replaces: LGBTQCoFathers
comment: Co-parenting fathers who are LGBTQ+ people. They may or may not be partners.
alternative label: LGBTQ co-fathers
broader: https://homosaurus.org/v3/homoit0000840
change note: Version 3.7.0
has top concept: LGBTQ+ families
in scheme: v3

LGBTQ+ co-mothers
type: Concept
issued: 2019-05-14
modified: 2025-02-23
replaces: LGBTQCoMothers
comment: Co-parenting mothers who are LGBTQ+ people. They may or may not be partners.
alternative label: LGBTQ co-mothers
broader: https://homosaurus.org/v3/homoit0000840
broader: https://homosaurus.org/v3/homoit0001021
change note: Version 3.7.0
has top concept: LGBTQ+ families
in scheme: v3

LGBTQ+ co-parenthood
type: Concept
issued: 2019-05-14
modified: 2025-02-23
replaces: LGBTQCoParenthood
comment: The state, experience, and condition of being an LGBTQ+ parent who is parenting with one or more people.
alternative label: LGBTQ co-parenthood
broader: https://homosaurus.org/v3/homoit0000914
change note: Version 3.7.0
has top concept: LGBTQ+ parenthood
in scheme: v3
related: https://homosaurus.org/v3/homoit0000840

LGBTQ+ co-parents
type: Concept
issued: 2019-05-14
modified: 2025-02-23
replaces: LGBTQCoParents
comment: Co-parenting people who are LGBTQ+ people. They may or may not be partners.
alternative label: LGBTQ co-parents
broader: https://homosaurus.org/v3/homoit0001075
change note: Version 3.7.0
has top concept: LGBTQ+ families
in scheme: v3
narrower: https://homosaurus.org/v3/homoit0000837
narrower: https://homosaurus.org/v3/homoit0000838
related: https://homosaurus.org/v3/homoit0000839

LGBTQ+ comics
type: Concept
issued: 2019-05-14
modified: 2025-02-23
replaces: comicsLGBTQ
comment: Works consisting of sequential images often accompanied by text; use in reference to comics focusing on LGBTQ+ characters or themes.
alternative label: Comics (LGBTQ)
broader: https://homosaurus.org/v3/homoit0000443
change note: Version 3.7.0
has top concept: Subcultures
in scheme: v3
narrower: https://homosaurus.org/v3/homoit0000828
narrower: https://homosaurus.org/v3/homoit0000874
narrower: https://homosaurus.org/v3/homoit0000897
narrower: https://homosaurus.org/v3/homoit0001587
narrower: https://homosaurus.org/v3/homoit0001588
narrower: https://homosaurus.org/v3/homoit0001589
narrower: https://homosaurus.org/v3/homoit0001590
narrower: https://homosaurus.org/v3/homoit0001591
narrower: https://homosaurus.org/v3/homoit0002400
narrower: https://homosaurus.org/v3/homoit0002402
narrower: https://homosaurus.org/v3/homoit0002404
narrower: https://homosaurus.org/v3/homoit0002406
narrower: https://homosaurus.org/v3/homoit0002503
narrower: https://homosaurus.org/v3/homoit0002524
narrower: https://homosaurus.org/v3/homoit0002575
related: https://homosaurus.org/v3/homoit0002631
related: https://homosaurus.org/v3/homoit0002643
related: https://homosaurus.org/v3/homoit0003660
related: https://homosaurus.org/v3/homoit0003661

LGBTQ+ communes
type: Concept
issued: 2019-05-14
modified: 2025-02-23
replaces: LGBTQCommunes
comment: Groups of LGBTQ+ people living in community and sharing possessions and responsibilities.
alternative label: LGBTQ communes
broader: https://homosaurus.org/v3/homoit0000297
change note: Version 3.7.0
has top concept: LGBTQ+ communities
in scheme: v3

Conception by LGBTQ+ people
type: Concept
issued: 2019-05-14
modified: 2025-02-23
replaces: ConceptionByLGBTQPeople
comment: Umbrella term used to describe the processes by which LGBTQ+ people conceive children, including an LGBTQ+ person, their partner, or a third party becoming pregnant with a child that will be raised by an LGBTQ+ person, as well as LGBTQ+ people conceiving children that will be raised by other parents.
alternative label: Conception by LGBTQ people
broader: https://homosaurus.org/v3/homoit0000864
change note: Version 3.7.0
has top concept: LGBTQ+ family planning
in scheme: v3
narrower: https://homosaurus.org/v3/homoit0000069
narrower: https://homosaurus.org/v3/homoit0000659
narrower: https://homosaurus.org/v3/homoit0001265
narrower: https://homosaurus.org/v3/homoit0001347
related: https://homosaurus.org/v3/homoit0000121
related: https://homosaurus.org/v3/homoit0000347
related: https://homosaurus.org/v3/homoit0000364
related: https://homosaurus.org/v3/homoit0001075

LGBTQ+ conscientious objection
type: Concept
issued: 2019-05-14
modified: 2025-02-23
replaces: LGBTQConscientiousObjection
comment: LGBTQ+ people exercising their right to refuse to perform military service or participate in same-sex marriages on the grounds of freedom of thought, conscience, and/or religion.
alternative label: LGBTQ conscientious objection
broader: https://homosaurus.org/v3/homoit0000853
change note: Version 3.7.0
has top concept: LGBTQ+ activism
in scheme: v3
related: https://homosaurus.org/v3/homoit0000504

LGBTQ+ cruises
type: Concept
issued: 2019-05-14
modified: 2025-02-23
replaces: LGBTQCruises
comment: Voyages on a ship taken for pleasure or as a vacation; use in reference to cruises catered toward LGBTQ+ clientele.
alternative label: LGBTQ cruises
broader: https://homosaurus.org/v3/homoit0000956
change note: Version 3.7.0
has top concept: LGBTQ+ tourism
in scheme: v3

LGBTQ+ dating applications
type: Concept
issued: 2019-05-14
modified: 2025-02-23
replaces: LGBTQDatingApplications
comment: Software applications designed to generate connections between LGBTQ+ people interested in romantic or sexual relationships.
alternative label: LGBTQ dating applications
broader: https://homosaurus.org/v3/homoit0000328
broader: https://homosaurus.org/v3/homoit0000946
change note: Version 3.7.0
has top concept: Social media
in scheme: v3
related: https://homosaurus.org/v3/homoit0000847
related: https://homosaurus.org/v3/homoit0000900
related: https://homosaurus.org/v3/homoit0002393
related: https://homosaurus.org/v3/homoit0003821

LGBTQ+ dating websites
type: Concept
issued: 2019-05-14
modified: 2025-02-23
replaces: LGBTQDatingWebsites
comment: Websites designed to generate connections between LGBTQ+ people interested in romantic or sexual relationships.
alternative label: LGBTQ dating websites
broader: https://homosaurus.org/v3/homoit0000329
broader: https://homosaurus.org/v3/homoit0000962
change note: Version 3.7.0
has top concept: Social media
in scheme: v3
related: https://homosaurus.org/v3/homoit0000846
related: https://homosaurus.org/v3/homoit0000900
related: https://homosaurus.org/v3/homoit0002393
related: https://homosaurus.org/v3/homoit0003821

LGBTQ+ defamation campaigns
type: Concept
issued: 2019-05-14
modified: 2025-02-23
replaces: LGBTQDefamationCampaigns
comment: Publication and dissemination of false statements about LGBTQ+ people, groups, or communities in order to harm their reputations.
alternative label: LGBTQ smear campaigns
alternative label: LGBTQ defamation campaigns
broader: https://homosaurus.org/v3/homoit0001108
change note: Version 3.7.0
has top concept: LGBTQ+ persecutions
in scheme: v3
related: https://homosaurus.org/v3/homoit0000341

LGBTQ+ demonstrations
type: Concept
issued: 2019-05-14
modified: 2025-02-23
replaces: LGBTQDemonstrations
comment: Action taken by large groups of people in protest of the discrimination of or in support for LGBTQ+ individuals, communities, topics, or rights; typically includes marches and rallies with speakers.
alternative label: LGBTQ political marches
alternative label: LGBTQ protests
alternative label: LGBTQ rallies
alternative label: LGBTQ demonstrations
broader: https://homosaurus.org/v3/homoit0000808
broader: https://homosaurus.org/v3/homoit0000853
change note: Version 3.7.0
has top concept: LGBTQ+ activism
in scheme: v3
narrower: https://homosaurus.org/v3/homoit0001905
related: https://homosaurus.org/v3/homoit0000932

LGBTQ+ mystery and detective fiction
type: Concept
issued: 2019-05-14
modified: 2025-02-23
replaces: mysteryAndDetectiveFictionLGBTQ
comment: Written literary works about the investigation of crime or the work of detectives; use in reference to mystery and detective fiction focusing on LGBTQ+ characters and themes.
alternative label: Mystery and detective fiction (LGBTQ)
broader: https://homosaurus.org/v3/homoit0000443
change note: Version 3.7.0
has top concept: Subcultures
in scheme: v3
narrower: https://homosaurus.org/v3/homoit0001575
narrower: https://homosaurus.org/v3/homoit0001576
narrower: https://homosaurus.org/v3/homoit0001577
narrower: https://homosaurus.org/v3/homoit0001578
narrower: https://homosaurus.org/v3/homoit0001579
narrower: https://homosaurus.org/v3/homoit0002429
narrower: https://homosaurus.org/v3/homoit0002430
narrower: https://homosaurus.org/v3/homoit0002431
narrower: https://homosaurus.org/v3/homoit0002432
narrower: https://homosaurus.org/v3/homoit0002497
narrower: https://homosaurus.org/v3/homoit0002518
narrower: https://homosaurus.org/v3/homoit0002567
related: https://homosaurus.org/v3/homoit0002640
related: https://homosaurus.org/v3/homoit0002650

LGBTQ+ direct action
type: Concept
issued: 2019-05-14
modified: 2025-02-23
replaces: LGBTQDirectAction
comment: Use to describe a group of LGBTQ+ people taking action that is intended to reveal an existing problem, highlight an alternative, or demonstrate a possible solution to a social issue.
alternative label: LGBTQ direct action
broader: https://homosaurus.org/v3/homoit0000006
change note: Version 3.7.0
has top concept: LGBTQ+ activism
in scheme: v3
narrower: https://homosaurus.org/v3/homoit0000808
narrower: https://homosaurus.org/v3/homoit0000835
narrower: https://homosaurus.org/v3/homoit0000844
narrower: https://homosaurus.org/v3/homoit0000851
narrower: https://homosaurus.org/v3/homoit0000893
narrower: https://homosaurus.org/v3/homoit0000910
narrower: https://homosaurus.org/v3/homoit0000919
narrower: https://homosaurus.org/v3/homoit0000935
narrower: https://homosaurus.org/v3/homoit0001065
related: https://homosaurus.org/v3/homoit0000861

LGBTQ+ divorce
type: Concept
issued: 2019-05-14
modified: 2025-02-23
replaces: LGBTQDivorce
comment: Legal dissolution of marriages involving one or more LGBTQ+ people.
alternative label: LGBTQ divorce
broader: https://homosaurus.org/v3/homoit0000937
broader: https://homosaurus.org/v3/homoit0000990
change note: Version 3.7.0
has top concept: Living arrangements
in scheme: v3
narrower: https://homosaurus.org/v3/homoit0001255
related: https://homosaurus.org/v3/homoit0000254
related: https://homosaurus.org/v3/homoit0000359

LGBTQ+ domestic violence
type: Concept
issued: 2019-05-14
modified: 2025-02-23
replaces: LGBTQDomesticViolence
comment: Acts of violence and abuse directed toward individuals in private, domestic settings; can be used to describe singular or repeated incidents.
alternative label: LGBTQ domestic violence
broader: https://homosaurus.org/v3/homoit0000059
broader: https://homosaurus.org/v3/homoit0001305
change note: Version 3.7.0
has top concept: Anti-LGBTQ+ violence
in scheme: v3
narrower: https://homosaurus.org/v3/homoit0000675
related: https://homosaurus.org/v3/homoit0000302
related: https://homosaurus.org/v3/homoit0000938
related: https://homosaurus.org/v3/homoit0000959
related: https://homosaurus.org/v3/homoit0001083
related: https://homosaurus.org/v3/homoit0001285
related: https://homosaurus.org/v3/homoit0001311
related: https://homosaurus.org/v3/homoit0001351

LGBTQ+ older people's organizations
type: Concept
issued: 2019-05-14
modified: 2025-02-23
replaces: LGBTQOlderPeoplesOrganisations
comment: Organized groups that serve the needs and interests of older LGBTQ+ people, typically those 60 years and older.
broader: https://homosaurus.org/v3/homoit0000836
change note: Version 3.7.0
has top concept: LGBTQ+ clubs and organizations
in scheme: v3
preferred label: LGBTQ+ older people's organisations
related: https://homosaurus.org/v3/homoit0000393

LGBTQ+ emancipation
type: Concept
issued: 2019-05-14
modified: 2025-02-23
replaces: LGBTQEmancipation
comment: Term used to describe efforts to obtain LGBTQ+ political rights or equality.
alternative label: LGBTQ emancipation
broader: https://homosaurus.org/v3/homoit0000947
change note: Version 3.7.0
has top concept: LGBTQ+ social processes
in scheme: v3
related: https://homosaurus.org/v3/homoit0000500

LGBTQ+ erotic literature
type: Concept
issued: 2019-05-14
modified: 2025-02-23
replaces: eroticLiteratureLGBTQ
comment: Literary works that have erotic or sexual elements; use in reference to erotic literature focusing on LGBTQ+ characters or themes.
alternative label: Erotic literature (LGBTQ)
broader: https://homosaurus.org/v3/homoit0000403
broader: https://homosaurus.org/v3/homoit0000443
change note: Version 3.7.0
has top concept: Erotica
in scheme: v3
narrower: https://homosaurus.org/v3/homoit0001597
narrower: https://homosaurus.org/v3/homoit0001598
narrower: https://homosaurus.org/v3/homoit0001599
narrower: https://homosaurus.org/v3/homoit0001600
narrower: https://homosaurus.org/v3/homoit0001601
narrower: https://homosaurus.org/v3/homoit0002413
narrower: https://homosaurus.org/v3/homoit0002415
narrower: https://homosaurus.org/v3/homoit0002416
narrower: https://homosaurus.org/v3/homoit0002451
narrower: https://homosaurus.org/v3/homoit0002494
narrower: https://homosaurus.org/v3/homoit0002515
narrower: https://homosaurus.org/v3/homoit0002572
related: https://homosaurus.org/v3/homoit0002172
related: https://homosaurus.org/v3/homoit0002184
related: https://homosaurus.org/v3/homoit0002188
related: https://homosaurus.org/v3/homoit0002205
related: https://homosaurus.org/v3/homoit0002635
related: https://homosaurus.org/v3/homoit0002644

LGBTQ+ people in ethnic groups
type: Concept
issued: 2019-05-14
modified: 2025-02-23
replaces: LGBTQEthnicGroups
comment: Groups of people who share an identity based on a common nationality, culture, ancestry, language, religion, etc. and who also identify as LGBTQ+. Do not use to describe migrants.
alternative label: Ethnic groups (LGBTQ)
alternative label: People in ethnic groups (LGBTQ)
alternative label: LGBTQ+ ethnic groups
broader: https://homosaurus.org/v3/homoit0000915
change note: Version 3.7.0
has top concept: LGBTQ+ people
in scheme: v3
narrower: https://homosaurus.org/v3/homoit0000682
narrower: https://homosaurus.org/v3/homoit0000875
narrower: https://homosaurus.org/v3/homoit0001812
narrower: https://homosaurus.org/v3/homoit0002007
narrower: https://homosaurus.org/v3/homoit0002009
narrower: https://homosaurus.org/v3/homoit0002044
narrower: https://homosaurus.org/v3/homoit0002060
narrower: https://homosaurus.org/v3/homoit0002070
narrower: https://homosaurus.org/v3/homoit0002078
narrower: https://homosaurus.org/v3/homoit0002086
narrower: https://homosaurus.org/v3/homoit0002094
narrower: https://homosaurus.org/v3/homoit0002102
narrower: https://homosaurus.org/v3/homoit0002110
narrower: https://homosaurus.org/v3/homoit0002118
narrower: https://homosaurus.org/v3/homoit0002126
narrower: https://homosaurus.org/v3/homoit0002134
narrower: https://homosaurus.org/v3/homoit0002231
narrower: https://homosaurus.org/v3/homoit0002239
narrower: https://homosaurus.org/v3/homoit0002247
narrower: https://homosaurus.org/v3/homoit0002295
narrower: https://homosaurus.org/v3/homoit0002303
narrower: https://homosaurus.org/v3/homoit0002311
narrower: https://homosaurus.org/v3/homoit0002319
narrower: https://homosaurus.org/v3/homoit0002526
narrower: https://homosaurus.org/v3/homoit0003306
narrower: https://homosaurus.org/v3/homoit0003319
narrower: https://homosaurus.org/v3/homoit0003334
narrower: https://homosaurus.org/v3/homoit0002022
narrower: https://homosaurus.org/v3/homoit0000886
narrower: https://homosaurus.org/v3/homoit0000253
related: https://homosaurus.org/v3/homoit0000667
related: https://homosaurus.org/v3/homoit0000902
related: https://homosaurus.org/v3/homoit0001133
related: https://homosaurus.org/v3/homoit0001482

LGBTQ+ veterans
type: Concept
issued: 2019-05-14
modified: 2025-02-23
replaces: LGBTQVeterans
comment: LGBTQ+ people who have served in but are no longer active members of the military or armed forces.
alternative label: LGBTQ ex-military personnel
alternative label: LGBTQ veterans
broader: https://homosaurus.org/v3/homoit0000915
change note: Version 3.7.0
has top concept: LGBTQ+ people
in scheme: v3
related: https://homosaurus.org/v3/homoit0001100

LGBTQ+ ex-partners
type: Concept
issued: 2019-05-14
modified: 2025-02-23
replaces: LGBTQExPartners
comment: Gender-neutral term for former sexual, romantic, or play partners who are also LGBTQ+.
alternative label: LGBTQ ex-partners
broader: https://homosaurus.org/v3/homoit0001083
change note: Version 3.7.0
has top concept: LGBTQ+ families
in scheme: v3

LGBTQ+ fantasy fiction
type: Concept
issued: 2019-05-14
modified: 2025-02-23
replaces: fantasyFictionLGBTQ
comment: Genre that uses magic and other supernatural phenomena as a primary element of plot, theme, and/or setting; use for fantasy fiction focusing on LGBTQ+ characters or themes.
alternative label: Fantasy fiction (LGBTQ)
broader: https://homosaurus.org/v3/homoit0000443
change note: Version 3.7.0
has top concept: Subcultures
in scheme: v3
narrower: https://homosaurus.org/v3/homoit0001565
narrower: https://homosaurus.org/v3/homoit0001566
narrower: https://homosaurus.org/v3/homoit0001567
narrower: https://homosaurus.org/v3/homoit0001568
narrower: https://homosaurus.org/v3/homoit0001569
narrower: https://homosaurus.org/v3/homoit0002417
narrower: https://homosaurus.org/v3/homoit0002418
narrower: https://homosaurus.org/v3/homoit0002419
narrower: https://homosaurus.org/v3/homoit0002420
narrower: https://homosaurus.org/v3/homoit0002495
narrower: https://homosaurus.org/v3/homoit0002516
narrower: https://homosaurus.org/v3/homoit0002571
narrower: https://homosaurus.org/v3/homoit0003179
related: https://homosaurus.org/v3/homoit0000934
related: https://homosaurus.org/v3/homoit0002636
related: https://homosaurus.org/v3/homoit0002646

LGBTQ+ fatherhood
type: Concept
issued: 2019-05-14
modified: 2025-02-23
replaces: LGBTQFatherhood
comment: Fatherhood experiences, as experienced by LGBTQ+ people.
alternative label: Fatherhood (LGBTQ)
alternative label: LGBTQ fatherhood
alternative label: Paternity (LGBTQ)
alternative label: LGBTQ+ paternity
broader: https://homosaurus.org/v3/homoit0000810
broader: https://homosaurus.org/v3/homoit0000914
change note: Version 3.7.0
has top concept: LGBTQ+ families
in scheme: v3
related: https://homosaurus.org/v3/homoit0000423

LGBTQ+ film censorship
type: Concept
issued: 2019-05-14
modified: 2025-02-23
replaces: LGBTQFilmCensorship
comment: The suppression or prohibition of films by LGBTQ+ filmmakers or about LGBTQ+ people and issues; includes censorship due to religious, moral, political, or social objections.
alternative label: LGBTQ film censorship
broader: https://homosaurus.org/v3/homoit0000829
change note: Version 3.7.0
has top concept: Censorship
in scheme: v3
related: https://homosaurus.org/v3/homoit0000869
related: https://homosaurus.org/v3/homoit0002327

LGBTQ+ films
type: Concept
issued: 2019-05-14
modified: 2025-02-23
replaces: LGBTQFilms
comment: Series of moving images edited to tell a story or capture an event; use in reference to films focusing on LGBTQ+ characters or themes.
alternative label: LGBTQ films
broader: https://homosaurus.org/v3/homoit0002327
change note: Version 3.7.0
has top concept: Subcultures
in scheme: v3
narrower: https://homosaurus.org/v3/homoit0001982
narrower: https://homosaurus.org/v3/homoit0002329
narrower: https://homosaurus.org/v3/homoit0002331
narrower: https://homosaurus.org/v3/homoit0002445
narrower: https://homosaurus.org/v3/homoit0002446
narrower: https://homosaurus.org/v3/homoit0002447
narrower: https://homosaurus.org/v3/homoit0002544
narrower: https://homosaurus.org/v3/homoit0002561
narrower: https://homosaurus.org/v3/homoit0002562
narrower: https://homosaurus.org/v3/homoit0002563
narrower: https://homosaurus.org/v3/homoit0002564
narrower: https://homosaurus.org/v3/homoit0003720
related: https://homosaurus.org/v3/homoit0000013
related: https://homosaurus.org/v3/homoit0000249
related: https://homosaurus.org/v3/homoit0000816
related: https://homosaurus.org/v3/homoit0000867
related: https://homosaurus.org/v3/homoit0000868
related: https://homosaurus.org/v3/homoit0002142
related: https://homosaurus.org/v3/homoit0002560

LGBTQ+ foster families
type: Concept
issued: 2019-05-14
modified: 2025-02-23
replaces: LGBTQFosterFamilies
comment: Families including foster children in which one or more individuals identify as LGBTQ+.
alternative label: LGBTQ foster families
broader: https://homosaurus.org/v3/homoit0000420
change note: Version 3.7.0
has top concept: LGBTQ+ families
in scheme: v3
narrower: https://homosaurus.org/v3/homoit0000872
related: https://homosaurus.org/v3/homoit0000254
related: https://homosaurus.org/v3/homoit0000809
related: https://homosaurus.org/v3/homoit0000811
related: https://homosaurus.org/v3/homoit0000914
related: https://homosaurus.org/v3/homoit0001075

LGBTQ+ foster parenthood
type: Concept
issued: 2019-05-14
modified: 2025-02-23
replaces: LGBTQFosterParenthood
comment: The experiences involved in foster parenting, as experienced by LGBTQ+ people.
alternative label: LGBTQ foster parenthood
broader: https://homosaurus.org/v3/homoit0000914
change note: Version 3.7.0
has top concept: LGBTQ+ parenthood
in scheme: v3
related: https://homosaurus.org/v3/homoit0000420
related: https://homosaurus.org/v3/homoit0000811
related: https://homosaurus.org/v3/homoit0000864
related: https://homosaurus.org/v3/homoit0000945
related: https://homosaurus.org/v3/homoit0001001
related: https://homosaurus.org/v3/homoit0001093

LGBTQ+ foster parents
type: Concept
issued: 2019-05-14
modified: 2025-02-23
replaces: LGBTQFosterParents
comment: Foster parents who are LGBTQ+ people.
alternative label: LGBTQ foster parents
broader: https://homosaurus.org/v3/homoit0000420
broader: https://homosaurus.org/v3/homoit0000870
broader: https://homosaurus.org/v3/homoit0001075
change note: Version 3.7.0
has top concept: LGBTQ+ families
in scheme: v3
related: https://homosaurus.org/v3/homoit0000812

LGBTQ+ graphic novels
type: Concept
issued: 2019-05-14
modified: 2025-02-23
replaces: LGBTQGraphicNovels
comment: Works consisting of sequential images often accompanied by text that generally contain stand-alone stories; used in reference to graphic novels focusing on LGBTQ+ characters or themes.
alternative label: LGBTQ graphic novels
broader: https://homosaurus.org/v3/homoit0000443
broader: https://homosaurus.org/v3/homoit0000841
change note: Version 3.7.0
has top concept: Subcultures
in scheme: v3
narrower: https://homosaurus.org/v3/homoit0002421
narrower: https://homosaurus.org/v3/homoit0002422
narrower: https://homosaurus.org/v3/homoit0002423
narrower: https://homosaurus.org/v3/homoit0002424
narrower: https://homosaurus.org/v3/homoit0002569
narrower: https://homosaurus.org/v3/homoit0003427
narrower: https://homosaurus.org/v3/homoit0003428
narrower: https://homosaurus.org/v3/homoit0003429
narrower: https://homosaurus.org/v3/homoit0003430
narrower: https://homosaurus.org/v3/homoit0003431
narrower: https://homosaurus.org/v3/homoit0003432
related: https://homosaurus.org/v3/homoit0002638
related: https://homosaurus.org/v3/homoit0002648

Romani LGBTQ+ people
type: Concept
issued: 2019-05-14
modified: 2025-02-23
replaces: LGBTQRoma
comment: LGBTQ+ people who are Romani, or part of the traditionally nomadic Indo-European people.
alternative label: Roma (LGBTQ)
alternative label: Romani people (LGBTQ)
alternative label: LGBTQ+ Roma
alternative label: LGBTQ+ Romani people
broader: https://homosaurus.org/v3/homoit0000860
change note: Version 3.7.0
has top concept: LGBTQ+ people
in scheme: v3
narrower: https://homosaurus.org/v3/homoit0001949
narrower: https://homosaurus.org/v3/homoit0001950
narrower: https://homosaurus.org/v3/homoit0001951
narrower: https://homosaurus.org/v3/homoit0001952
narrower: https://homosaurus.org/v3/homoit0001953
narrower: https://homosaurus.org/v3/homoit0001954
narrower: https://homosaurus.org/v3/homoit0002913
narrower: https://homosaurus.org/v3/homoit0003425

LGBTQ+ health care centers
type: Concept
issued: 2019-05-14
modified: 2025-02-23
replaces: LGBTQHealthCareCentres
comment: Institutions providing health services for LGBTQ+ people.
broader: https://homosaurus.org/v3/homoit0000830
change note: Version 3.7.0
has top concept: LGBTQ+ centers
in scheme: v3
preferred label: LGBTQ+ health care centres
related: https://homosaurus.org/v3/homoit0000614

LGBTQ+ health education
type: Concept
issued: 2019-05-14
modified: 2025-02-23
replaces: LGBTQHealthEducation
comment: Instruction about health for LGBTQ+ people, including topics such as gender-affirming healthcare and safer sex practices.
alternative label: LGBTQ health education
broader: https://homosaurus.org/v3/homoit0000661
change note: Version 3.7.0
has top concept: Information provision
in scheme: v3

LGBTQ+ unhoused people
type: Concept
issued: 2019-05-14
modified: 2025-02-23
replaces: LGBTQHomelessPeople
comment: LGBTQ+ people who do not have access to stable, safe, and adequate housing; includes people living in emergency shelters; transitional housing, and on the street.
alternative label: Unhoused people (LGBT)
alternative label: LGBTQ+ homeless people
alternative label: LGBTQ+ houseless people
alternative label: LGBTQ+ unsheltered people
broader: https://homosaurus.org/v3/homoit0000915
change note: Version 3.7.0
has top concept: LGBTQ+ people
in scheme: v3
narrower: https://homosaurus.org/v3/homoit0000880

LGBTQ+ unhoused youth
type: Concept
issued: 2019-05-14
modified: 2025-02-23
replaces: LGBTQHomelessYouth
comment: LGBTQ+ people between the ages of childhood and adulthood who do not have access to stable, safe, and adequate housing; includes youth living in emergency shelters, transitional housing, and on the street.
alternative label: LGBTQ+ homeless youth
alternative label: LGBTQ+ unhoused adolescents
alternative label: LGBTQ+ unhoused teenagers
alternative label: LGBTQ+ unsheltered youth
broader: https://homosaurus.org/v3/homoit0000879
broader: https://homosaurus.org/v3/homoit0001521
change note: Version 3.7.0
has top concept: LGBTQ+ people
in scheme: v3
related: https://homosaurus.org/v3/homoit0002460

LGBTQ+ immigration rights
type: Concept
issued: 2019-05-14
modified: 2025-02-23
replaces: LGBTQImmigrationRights
comment: Legal and social entitlement to freedom, equality, and protection held by LGBTQ+ immigrants.
alternative label: LGBTQ immigration rights
broader: https://homosaurus.org/v3/homoit0000712
change note: Version 3.7.0
has top concept: Legal status
in scheme: v3
related: https://homosaurus.org/v3/homoit0000348
related: https://homosaurus.org/v3/homoit0000927
related: https://homosaurus.org/v3/homoit0001053
related: https://homosaurus.org/v3/homoit0001092
related: https://homosaurus.org/v3/homoit0001482
related: https://homosaurus.org/v3/homoit0001815
related: https://homosaurus.org/v3/homoit0001853

LGBTQ+ imprisonment
type: Concept
issued: 2019-05-14
modified: 2025-02-23
replaces: LGBTQImprisonment
comment: Confinement, including physical and/or legal restraint, of LGBTQ+ people by an institution or authority. Typically used to describe confinement to a public or private prison that is sentenced by a court within a penal system.
alternative label: LGBTQ imprisonment
broader: https://homosaurus.org/v3/homoit0000348
change note: Version 3.7.0
has top concept: Detention of LGBTQ+ people
in scheme: v3
related: https://homosaurus.org/v3/homoit0000887

LGBTQ+ incest victims
type: Concept
issued: 2019-05-14
modified: 2025-02-23
replaces: LGBTQIncestVictims
comment: LGBTQ+ people who have experienced incest and may or may not have survived; follow individuals' preference for "victims" or "survivors" whenever possible.
alternative label: LGBTQ victims of incest
alternative label: LGBTQ incest victims
broader: https://homosaurus.org/v3/homoit0000959
change note: Version 3.7.0
has top concept: LGBTQ+ people
in scheme: v3
narrower: https://homosaurus.org/v3/homoit0002062

Indigenous LGBTQ+ people
type: Concept
issued: 2019-05-14
modified: 2025-02-23
replaces: LGBTQIndigenousPeople
comment: LGBTQ+ people who are part of an Indigenous people, or culturally distinct ethnic group whose members are directly descended from the earliest known inhabitants of a particular region and, to some extent, maintain the language and culture of those people. Only use to describe people who identify as Indigenous; use more specific terms whenever possible.
alternative label: Indigenous people (LGBTQ)
alternative label: LGBTQ+ Indigenous people
broader: https://homosaurus.org/v3/homoit0001101
broader: https://homosaurus.org/v3/homoit0000860
change note: Version 3.7.0
has top concept: LGBTQ+ people
in scheme: v3
narrower: https://homosaurus.org/v3/homoit0000002
narrower: https://homosaurus.org/v3/homoit0000676
narrower: https://homosaurus.org/v3/homoit0000898
narrower: https://homosaurus.org/v3/homoit0000913
narrower: https://homosaurus.org/v3/homoit0001037
narrower: https://homosaurus.org/v3/homoit0001809
narrower: https://homosaurus.org/v3/homoit0001955
narrower: https://homosaurus.org/v3/homoit0001968
narrower: https://homosaurus.org/v3/homoit0001969
narrower: https://homosaurus.org/v3/homoit0001970
narrower: https://homosaurus.org/v3/homoit0001971
narrower: https://homosaurus.org/v3/homoit0001972
narrower: https://homosaurus.org/v3/homoit0001973
narrower: https://homosaurus.org/v3/homoit0002922
narrower: https://homosaurus.org/v3/homoit0003232
narrower: https://homosaurus.org/v3/homoit0003280
narrower: https://homosaurus.org/v3/homoit0003293
narrower: https://homosaurus.org/v3/homoit0003333
narrower: https://homosaurus.org/v3/homoit0001812
narrower: https://homosaurus.org/v3/homoit0001480
related: https://homosaurus.org/v3/homoit0001240
related: https://homosaurus.org/v3/homoit0002377
related: https://homosaurus.org/v3/homoit0000322

LGBTQ+ prisoners
type: Concept
issued: 2019-05-14
modified: 2025-02-23
replaces: LGBTQPrisoners
comment: LGBTQ+ people who are deprived of their liberty against their will by an institution or authority. Typically used to describe individuals sentenced to confinement in a public or private prison by a court within a penal system, but may also include people forcibly confined to hospitals and other institutions.
alternative label: LGBTQ inmates
alternative label: Prisoners (LGBTQ)
alternative label: LGBTQ prisoners
broader: https://homosaurus.org/v3/homoit0000915
change note: Version 3.7.0
has top concept: LGBTQ+ people
in scheme: v3
narrower: https://homosaurus.org/v3/homoit0000924
related: https://homosaurus.org/v3/homoit0000348
related: https://homosaurus.org/v3/homoit0000884

LGBTQ+ Internet forums
type: Concept
issued: 2019-05-14
modified: 2025-02-23
replaces: LGBTQInternetForums
comment: Websites that facilitate online conversations between LGBTQ+ people, often about LGBQ+ issues.
alternative label: LGBTQ Internet forums
broader: https://homosaurus.org/v3/homoit0000665
broader: https://homosaurus.org/v3/homoit0000946
change note: Version 3.7.0
has top concept: Social media
in scheme: v3
related: https://homosaurus.org/v3/homoit0000962

LGBTQ+ literary awards
type: Concept
issued: 2019-05-14
modified: 2025-02-23
replaces: LGBTQLiteraryAwards
comment: Prizes or forms of recognition given in honor of influential LGBTQ+ writers or literary works featuring LGBTQ+ characters and themes.
alternative label: LGBTQ literary awards
broader: https://homosaurus.org/v3/homoit0000818
change note: Version 3.7.0
has top concept: LGBTQ+ awards
in scheme: v3
related: https://homosaurus.org/v3/homoit0000972

LGBTQ+ lobbying
type: Concept
issued: 2019-05-14
modified: 2025-02-23
replaces: LGBTQLobbying
comment: Actions taken by individuals or groups to influence legislative action (or non-action), policies, or decisions of government officials in favor of LGBTQ+ people, communities, or issues.
alternative label: LGBTQ lobbying
broader: https://homosaurus.org/v3/homoit0000853
change note: Version 3.7.0
has top concept: LGBTQ+ activism
in scheme: v3
related: https://homosaurus.org/v3/homoit0000702

LGBTQ+ love
type: Concept
issued: 2019-05-14
modified: 2025-02-23
replaces: LGBTQLove
comment: Strong feelings of affection arising out of kinship, personal ties, or intimate relationships between two or more LGBTQ+ people. Can be used to describe the particularities of love as experienced by LGBTQ+ people in a given culture, as well as the ways love is discussed and expressed within LGBTQ+ communities.
alternative label: LGBTQ love
alternative label: Love (LGBTQ)
broader: https://homosaurus.org/v3/homoit0003826
change note: Version 3.7.0
has top concept: Theories
in scheme: v3
narrower: https://homosaurus.org/v3/homoit0000921
narrower: https://homosaurus.org/v3/homoit0000957
related: https://homosaurus.org/v3/homoit0000976
related: https://homosaurus.org/v3/homoit0001237

LGBTQ+ lovers
type: Concept
issued: 2019-05-14
modified: 2025-02-23
replaces: LGBTQLovers
comment: LGBTQ+ people engaging in sexual or romantic relationships with other people; typically used to describe people who are not married.
alternative label: Lovers (LGBTQ)
alternative label: LGBTQ lovers
broader: https://homosaurus.org/v3/homoit0000915
change note: Version 3.7.0
has top concept: LGBTQ+ people
in scheme: v3
related: https://homosaurus.org/v3/homoit0000458
related: https://homosaurus.org/v3/homoit0001083
related: https://homosaurus.org/v3/homoit0001302
related: https://homosaurus.org/v3/homoit0001311

LGBTQ+ magazines
type: Concept
issued: 2019-05-14
modified: 2025-02-23
replaces: LGBTQMagazines
comment: Print or digital publications about LGBTQ+ people and LGBTQ+ issues (typically produced by LGBTQ+ people or LGBTQ+ organizations) that contain articles, photographs, and illustrations, and advertisements.
alternative label: LGBTQ magazines
broader: https://homosaurus.org/v3/homoit0001132
broader: https://homosaurus.org/v3/homoit0001830
change note: Version 3.7.0
has top concept: LGBTQ+ press
in scheme: v3
related: https://homosaurus.org/v3/homoit0000177
related: https://homosaurus.org/v3/homoit0000521
related: https://homosaurus.org/v3/homoit0000766
related: https://homosaurus.org/v3/homoit0000965
related: https://homosaurus.org/v3/homoit0001041
related: https://homosaurus.org/v3/homoit0001042
related: https://homosaurus.org/v3/homoit0001436

LGBTQ+ manga
type: Concept
issued: 2019-05-14
modified: 2025-02-23
replaces: LGBTQMangas
comment: Japanese comics or graphic novels focused on LGBTQ+ people or themes.
alternative label: LGBTQ manga
broader: https://homosaurus.org/v3/homoit0000841
change note: Version 3.7.0
has top concept: Subcultures
in scheme: v3
related: https://homosaurus.org/v3/homoit0002144
related: https://homosaurus.org/v3/homoit0002172

Takatāpui
type: Concept
issued: 2019-05-14
modified: 2025-02-23
replaces: takatapui
comment: Term used by the Māori people, or people who are part of the Indigenous Polynesian people of mainland Aotearoa (New Zealand), that was historically used to describe an "intimate companion of the same sex." In the 1980s, the term was reclaimed for use by lesbian, gay, bisexual, transgender, queer, intersex people, and other members of Rainbow communities. Only use to refer to individuals who identify as Takatāpui.
alternative label: LGBTQ+ Māori people
alternative label: Māori (LGBTQ)
alternative label: Māori LGBTQ+ people
broader: https://homosaurus.org/v3/homoit0000322
broader: https://homosaurus.org/v3/homoit0000886
broader: https://homosaurus.org/v3/homoit0001297
change note: Version 3.7.0
has top concept: Gender
in scheme: v3
related: https://homosaurus.org/v3/homoit0001810

LGBTQ+ migrants
type: Concept
issued: 2019-05-14
modified: 2025-02-23
replaces: LGBTQMigrants
comment: LGBTQ+ people who temporarily or permanently move away from their place of residence within a country or across an international border.
alternative label: Migrants (LGBTQ)
alternative label: LGBTQ migrants
broader: https://homosaurus.org/v3/homoit0000915
change note: Version 3.7.0
has top concept: LGBTQ+ people
in scheme: v3
related: https://homosaurus.org/v3/homoit0000860
related: https://homosaurus.org/v3/homoit0000927
related: https://homosaurus.org/v3/homoit0001482
related: https://homosaurus.org/v3/homoit0001815
related: https://homosaurus.org/v3/homoit0001853

Multiracial LGBTQ+ people
type: Concept
issued: 2019-05-14
modified: 2025-02-23
replaces: LGBTQMultiRacialPeople
comment: LGBTQ+ people who belong to more than one racial group.
alternative label: Multi-racial people (LGBTQ)
alternative label: Multiracial people (LGBTQ)
alternative label: LGBTQ+ mixed-race people
alternative label: LGBTQ+ multi-racial people
alternative label: LGBTQ+ multiracial people
alternative label: Mixed-race LGBTQ+ people
alternative label: Multi-racial LGBTQ+ people
broader: https://homosaurus.org/v3/homoit0001101
change note: Version 3.7.0
has top concept: LGBTQ+ people
in scheme: v3
narrower: https://homosaurus.org/v3/homoit0001801
narrower: https://homosaurus.org/v3/homoit0001802
narrower: https://homosaurus.org/v3/homoit0001803
narrower: https://homosaurus.org/v3/homoit0001804
narrower: https://homosaurus.org/v3/homoit0001805
narrower: https://homosaurus.org/v3/homoit0002903
narrower: https://homosaurus.org/v3/homoit0002963
narrower: https://homosaurus.org/v3/homoit0003421

LGBTQ+ Mormons
type: Concept
issued: 2019-05-14
modified: 2025-02-23
replaces: LGBTQMormons
comment: LGBTQ+ people who are members of the Mormon Church.
alternative label: Mormons (LGBTQ)
alternative label: LGBTQ Mormons
broader: https://homosaurus.org/v3/homoit0000265
change note: Version 3.7.0
has top concept: LGBTQ+ religious people
in scheme: v3

LGBTQ+ motherhood
type: Concept
issued: 2019-05-14
modified: 2025-02-23
replaces: LGBTQMotherhood
comment: Motherhood experiences, as experienced by LGBTQ+ people.
alternative label: LGBTQ motherhood
alternative label: Maternity (LGBTQ)
alternative label: Motherhood (LGBTQ)
alternative label: LGBTQ+ maternity
broader: https://homosaurus.org/v3/homoit0000810
broader: https://homosaurus.org/v3/homoit0000914
change note: Version 3.7.0
has top concept: LGBTQ+ families
in scheme: v3
related: https://homosaurus.org/v3/homoit0001001
related: https://homosaurus.org/v3/homoit0001021

LGBTQ+ motorcycle clubs
type: Concept
issued: 2019-05-14
modified: 2025-02-23
replaces: LGBTQMotorcycleClubs
comment: Organized groups of LGBTQ+ people formed around shared interest in and activities related to motorcycles.
alternative label: LGBTQ motorcycle clubs
broader: https://homosaurus.org/v3/homoit0000836
change note: Version 3.7.0
has top concept: LGBTQ+ clubs and organizations
in scheme: v3
related: https://homosaurus.org/v3/homoit0000385
related: https://homosaurus.org/v3/homoit0000705
related: https://homosaurus.org/v3/homoit0003104

LGBTQ+ musicians
type: Concept
issued: 2019-05-14
modified: 2025-02-23
replaces: LGBTQMusicians
comment: LGBTQ+ people who create and/or perform music.
alternative label: Musicians (LGBTQ)
alternative label: LGBTQ musicians
broader: https://homosaurus.org/v3/homoit0000915
change note: Version 3.7.0
has top concept: LGBTQ+ people
in scheme: v3
related: https://homosaurus.org/v3/homoit0000816
related: https://homosaurus.org/v3/homoit0000833
related: https://homosaurus.org/v3/homoit0002147
related: https://homosaurus.org/v3/homoit0003610

LGBTQ+ nonviolent resistance
type: Concept
issued: 2019-05-14
modified: 2025-02-23
replaces: LGBTQNonviolentResistance
comment: Actions taken to promote social change for LGBTQ+ people and communities through non-violent means, including protests, boycotts, and organized non-cooperation.
alternative label: LGBTQ nonviolent resistance
broader: https://homosaurus.org/v3/homoit0000853
change note: Version 3.7.0
has top concept: LGBTQ+ activism
in scheme: v3

LGBTQ+ obituaries
type: Concept
issued: 2019-05-14
modified: 2025-02-23
replaces: LGBTQObituaries
comment: Public notices published shortly after an LGBTQ+ person's death to inform others of their passing and celebrate their life.
alternative label: LGBTQ obituaries
broader: https://homosaurus.org/v3/homoit0001042
change note: Version 3.7.0
has top concept: LGBTQ+ press
in scheme: v3
related: https://homosaurus.org/v3/homoit0000848
related: https://homosaurus.org/v3/homoit0000849
related: https://homosaurus.org/v3/homoit0002258

LGBTQ+ Old Catholics
type: Concept
issued: 2019-05-14
modified: 2025-02-23
replaces: LGBTQOldCatholicChurch
comment: LGBTQ+ members of the anti-papal-primacy Christian denomination that originated with groups that split from the Holy See because they disagreed with essential doctrines.
alternative label: LGBTQ+ Old Catholic Church
broader: https://homosaurus.org/v3/homoit0000265
change note: Version 3.7.0
has top concept: LGBTQ+ religious people
in scheme: v3

Papuan LGBTQ+ people
type: Concept
issued: 2019-05-14
modified: 2025-02-23
replaces: LGBTQPapuans
comment: LGBTQ+ people who are Papuan, or part of the Indigenous peoples of new Guinea; only use for people who identify as Papuan.
alternative label: Papuans (LGBTQ)
alternative label: Papuan people (LGBTQ)
alternative label: LGBTQ+ Papuan people
alternative label: LGBTQ+ Papuans
broader: https://homosaurus.org/v3/homoit0000886
change note: Version 3.7.0
has top concept: LGBTQ+ people
in scheme: v3
narrower: https://homosaurus.org/v3/homoit0001943
narrower: https://homosaurus.org/v3/homoit0001944
narrower: https://homosaurus.org/v3/homoit0001945
narrower: https://homosaurus.org/v3/homoit0001946
narrower: https://homosaurus.org/v3/homoit0001947
narrower: https://homosaurus.org/v3/homoit0001948
narrower: https://homosaurus.org/v3/homoit0002927
narrower: https://homosaurus.org/v3/homoit0003424
related: https://homosaurus.org/v3/homoit0001809
related: https://homosaurus.org/v3/homoit0001810

LGBTQ+ personal and family law
type: Concept
issued: 2019-05-14
modified: 2025-02-23
replaces: LGBTQPersonalAndFamilyLaw
comment: Legal regulations and laws addressing changes to LGBTQ people’s legal names or gender markers, as well as LGBTQ people’s family relationships, including cohabitation, marriage, adoption, parent-child relationships, divorce, and child custody.
alternative label: LGBTQ personal and family law
broader: https://homosaurus.org/v3/homoit0000702
change note: Version 3.7.0
has top concept: Law
in scheme: v3
narrower: https://homosaurus.org/v3/homoit0000247
narrower: https://homosaurus.org/v3/homoit0000711
narrower: https://homosaurus.org/v3/homoit0000992
related: https://homosaurus.org/v3/homoit0000118
related: https://homosaurus.org/v3/homoit0000254
related: https://homosaurus.org/v3/homoit0000274
related: https://homosaurus.org/v3/homoit0000304
related: https://homosaurus.org/v3/homoit0000360
related: https://homosaurus.org/v3/homoit0000361
related: https://homosaurus.org/v3/homoit0000364
related: https://homosaurus.org/v3/homoit0000675
related: https://homosaurus.org/v3/homoit0000809
related: https://homosaurus.org/v3/homoit0000811
related: https://homosaurus.org/v3/homoit0001053
related: https://homosaurus.org/v3/homoit0001074

LGBTQ+ petitions
type: Concept
issued: 2019-05-14
modified: 2025-02-23
replaces: LGBTQPetitions
comment: Written requests for political or social action that are addressed to government officials or public entities and signed by numerous people; use in reference to petitions created by or addressing LGBTQ+ organizations, communities, and/or concerns.
alternative label: LGBTQ petitions
broader: https://homosaurus.org/v3/homoit0000853
change note: Version 3.7.0
has top concept: LGBTQ+ activism
in scheme: v3

LGBTQ+ platonic love
type: Concept
issued: 2019-05-14
modified: 2025-02-23
replaces: LGBTQPlatonicLove
comment: Deep feelings of affection between two or more LGBTQ+ people that is neither sexual nor romantic.
alternative label: LGBTQ platonic love
alternative label: Queerplatonic
broader: https://homosaurus.org/v3/homoit0000894
change note: Version 3.7.0
has top concept: Theories
in scheme: v3
related: https://homosaurus.org/v3/homoit0003592

LGBTQ+ porn magazines
type: Concept
issued: 2019-05-14
modified: 2025-02-23
replaces: LGBTQPornMagazines
comment: Erotic or sexually explicit magazines featuring LGBTQ+ people.
alternative label: LGBTQ porn magazines
broader: https://homosaurus.org/v3/homoit0001132
broader: https://homosaurus.org/v3/homoit0003802
change note: Version 3.7.0
has top concept: LGBTQ+ press
in scheme: v3
related: https://homosaurus.org/v3/homoit0001126
related: https://homosaurus.org/v3/homoit0001830

LGBTQ+ prisoners of conscience
type: Concept
issued: 2019-05-14
modified: 2025-02-23
replaces: LGBTQPrisonersOfConscience
comment: LGBTQ+ people who are imprisoned because of their sexual or gender identities; may also be used to describe LGBTQ+ individuals imprisoned because of their race, religion, or political views.
alternative label: Prisoners of conscience (LGBTQ)
alternative label: LGBTQ prisoners of conscience
broader: https://homosaurus.org/v3/homoit0000887
change note: Version 3.7.0
has top concept: LGBTQ+ people
in scheme: v3

LGBTQ+ Quakers
type: Concept
issued: 2019-05-14
modified: 2025-02-23
replaces: LGBTQQuakers
comment: LGBTQ+ people who are Quakers.
alternative label: LGBTQ Religious Society of Friends
alternative label: LGBTQ Society of Friends
alternative label: Quakers (LGBTQ)
alternative label: LGBTQ Quakers
broader: https://homosaurus.org/v3/homoit0001137
change note: Version 3.7.0
has top concept: LGBTQ+ religious people
in scheme: v3

LGBTQ+ refugees
type: Concept
issued: 2019-05-14
modified: 2025-02-23
replaces: LGBTQRefugees
comment: LGBTQ+ people who have fled to another country to escape war, persecution, natural disaster, or other forms of conflict. Only use for people legally recognized as refugees; otherwise, use LGBTQ+ asylum seekers.
alternative label: Refugees (LGBTQ)
alternative label: LGBTQ refugees
broader: https://homosaurus.org/v3/homoit0000915
change note: Version 3.7.0
has top concept: LGBTQ+ people
in scheme: v3
related: https://homosaurus.org/v3/homoit0000712
related: https://homosaurus.org/v3/homoit0000883
related: https://homosaurus.org/v3/homoit0000902
related: https://homosaurus.org/v3/homoit0001108
related: https://homosaurus.org/v3/homoit0001482
related: https://homosaurus.org/v3/homoit0001815
related: https://homosaurus.org/v3/homoit0001853

LGBTQ+ resorts
type: Concept
issued: 2019-05-14
modified: 2025-02-23
replaces: LGBTQResorts
comment: Commercial establishments providing lodging, entertainment, food, drinks, sporting, and shopping; use in reference to resorts that cater primarily to LGBTQ+ people or are known to be frequented by LGBTQ+ people.
alternative label: LGBTQ resorts
broader: https://homosaurus.org/v3/homoit0000881
change note: Version 3.7.0
has top concept: LGBTQ+ hotels
in scheme: v3

LGBTQ+ science fiction
type: Concept
issued: 2019-05-14
modified: 2025-02-23
replaces: scienceFictionLGBTQ
comment: Written literary work about imaginative or futuristic concepts incorporating science, technology, space, time travel, and other speculative elements; use in reference to science fiction focusing on LGBTQ+ characters or themes.
alternative label: Science fiction (LGBTQ)
broader: https://homosaurus.org/v3/homoit0000443
change note: Version 3.7.0
has top concept: Subcultures
in scheme: v3
narrower: https://homosaurus.org/v3/homoit0001570
narrower: https://homosaurus.org/v3/homoit0001571
narrower: https://homosaurus.org/v3/homoit0001572
narrower: https://homosaurus.org/v3/homoit0001573
narrower: https://homosaurus.org/v3/homoit0001574
narrower: https://homosaurus.org/v3/homoit0002437
narrower: https://homosaurus.org/v3/homoit0002438
narrower: https://homosaurus.org/v3/homoit0002439
narrower: https://homosaurus.org/v3/homoit0002440
narrower: https://homosaurus.org/v3/homoit0002499
narrower: https://homosaurus.org/v3/homoit0002520
narrower: https://homosaurus.org/v3/homoit0002570
related: https://homosaurus.org/v3/homoit0000865
related: https://homosaurus.org/v3/homoit0002177
related: https://homosaurus.org/v3/homoit0002637
related: https://homosaurus.org/v3/homoit0002647

LGBTQ+ self-defense
type: Concept
issued: 2019-05-14
modified: 2025-02-23
replaces: LGBTQSelfDefence
comment: Countermeasures taken by an LGBTQ+ person to protect their own health or well being from harm.
broader: https://homosaurus.org/v3/homoit0000853
change note: Version 3.7.0
has top concept: LGBTQ+ activism
in scheme: v3
preferred label: LGBTQ+ self-defence

LGBTQ+ separation
type: Concept
issued: 2019-05-14
modified: 2025-02-23
replaces: LGBTQSeparation
comment: Arrangement mutually agreed upon or ordered by a judge for married LGBTQ+ people to live apart while remaining legally married.
alternative label: Marital separation (LGBTQ)
alternative label: LGBTQ separation
broader: https://homosaurus.org/v3/homoit0000990
change note: Version 3.7.0
has top concept: Living arrangements
in scheme: v3
narrower: https://homosaurus.org/v3/homoit0000854
related: https://homosaurus.org/v3/homoit0000254
related: https://homosaurus.org/v3/homoit0000989
related: https://homosaurus.org/v3/homoit0001237

LGBTQ+ sexual abuse
type: Concept
issued: 2019-05-14
modified: 2025-02-23
replaces: LGBTQSexualAbuse
comment: Acts of sexual abuse and violence directed towards LGBTQ+ people.
alternative label: LGBTQ sexual abuse
broader: https://homosaurus.org/v3/homoit0001305
change note: Version 3.7.0
has top concept: Sexual violence
in scheme: v3
related: https://homosaurus.org/v3/homoit0000302
related: https://homosaurus.org/v3/homoit0000855
related: https://homosaurus.org/v3/homoit0000959
related: https://homosaurus.org/v3/homoit0001351

LGBTQ+ shamans
type: Concept
issued: 2019-05-14
modified: 2025-02-23
replaces: LGBTQShamans
comment: LGBTQ+ people who are shamans either through traditional community practices or self-designation.
alternative label: Shamans (LGBTQ)
alternative label: LGBTQ shamans
broader: https://homosaurus.org/v3/homoit0000928
change note: Version 3.7.0
has top concept: LGBTQ+ religious people
in scheme: v3

LGBTQ+ Shintoists
type: Concept
issued: 2019-05-14
modified: 2025-02-23
replaces: LGBTQShintoists
comment: LGBTQ+ people who are Shintoists.
alternative label: LGBTQ Shinto
alternative label: Shintoists (LGBTQ)
alternative label: LGBTQ Shintoists
broader: https://homosaurus.org/v3/homoit0000928
change note: Version 3.7.0
has top concept: LGBTQ+ religious people
in scheme: v3

LGBTQ+ single fathers
type: Concept
issued: 2019-05-14
modified: 2025-02-23
replaces: LGBTQSingleFathers
comment: LGBTQ+ people who are fathers but are not married or part of a long-term partnership.
alternative label: LGBTQ single fathers
broader: https://homosaurus.org/v3/homoit0000944
change note: Version 3.7.0
has top concept: LGBTQ+ families
in scheme: v3

LGBTQ+ single mothers
type: Concept
issued: 2019-05-14
modified: 2025-02-23
replaces: LGBTQSingleMothers
comment: LGBTQ+ people who are mothers but are not married or part of a long-term partnership.
alternative label: LGBTQ single mothers
broader: https://homosaurus.org/v3/homoit0000944
broader: https://homosaurus.org/v3/homoit0001021
change note: Version 3.7.0
has top concept: LGBTQ+ families
in scheme: v3

LGBTQ+ single parent families
type: Concept
issued: 2019-05-14
modified: 2025-02-23
replaces: LGBTQSingleParentFamilies
comment: Families headed by a single parent; use in reference to single parent families headed by or including LGBTQ+ people.
alternative label: LGBTQ single parent families
broader: https://homosaurus.org/v3/homoit0000420
change note: Version 3.7.0
has top concept: LGBTQ+ families
in scheme: v3
related: https://homosaurus.org/v3/homoit0000944
related: https://homosaurus.org/v3/homoit0001059

LGBTQ+ single parents
type: Concept
issued: 2019-05-14
modified: 2025-02-23
replaces: LGBTQSingleParents
comment: LGBTQ+ people who are parents but are not married or part of a long-term partnership.
alternative label: LGBTQ single parents
broader: https://homosaurus.org/v3/homoit0001075
broader: https://homosaurus.org/v3/homoit0001312
change note: Version 3.7.0
has top concept: LGBTQ+ families
in scheme: v3
narrower: https://homosaurus.org/v3/homoit0000941
narrower: https://homosaurus.org/v3/homoit0000942
related: https://homosaurus.org/v3/homoit0000943

LGBTQ+ social parenthood
type: Concept
issued: 2019-05-14
modified: 2025-02-23
replaces: LGBTQSocialParenthood
comment: The experiences involved in social parenting, as experienced by LGBTQ+ people.
alternative label: Social parenthood (LGBTQ)
broader: https://homosaurus.org/v3/homoit0000914
change note: Version 3.7.0
has top concept: LGBTQ+ parenthood
in scheme: v3
related: https://homosaurus.org/v3/homoit0000420
related: https://homosaurus.org/v3/homoit0000811
related: https://homosaurus.org/v3/homoit0000864
related: https://homosaurus.org/v3/homoit0000871

LGBTQ+ sporting events
type: Concept
issued: 2019-05-14
modified: 2025-02-23
replaces: LGBTQSportingEvents
comment: Organized games or sports activities for LGBTQ+ people or communities; includes both competitive and recreational events.
alternative label: LGBTQ sporting events
broader: https://homosaurus.org/v3/homoit0000861
change note: Version 3.7.0
has top concept: LGBTQ+ events
in scheme: v3
related: https://homosaurus.org/v3/homoit0001929

LGBTQ+ sports clubs
type: Concept
issued: 2019-05-14
modified: 2025-02-23
replaces: LGBTQSportsClubs
comment: Organized groups of LGBTQ+ people formed for the purpose of playing sports; includes professional and amateur sports clubs.
alternative label: LGBTQ sports clubs
broader: https://homosaurus.org/v3/homoit0000836
change note: Version 3.7.0
has top concept: LGBTQ+ clubs and organizations
in scheme: v3
narrower: https://homosaurus.org/v3/homoit0000537
narrower: https://homosaurus.org/v3/homoit0000780
related: https://homosaurus.org/v3/homoit0001929

LGBTQ+ student organizations
type: Concept
issued: 2019-05-14
modified: 2025-02-23
replaces: LGBTQStudentsClubs
comment: Organized clubs and groups composed primarily of LGBTQ+ students.
alternative label: Students organizations (LGBTQ)
alternative label: LGBTQ+ student clubs
alternative label: Student clubs (LGBTQ)
alternative label: LGBTQ+ students' clubs
alternative label: LGBTQ+ students' organizations
alternative label: Students' clubs (LGBTQ)
alternative label: Students' organizations (LGBTQ)
broader: https://homosaurus.org/v3/homoit0000836
change note: Version 3.7.0
has top concept: LGBTQ+ clubs and organizations
in scheme: v3
related: https://homosaurus.org/v3/homoit0003533

LGBTQ+ suicide
type: Concept
issued: 2019-05-14
modified: 2025-02-23
replaces: LGBTQSuicide
comment: Deaths of LGBTQ+ people as a result of intentional, self-inflicted harm or injury.
alternative label: LGBTQ suicide
broader: https://homosaurus.org/v3/homoit0000848
change note: Version 3.7.0
has top concept: LGBTQ+ death and dying
in scheme: v3
related: https://homosaurus.org/v3/homoit0001012

LGBTQ+ support groups
type: Concept
issued: 2019-05-14
modified: 2025-02-23
replaces: LGBTQSupportGroups
comment: Groups of LGBTQ+ people meeting to offer encouragement, comfort, and advice to one another, typically relating to common experiences and issues related to being LGBTQ+.
alternative label: LGBTQ support groups
broader: https://homosaurus.org/v3/homoit0001012
change note: Version 3.7.0
has top concept: Health care for LGBTQ+ people
in scheme: v3
related: https://homosaurus.org/v3/homoit0001551

LGBTQ+ Taoists
type: Concept
issued: 2019-05-14
modified: 2025-02-23
replaces: LGBTQTaoists
comment: LGBTQ+ people who are Taoists.
alternative label: Taoists (LGBTQ)
alternative label: LGBTQ Taoists
broader: https://homosaurus.org/v3/homoit0000928
change note: Version 3.7.0
has top concept: LGBTQ+ religious people
in scheme: v3

LGBTQ+ unrequited love
type: Concept
issued: 2019-05-14
modified: 2025-02-23
replaces: LGBTQUnrequitedLove
comment: Attraction to another person that is not reciprocated, by LGBTQ+ people
alternative label: LGBTQ unrequited love
broader: https://homosaurus.org/v3/homoit0000894
change note: Version 3.7.0
has top concept: Theories
in scheme: v3

LGBTQ+ victims of rape
type: Concept
issued: 2019-05-14
modified: 2025-02-23
replaces: victimsOfRapeLGBTQ
comment: LGBTQ+ people who have experienced rape and may or may not have survived; follow the individual's preference for "victims" or "survivors" whenever possible.
alternative label: LGBTQ victims of rape
alternative label: Rape victims (LGBTQ)
alternative label: Victims of rape (LGBTQ)
broader: https://homosaurus.org/v3/homoit0000312
broader: https://homosaurus.org/v3/homoit0000959
broader: https://homosaurus.org/v3/homoit0001305
change note: Version 3.7.0
has top concept: LGBTQ+ people
in scheme: v3
narrower: https://homosaurus.org/v3/homoit0000197
narrower: https://homosaurus.org/v3/homoit0000552
narrower: https://homosaurus.org/v3/homoit0000793
narrower: https://homosaurus.org/v3/homoit0001222
narrower: https://homosaurus.org/v3/homoit0001350
narrower: https://homosaurus.org/v3/homoit0001457
narrower: https://homosaurus.org/v3/homoit0002855
related: https://homosaurus.org/v3/homoit0000059
related: https://homosaurus.org/v3/homoit0000302
related: https://homosaurus.org/v3/homoit0001307
related: https://homosaurus.org/v3/homoit0002195
related: https://homosaurus.org/v3/homoit0002733

LGBTQ+ victims of sexual abuse
type: Concept
issued: 2019-05-14
modified: 2025-02-23
replaces: victimsOfSexualAbuseLGBTQ
comment: LGBTQ+ people who have experienced sexual abuse and may or may not have survived; follow the individual's preference for "victims" or "survivors" whenever possible.
alternative label: Sexual abuse victims (LGBTQ)
alternative label: Sexual violence victims (LGBTQ)
alternative label: Victims of sex crimes (LGBTQ)
alternative label: Victims of sexual abuse (LGBTQ)
broader: https://homosaurus.org/v3/homoit0000312
change note: Version 3.7.0
has top concept: LGBTQ+ people
in scheme: v3
narrower: https://homosaurus.org/v3/homoit0000198
narrower: https://homosaurus.org/v3/homoit0000550
narrower: https://homosaurus.org/v3/homoit0000794
narrower: https://homosaurus.org/v3/homoit0000885
narrower: https://homosaurus.org/v3/homoit0000958
narrower: https://homosaurus.org/v3/homoit0001223
narrower: https://homosaurus.org/v3/homoit0001307
narrower: https://homosaurus.org/v3/homoit0001351
narrower: https://homosaurus.org/v3/homoit0001458
narrower: https://homosaurus.org/v3/homoit0002856
narrower: https://homosaurus.org/v3/homoit0002949
related: https://homosaurus.org/v3/homoit0000059
related: https://homosaurus.org/v3/homoit0000302
related: https://homosaurus.org/v3/homoit0000855
related: https://homosaurus.org/v3/homoit0000938
related: https://homosaurus.org/v3/homoit0002195
related: https://homosaurus.org/v3/homoit0002734

LGBTQ+ visibility
type: Concept
issued: 2019-05-14
modified: 2025-02-23
replaces: LGBTQVisibility
comment: Visibility of LGBTQ+ people in society, meaning the extent to which LGBTQ+ people and identities are recognized by the general public.
alternative label: Visibility of LGBTQ people
alternative label: LGBTQ visibility
broader: https://homosaurus.org/v3/homoit0000947
change note: Version 3.7.0
has top concept: LGBTQ+ social processes
in scheme: v3

LGBTQ+ victims of war
type: Concept
issued: 2019-05-14
modified: 2025-02-23
replaces: victimsOfWarLGBTQ
comment: LGBTQ+ people who have experienced war and may or may not have survived; follow the individual's preference for "victims" or "survivors" whenever possible.
alternative label: LGBTQ war victims
alternative label: Victims of war (LGBTQ)
broader: https://homosaurus.org/v3/homoit0000915
change note: Version 3.7.0
has top concept: LGBTQ+ people
in scheme: v3
narrower: https://homosaurus.org/v3/homoit0000199
narrower: https://homosaurus.org/v3/homoit0000553
narrower: https://homosaurus.org/v3/homoit0000795
narrower: https://homosaurus.org/v3/homoit0001224
narrower: https://homosaurus.org/v3/homoit0001459
narrower: https://homosaurus.org/v3/homoit0002857
narrower: https://homosaurus.org/v3/homoit0002950
related: https://homosaurus.org/v3/homoit0001352
related: https://homosaurus.org/v3/homoit0002735

LGBTQ+ youth centers
type: Concept
issued: 2019-05-14
modified: 2025-02-23
replaces: LGBTQYouthCentres
comment: Spaces in which LGBTQ+ young people meet for social, education, recreational, or organizing activities.
broader: https://homosaurus.org/v3/homoit0000830
change note: Version 3.7.0
has top concept: LGBTQ+ centers
in scheme: v3
preferred label: LGBTQ+ youth centres
related: https://homosaurus.org/v3/homoit0001521

LGBTQ+ zines
type: Concept
issued: 2019-05-14
modified: 2025-02-23
replaces: LGBTQZines
comment: Independent, small-circulation publications usually reproduced via photocopier; use for zines created by LGBTQ+ people and/or focusing on LGBTQ+ identities, issues, or cultures.
alternative label: LGBTQ zines
broader: https://homosaurus.org/v3/homoit0001132
change note: Version 3.7.0
has top concept: LGBTQ+ press
in scheme: v3
narrower: https://homosaurus.org/v3/homoit0003148
narrower: https://homosaurus.org/v3/homoit0003149
narrower: https://homosaurus.org/v3/homoit0003150
narrower: https://homosaurus.org/v3/homoit0003151
narrower: https://homosaurus.org/v3/homoit0003152
narrower: https://homosaurus.org/v3/homoit0003154
narrower: https://homosaurus.org/v3/homoit0003155
narrower: https://homosaurus.org/v3/homoit0003156
related: https://homosaurus.org/v3/homoit0000896
related: https://homosaurus.org/v3/homoit0001830
related: https://homosaurus.org/v3/homoit0003153

Lhamana
type: Concept
issued: 2019-05-14
modified: 2025-02-23
replaces: lhamana
comment: Native American Zuni people assigned male at birth who exhibit mixed gender traits.
broader: https://homosaurus.org/v3/homoit0000322
change note: Version 3.7.0
has top concept: Gender
in scheme: v3
related: https://homosaurus.org/v3/homoit0001480

LGBTQ+ libraries
type: Concept
issued: 2019-05-14
modified: 2025-02-23
replaces: librariesLGBTQ
comment: Libraries that hold materials primarily pertaining to LGBTQ+ people or intended for use by LGBTQ+ people.
alternative label: Libraries (LGBTQ)
broader: https://homosaurus.org/v3/homoit0001755
change note: Version 3.7.0
has top concept: LGBTQ+ cultural heritage institutions
in scheme: v3
narrower: https://homosaurus.org/v3/homoit0000156
narrower: https://homosaurus.org/v3/homoit0000501
narrower: https://homosaurus.org/v3/homoit0000749
narrower: https://homosaurus.org/v3/homoit0001182
narrower: https://homosaurus.org/v3/homoit0001418
narrower: https://homosaurus.org/v3/homoit0001513
narrower: https://homosaurus.org/v3/homoit0002748
narrower: https://homosaurus.org/v3/homoit0002794
related: https://homosaurus.org/v3/homoit0000066
related: https://homosaurus.org/v3/homoit0000827
related: https://homosaurus.org/v3/homoit0001813
related: https://homosaurus.org/v3/homoit0002697
related: https://homosaurus.org/v3/homoit0003547
related: https://homosaurus.org/v3/homoit0003618

Licking
type: Concept
issued: 2019-05-14
modified: 2025-02-23
replaces: licking
comment: To touch or pass over with the tongue to moisten or taste; use to describe licking associated in the context of sexual practices or sexual arousal.
broader: https://homosaurus.org/v3/homoit0000593
change note: Version 3.7.0
has top concept: Sex (Act)
in scheme: v3
narrower: https://homosaurus.org/v3/homoit0000049
narrower: https://homosaurus.org/v3/homoit0000239

Lingerie
type: Concept
issued: 2019-05-14
modified: 2025-02-23
replaces: lingerie
comment: Category of clothing that includes bras, underwear, hosiery, and robes; typically refers to undergarments and sleepwear designed to be sexually appealing and worn in erotic contexts.
broader: https://homosaurus.org/v3/homoit0000289
broader: https://homosaurus.org/v3/homoit0000367
broader: https://homosaurus.org/v3/homoit0001266
change note: Version 3.7.0
has top concept: Gender
in scheme: v3
related: https://homosaurus.org/v3/homoit0000316
related: https://homosaurus.org/v3/homoit0000318

Lipstick lesbians
type: Concept
issued: 2019-05-14
modified: 2025-02-23
replaces: lipstickLesbians
comment: Lesbians whose appearance or mannerisms are more traditionally feminine.
broader: https://homosaurus.org/v3/homoit0000556
change note: Version 3.7.0
has top concept: LGBTQ+ people
in scheme: v3
related: https://homosaurus.org/v3/homoit0000440

LGBTQ+ literature
type: Concept
issued: 2019-05-14
modified: 2025-02-23
replaces: literatureLGBTQ
comment: Written literary works featuring LGBTQ+ characters and themes.
alternative label: Literature (LGBTQ)
broader: https://homosaurus.org/v3/homoit0001831
change note: Version 3.7.0
has top concept: Subcultures
in scheme: v3
narrower: https://homosaurus.org/v3/homoit0000157
narrower: https://homosaurus.org/v3/homoit0000376
narrower: https://homosaurus.org/v3/homoit0000443
narrower: https://homosaurus.org/v3/homoit0000502
narrower: https://homosaurus.org/v3/homoit0000750
narrower: https://homosaurus.org/v3/homoit0001118
narrower: https://homosaurus.org/v3/homoit0001183
narrower: https://homosaurus.org/v3/homoit0001419
narrower: https://homosaurus.org/v3/homoit0001522
narrower: https://homosaurus.org/v3/homoit0002449
narrower: https://homosaurus.org/v3/homoit0002467
narrower: https://homosaurus.org/v3/homoit0002484
narrower: https://homosaurus.org/v3/homoit0002507
narrower: https://homosaurus.org/v3/homoit0002537
narrower: https://homosaurus.org/v3/homoit0002750
narrower: https://homosaurus.org/v3/homoit0003488
narrower: https://homosaurus.org/v3/homoit0003822
related: https://homosaurus.org/v3/homoit0000816
related: https://homosaurus.org/v3/homoit0000827
related: https://homosaurus.org/v3/homoit0000891
related: https://homosaurus.org/v3/homoit0000892
related: https://homosaurus.org/v3/homoit0001132
related: https://homosaurus.org/v3/homoit0001149
related: https://homosaurus.org/v3/homoit0001602
related: https://homosaurus.org/v3/homoit0001723
related: https://homosaurus.org/v3/homoit0001755
related: https://homosaurus.org/v3/homoit0002192
related: https://homosaurus.org/v3/homoit0002710
related: https://homosaurus.org/v3/homoit0003618

Locker rooms
type: Concept
issued: 2019-05-14
modified: 2025-02-23
replaces: lockerRooms
comment: Rooms or areas in public or commercial spaces where people change clothes, bathe, and store items or personal belongings. LGBTQ+ people, particularly trans people, are often restricted from using locker rooms under the pretense of public safety.
broader: https://homosaurus.org/v3/homoit0001141
change note: Version 3.7.0
has top concept: Public facilities
in scheme: v3
related: https://homosaurus.org/v3/homoit0001139

Love triangles
type: Concept
issued: 2019-05-14
modified: 2025-02-23
replaces: loveTriangles
comment: Polyamorous relationships that involve three people in various arrangements.
broader: https://homosaurus.org/v3/homoit0001302
change note: Version 3.7.0
has top concept: LGBTQ+ relationships
in scheme: v3
related: https://homosaurus.org/v3/homoit0000894

Lubricants
type: Concept
issued: 2019-05-14
modified: 2025-02-23
replaces: lubricants
comment: Liquids or gels used during sexual activity, typically to ease the act of penetration by a penis or a sex toy.
broader: https://homosaurus.org/v3/homoit0001266
change note: Version 3.7.0
has top concept: Sex accessories
in scheme: v3

Macho men
type: Concept
issued: 2019-05-14
modified: 2025-02-23
replaces: machoMen
comment: Subculture of gay men who display characteristics associated with machismo (e.g., masculine pride, self-reliance, physical strength). Though "macho men" can be used more broadly, this term refers to gay men who embrace machismo and traditional masculinity through their dress and behavior.
alternative label: Machos
broader: https://homosaurus.org/v3/homoit0000506
change note: Version 3.7.0
has top concept: LGBTQ+ people
in scheme: v3
related: https://homosaurus.org/v3/homoit0000095
related: https://homosaurus.org/v3/homoit0000655
related: https://homosaurus.org/v3/homoit0000995
related: https://homosaurus.org/v3/homoit0002148
related: https://homosaurus.org/v3/homoit0002149

Māhū
type: Concept
issued: 2019-05-14
modified: 2025-02-23
replaces: mahu
comment: Term used in Hawaiian and Tahitian cultures for third gender people who blend genders and often hold spiritual roles.
alternative label: Mahu
broader: https://homosaurus.org/v3/homoit0000322
broader: https://homosaurus.org/v3/homoit0002653
change note: Version 3.7.0
has top concept: Gender
in scheme: v3
narrower: https://homosaurus.org/v3/homoit0002654
narrower: https://homosaurus.org/v3/homoit0002655
narrower: https://homosaurus.org/v3/homoit0003231
narrower: https://homosaurus.org/v3/homoit0003256
narrower: https://homosaurus.org/v3/homoit0003762
related: https://homosaurus.org/v3/homoit0001955
related: https://homosaurus.org/v3/homoit0001959

Mak nyahs
type: Concept
issued: 2019-05-14
modified: 2025-02-23
replaces: makNyah
comment: Term used in Malaysia for transgender women.
broader: https://homosaurus.org/v3/homoit0000322
change note: Version 3.7.0
has top concept: Gender
in scheme: v3

Men's friendships
type: Concept
issued: 2019-05-14
modified: 2025-02-23
replaces: mensFriendships
comment: Connections based on affection and trust between two or more men.
alternative label: Male friendships
broader: https://homosaurus.org/v3/homoit0000455
broader: https://homosaurus.org/v3/homoit0000649
change note: Version 3.7.0
has top concept: LGBTQ+ relationships
in scheme: v3
related: https://homosaurus.org/v3/homoit0000981

Male impersonators
type: Concept
issued: 2019-05-14
modified: 2025-02-23
replaces: maleImpersonators
comment: Historical term used to describe performers, often female-identified people, who enact male personas for the purpose of entertainment, typically for straight audiences. Only use in historical contexts.
broader: https://homosaurus.org/v3/homoit0001363
change note: Version 3.7.0
has top concept: LGBTQ+ theater
in scheme: v3
related: https://homosaurus.org/v3/homoit0000373
related: https://homosaurus.org/v3/homoit0003817

MtFs
type: Concept
issued: 2019-05-14
modified: 2025-02-23
replaces: MtFs
comment: MtF (male-to-female) is a mostly historical term that has been largely replaced by "trans women." This is due in part to the term’s connection to the medicalisation of transgender people and its assumption that trans women are "born" male and become female (typically through hormones and/or surgery).
alternative label: Males transitioning to females
alternative label: MtF transsexuals
alternative label: Male-to-female
alternative label: M2Fs
alternative label: Transsexual women
broader: https://homosaurus.org/v3/homoit0000878
broader: https://homosaurus.org/v3/homoit0001381
broader: https://homosaurus.org/v3/homoit0001642
change note: Version 3.7.0
has top concept: LGBTQ+ historical terms
in scheme: v3
related: https://homosaurus.org/v3/homoit0000407
related: https://homosaurus.org/v3/homoit0000436
related: https://homosaurus.org/v3/homoit0000457
related: https://homosaurus.org/v3/homoit0001027

Mangaiko
type: Concept
issued: 2019-05-14
modified: 2025-02-23
replaces: mangaiko
comment: Mbo term for third gender people.
broader: https://homosaurus.org/v3/homoit0000322
change note: Version 3.7.0
has top concept: Gender
in scheme: v3

Manual sex
type: Concept
issued: 2019-05-14
modified: 2025-02-23
replaces: manualSex
comment: Sexual activity involving manual stimulation of erogenous zones using the hands.
broader: https://homosaurus.org/v3/homoit0001267
broader: https://homosaurus.org/v3/homoit0001299
change note: Version 3.7.0
has top concept: Sex (Act)
in scheme: v3
narrower: https://homosaurus.org/v3/homoit0000446
narrower: https://homosaurus.org/v3/homoit0001115
narrower: https://homosaurus.org/v3/homoit0001498
narrower: https://homosaurus.org/v3/homoit0001500
related: https://homosaurus.org/v3/homoit0000402
related: https://homosaurus.org/v3/homoit0001000

Marital status
type: Concept
issued: 2019-05-14
modified: 2025-02-23
replaces: maritalStatus
comment: A person's state of being single, married, separated, divorced, or widowed, as defined by a government or legal authority.
broader: https://homosaurus.org/v3/homoit0000990
change note: Version 3.7.0
has top concept: Living arrangements
in scheme: v3
narrower: https://homosaurus.org/v3/homoit0000359
narrower: https://homosaurus.org/v3/homoit0000994
narrower: https://homosaurus.org/v3/homoit0001312
narrower: https://homosaurus.org/v3/homoit0001483
narrower: https://homosaurus.org/v3/homoit0001504
related: https://homosaurus.org/v3/homoit0000712
related: https://homosaurus.org/v3/homoit0000937
related: https://homosaurus.org/v3/homoit0000992

Marriage
type: Concept
issued: 2019-05-14
modified: 2025-02-23
replaces: marriage
comment: Legal union between two or more people in a personal relationship that may or may not grant certain economic, legal, and social rights.
broader: https://homosaurus.org/v3/homoit0000973
change note: Version 3.7.0
has top concept: Living arrangements
in scheme: v3
narrower: https://homosaurus.org/v3/homoit0000158
narrower: https://homosaurus.org/v3/homoit0000296
narrower: https://homosaurus.org/v3/homoit0000504
narrower: https://homosaurus.org/v3/homoit0000625
narrower: https://homosaurus.org/v3/homoit0000854
narrower: https://homosaurus.org/v3/homoit0000937
narrower: https://homosaurus.org/v3/homoit0000989
narrower: https://homosaurus.org/v3/homoit0000991
narrower: https://homosaurus.org/v3/homoit0000993
narrower: https://homosaurus.org/v3/homoit0001514
related: https://homosaurus.org/v3/homoit0000247
related: https://homosaurus.org/v3/homoit0000274
related: https://homosaurus.org/v3/homoit0000360
related: https://homosaurus.org/v3/homoit0000362
related: https://homosaurus.org/v3/homoit0000963
related: https://homosaurus.org/v3/homoit0000992
related: https://homosaurus.org/v3/homoit0001053

Marriage certificates
type: Concept
issued: 2019-05-14
modified: 2025-02-23
replaces: marriageCertificates
comment: Government-issued documents that serve as official records of marriages; can be used in reference to LGBTQ+ people's marriage certificates or their efforts to acquire marriage certificates.
broader: https://homosaurus.org/v3/homoit0000990
broader: https://homosaurus.org/v3/homoit0001053
change note: Version 3.7.0
has top concept: Living arrangements
in scheme: v3
related: https://homosaurus.org/v3/homoit0000992

Marriage law
type: Concept
issued: 2019-05-14
modified: 2025-02-23
replaces: marriageLaw
comment: Legal regulations and laws dictating where, when, under what conditions, and who can be legally married in a certain jurisdiction.
alternative label: Matrimonial law
broader: https://homosaurus.org/v3/homoit0000918
change note: Version 3.7.0
has top concept: Law
in scheme: v3
narrower: https://homosaurus.org/v3/homoit0000296
related: https://homosaurus.org/v3/homoit0000274
related: https://homosaurus.org/v3/homoit0000989
related: https://homosaurus.org/v3/homoit0000990
related: https://homosaurus.org/v3/homoit0000991
related: https://homosaurus.org/v3/homoit0000993

Marriage licenses
type: Concept
issued: 2019-05-14
modified: 2025-02-23
replaces: marriageLicenses
comment: Legal documents issued by a religious organization or local authority that authorizes marriage. In some jurisdictions a license is necessary to legalize a union, but this varies by locale.
broader: https://homosaurus.org/v3/homoit0000990
broader: https://homosaurus.org/v3/homoit0001053
change note: Version 3.7.0
has top concept: Living arrangements
in scheme: v3
related: https://homosaurus.org/v3/homoit0000992

Married people
type: Concept
issued: 2019-05-14
modified: 2025-02-23
replaces: marriedPeople
comment: Individuals who are currently married, or part of a legal union involving two or more people in a personal relationship that may or may not grant certain economic, legal, and social rights.
broader: https://homosaurus.org/v3/homoit0000989
change note: Version 3.7.0
has top concept: Living arrangements
in scheme: v3

Masculinities
type: Concept
issued: 2019-05-14
modified: 2025-02-23
replaces: masculinity
comment: Culture-specific sets of attributes, behaviors, and roles generally associated with men or boys.
alternative label: Masculinity
broader: https://homosaurus.org/v3/homoit0000568
change note: Version 3.7.0
has top concept: Gender
in scheme: v3
narrower: https://homosaurus.org/v3/homoit0000432
narrower: https://homosaurus.org/v3/homoit0001377
narrower: https://homosaurus.org/v3/homoit0001820
narrower: https://homosaurus.org/v3/homoit0002061
related: https://homosaurus.org/v3/homoit0000047
related: https://homosaurus.org/v3/homoit0000231
related: https://homosaurus.org/v3/homoit0000389
related: https://homosaurus.org/v3/homoit0000577
related: https://homosaurus.org/v3/homoit0000655
related: https://homosaurus.org/v3/homoit0000978
related: https://homosaurus.org/v3/homoit0001466
related: https://homosaurus.org/v3/homoit0001508
related: https://homosaurus.org/v3/homoit0001898

Mashoga
type: Concept
issued: 2019-05-14
modified: 2025-02-23
replaces: mashoga
comment: Swahili term for people assigned male at birth who engage in sex with men and who may dress as women.
broader: https://homosaurus.org/v3/homoit0000322
change note: Version 3.7.0
has top concept: Gender
in scheme: v3

Masochism
type: Concept
issued: 2019-05-14
modified: 2025-02-23
replaces: masochism
comment: Erotic or sexual enjoyment of pain and intense sensations.
broader: https://homosaurus.org/v3/homoit0000036
broader: https://homosaurus.org/v3/homoit0001300
change note: Version 3.7.0
has top concept: Eroticism
in scheme: v3
related: https://homosaurus.org/v3/homoit0001250
related: https://homosaurus.org/v3/homoit0001295

LGBTQ+ dominants
type: Concept
issued: 2019-05-14
modified: 2025-02-23
replaces: mastersLGBTQ
comment: The person who takes on the position of authority or power in a power exchange relationship or kink activity.
alternative label: Masters (LGBTQ)
alternative label: LGBTQ+ D-types
alternative label: LGBTQ+ Doms
alternative label: LGBTQ+ masters
broader: https://homosaurus.org/v3/homoit0001295
broader: https://homosaurus.org/v3/homoit0001304
broader: https://homosaurus.org/v3/homoit0001637
broader: https://homosaurus.org/v3/homoit0003084
change note: Version 3.7.0
has top concept: Sexual identity
in scheme: v3
narrower: https://homosaurus.org/v3/homoit0000159
narrower: https://homosaurus.org/v3/homoit0000505
narrower: https://homosaurus.org/v3/homoit0001184
narrower: https://homosaurus.org/v3/homoit0001420
narrower: https://homosaurus.org/v3/homoit0002991
narrower: https://homosaurus.org/v3/homoit0003194
related: https://homosaurus.org/v3/homoit0000363
related: https://homosaurus.org/v3/homoit0000705
related: https://homosaurus.org/v3/homoit0001018
related: https://homosaurus.org/v3/homoit0001133
related: https://homosaurus.org/v3/homoit0001318
related: https://homosaurus.org/v3/homoit0001376
related: https://homosaurus.org/v3/homoit0003052

Masturbation
type: Concept
issued: 2019-05-14
modified: 2025-02-23
replaces: masturbation
comment: Sexual stimulation of one's own genitals for sexual pleasure.
broader: https://homosaurus.org/v3/homoit0001267
broader: https://homosaurus.org/v3/homoit0001299
change note: Version 3.7.0
has top concept: Sex (Act)
in scheme: v3
narrower: https://homosaurus.org/v3/homoit0000681
narrower: https://homosaurus.org/v3/homoit0001033
narrower: https://homosaurus.org/v3/homoit0001498
related: https://homosaurus.org/v3/homoit0000083
related: https://homosaurus.org/v3/homoit0000589
related: https://homosaurus.org/v3/homoit0000988
related: https://homosaurus.org/v3/homoit0001328

Mati
type: Concept
issued: 2019-05-14
modified: 2025-02-23
replaces: mati
comment: Surinamese-Creole women who have sexual relations with other women but also have had or do have relationships with men.
broader: https://homosaurus.org/v3/homoit0000202
broader: https://homosaurus.org/v3/homoit0001510
change note: Version 3.7.0
has top concept: LGBTQ+ people
in scheme: v3

Medical practitioners' statements
type: Concept
issued: 2019-05-14
modified: 2025-02-23
replaces: medicalPractitionersStatements
comment: Official documents from medical practitioners (e.g., doctors, nurses, therapists) diagnosing a patient's gender dysphoria and, typically, recommending gender-affirming healthcare; sometimes required for an individual's gender-affirming healthcare to be covered under insurance or for an individual to legally change their name or gender marker.
broader: https://homosaurus.org/v3/homoit0001053
change note: Version 3.7.0
has top concept: Legal status
in scheme: v3
related: https://homosaurus.org/v3/homoit0000119
related: https://homosaurus.org/v3/homoit0000377
related: https://homosaurus.org/v3/homoit0000573
related: https://homosaurus.org/v3/homoit0001004
related: https://homosaurus.org/v3/homoit0001465

Medicalization
type: Concept
issued: 2019-05-14
modified: 2025-02-23
replaces: medicalisation
comment: Process by which human conditions and experiences come to be defined and treated as medical conditions and thus become the subject of medical study, diagnosis, prevention, and/or treatment. Use in reference to non-medical problems, such as LGBTQ+ identities and practices, that have been wrongly treated as medical issues.
broader: https://homosaurus.org/v3/homoit0001004
change note: Version 3.7.0
has top concept: Medical care
in scheme: v3
narrower: https://homosaurus.org/v3/homoit0000395
narrower: https://homosaurus.org/v3/homoit0000572
narrower: https://homosaurus.org/v3/homoit0000669
narrower: https://homosaurus.org/v3/homoit0001296
narrower: https://homosaurus.org/v3/homoit0001463
narrower: https://homosaurus.org/v3/homoit0001468
narrower: https://homosaurus.org/v3/homoit0001469
preferred label: Medicalisation
related: https://homosaurus.org/v3/homoit0000062
related: https://homosaurus.org/v3/homoit0000357
related: https://homosaurus.org/v3/homoit0000567
related: https://homosaurus.org/v3/homoit0001268
related: https://homosaurus.org/v3/homoit0001320
related: https://homosaurus.org/v3/homoit0002835
related: https://homosaurus.org/v3/homoit0002841

Medication
type: Concept
issued: 2019-05-14
modified: 2025-02-23
replaces: medication
comment: Non-recreational drugs as used by members of the LGBTQ+ community.
alternative label: Pharmaceuticals
broader: https://homosaurus.org/v3/homoit0001366
change note: Version 3.7.0
has top concept: Medical care
in scheme: v3
narrower: https://homosaurus.org/v3/homoit0000399
narrower: https://homosaurus.org/v3/homoit0000650
narrower: https://homosaurus.org/v3/homoit0001091
narrower: https://homosaurus.org/v3/homoit0001130
narrower: https://homosaurus.org/v3/homoit0001138
narrower: https://homosaurus.org/v3/homoit0001981
related: https://homosaurus.org/v3/homoit0000317
related: https://homosaurus.org/v3/homoit0000380

Men
type: Concept
issued: 2019-05-14
modified: 2025-02-23
replaces: men
comment: Adults who self-identify as men and understand their gender in terms of Western conceptions of manliness, maleness, and/or masculinity. The term has typically been defined as adult male humans, though not all men identify with the term "male" depending on the context in which it is used.
broader: https://homosaurus.org/v3/homoit0000571
change note: Version 3.7.0
has top concept: Gender
in scheme: v3
narrower: https://homosaurus.org/v3/homoit0000160
narrower: https://homosaurus.org/v3/homoit0000270
narrower: https://homosaurus.org/v3/homoit0000506
narrower: https://homosaurus.org/v3/homoit0000626
narrower: https://homosaurus.org/v3/homoit0001009
narrower: https://homosaurus.org/v3/homoit0001643
narrower: https://homosaurus.org/v3/homoit0002278
narrower: https://homosaurus.org/v3/homoit0003223
related: https://homosaurus.org/v3/homoit0000271
related: https://homosaurus.org/v3/homoit0000322
related: https://homosaurus.org/v3/homoit0000563
related: https://homosaurus.org/v3/homoit0001378
related: https://homosaurus.org/v3/homoit0001509
related: https://homosaurus.org/v3/homoit0002182

Men who have sex with men
type: Concept
issued: 2019-05-14
modified: 2025-02-23
replaces: menWhoHaveSexWithMen
comment: Men who engage in sexual activity with other men, whether or not they identify as gay or bisexual.
alternative label: MSM
broader: https://homosaurus.org/v3/homoit0000915
broader: https://homosaurus.org/v3/homoit0001008
change note: Version 3.7.0
has top concept: LGBTQ+ people
in scheme: v3
related: https://homosaurus.org/v3/homoit0000095
related: https://homosaurus.org/v3/homoit0000160
related: https://homosaurus.org/v3/homoit0000365
related: https://homosaurus.org/v3/homoit0000506
related: https://homosaurus.org/v3/homoit0001254
related: https://homosaurus.org/v3/homoit0001297

Men's movement
type: Concept
issued: 2019-05-14
modified: 2025-02-23
replaces: mensMovement
comment: Movement that began in the 1960s and 1970s (primarily in the United States, United Kingdom, and Australia) in response to the women's movement. Consists of groups and organizations of men and their allies working to address gender issues and their impact on men. Different men's movement groups vary significantly in how they frame their relationship to the women's movement and society at large. Not to be confused with the men's or father's rights movement, which focuses on perceived inequalities faced by men and seeks to maintain patriarchal values.
broader: https://homosaurus.org/v3/homoit0001322
change note: Version 3.7.0
has top concept: Social movements
in scheme: v3

Mental health care for LGBTQ+ people
type: Concept
issued: 2019-05-14
modified: 2025-02-23
replaces: mentalHealthCareForLGBTQPeople
comment: Organized measures taken for the diagnosis, maintenance, treatment, or improvement of mental health or psychological well being; use in reference to mental health care addressing the particular needs of LGBTQ+ individuals or communities.
alternative label: Mental health care for LGBTQ people
broader: https://homosaurus.org/v3/homoit0000614
change note: Version 3.7.0
has top concept: Health care for LGBTQ+ people
in scheme: v3
narrower: https://homosaurus.org/v3/homoit0000953
narrower: https://homosaurus.org/v3/homoit0001551
related: https://homosaurus.org/v3/homoit0000349
related: https://homosaurus.org/v3/homoit0000351
related: https://homosaurus.org/v3/homoit0000952
related: https://homosaurus.org/v3/homoit0001366

Metis
type: Concept
issued: 2019-05-14
modified: 2025-02-23
replaces: metis
comment: Officially recognized third gender in Nepal; predominantly used to refer to transgender women.
broader: https://homosaurus.org/v3/homoit0000322
change note: Version 3.7.0
has top concept: Gender
in scheme: v3

Micropenis
type: Concept
issued: 2019-05-14
modified: 2025-02-23
replaces: micropenis
comment: A person born with a micropenis has a penis that is smaller than the typical size range for an infant. People may also develop a micropenis as a result of several different intersex variations. The size of a person’s penis does not generally affect its functionality.
alternative label: Microphallus
broader: https://homosaurus.org/v3/homoit0000669
change note: Version 3.7.0
has top concept: Sex (Body)
in scheme: v3

LGBTQ+ mistresses (BDSM culture)
type: Concept
issued: 2019-05-14
modified: 2025-02-23
replaces: mistressesLGBTQ
comment: LGBTQ+ women who are part of the BDSM scene and assume the mistress role in sexual relationships with a mistress/submissive dynamic.
alternative label: Mistresses (LGBTQ)
alternative label: LGBTQ+ mistresses
broader: https://homosaurus.org/v3/homoit0001295
broader: https://homosaurus.org/v3/homoit0001304
broader: https://homosaurus.org/v3/homoit0001376
change note: Version 3.7.0
has top concept: Sexual identity
in scheme: v3
narrower: https://homosaurus.org/v3/homoit0000161
narrower: https://homosaurus.org/v3/homoit0000751
narrower: https://homosaurus.org/v3/homoit0001186
narrower: https://homosaurus.org/v3/homoit0001421
narrower: https://homosaurus.org/v3/homoit0002992
related: https://homosaurus.org/v3/homoit0000363
related: https://homosaurus.org/v3/homoit0000999
related: https://homosaurus.org/v3/homoit0001133
related: https://homosaurus.org/v3/homoit0001318

Monogamy
type: Concept
issued: 2019-05-14
modified: 2025-02-23
replaces: monogamy
comment: Relationship orientation in which individuals are exclusively committed to one partner at a time.
broader: https://homosaurus.org/v3/homoit0001081
broader: https://homosaurus.org/v3/homoit0001302
broader: https://homosaurus.org/v3/homoit0001636
change note: Version 3.7.0
has top concept: Sexual preference
in scheme: v3
related: https://homosaurus.org/v3/homoit0001295
related: https://homosaurus.org/v3/homoit0001555
related: https://homosaurus.org/v3/homoit0001916

Mosaicism involving "sex" chromosomes
type: Concept
issued: 2019-05-14
modified: 2025-02-23
replaces: mosaicismInvolvingSexChromosomes
comment: People with mosaic chromosomes have different chromosome patterns in some cells of their body than in others. Mosaicism results from random differences in how cells divide while an embryo is growing, resulting in different numbers of chromosomes in different cells (such as 45X/46XX or 45X/46XY, which are both variants of Turner syndrome, or 46XY/47XXY or 46XX/47XXY, which are both variants of Klinefelter syndrome). If someone specifically has 46XX chromosomes in some cells and 46XY in others, their variation is probably chimerism instead of mosaicism. Having mosaic chromosomes can cause someone to develop variations in their genitals, gonads, or hormone function. For example, if they have at least one Y chromosome, they may have both ovarian and testicular tissue, or genital differences like hypospadias, or they may develop some secondary sex characteristics at puberty that are not expected for the sex they were assigned. People who have mosaicism without a Y chromosome (e.g., 45X/46XX, or 46XX/47XXX) may have streak gonads or ovaries that stop functioning at an earlier age than typical, which can affect development during puberty and fertility. Other people may not have any noticeable signs of their mosaicism at all.
broader: https://homosaurus.org/v3/homoit0000669
change note: Version 3.7.0
has top concept: Sex (Body)
in scheme: v3

Mothers
type: Concept
issued: 2019-05-14
modified: 2025-02-23
replaces: mothers
comment: People who are mothers.
broader: https://homosaurus.org/v3/homoit0000421
change note: Version 3.7.0
has top concept: Family members
in scheme: v3
narrower: https://homosaurus.org/v3/homoit0000838
narrower: https://homosaurus.org/v3/homoit0000942
narrower: https://homosaurus.org/v3/homoit0002343
narrower: https://homosaurus.org/v3/homoit0002348
narrower: https://homosaurus.org/v3/homoit0002795
narrower: https://homosaurus.org/v3/homoit0002916
narrower: https://homosaurus.org/v3/homoit0003243
related: https://homosaurus.org/v3/homoit0000752
related: https://homosaurus.org/v3/homoit0000905
related: https://homosaurus.org/v3/homoit0001001

Mothers of bisexual people
type: Concept
issued: 2019-05-14
modified: 2025-02-23
replaces: mothersOfBisexualPeople
comment: A person who assumes the role of mother to a bisexual person; use only for individuals who self-identify as mothers.
broader: https://homosaurus.org/v3/homoit0002348
change note: Version 3.7.0
has top concept: Family members
in scheme: v3

Mothers of gay men
type: Concept
issued: 2019-05-14
modified: 2025-02-23
replaces: mothersOfGayMen
comment: A person who assumes the role of mother to a gay man; use only for individuals who self-identify as mothers.
broader: https://homosaurus.org/v3/homoit0002348
change note: Version 3.7.0
has top concept: Family members
in scheme: v3

Mothers of lesbians
type: Concept
issued: 2019-05-14
modified: 2025-02-23
replaces: mothersOfLesbians
comment: A person who assumes the role of mother to a lesbian; use only for individuals who self-identify as mothers.
broader: https://homosaurus.org/v3/homoit0002348
change note: Version 3.7.0
has top concept: Family members
in scheme: v3

Mothers of transgender people
type: Concept
issued: 2019-05-14
modified: 2025-02-23
replaces: mothersOfTransgenderPeople
comment: A person who assumes the role of mother to a transgender person; use only for individuals who self-identify as mothers.
broader: https://homosaurus.org/v3/homoit0002348
change note: Version 3.7.0
has top concept: Family members
in scheme: v3

LGBTQ+ movement
type: Concept
issued: 2019-05-14
modified: 2025-02-23
replaces: movementLGBTQ
comment: Refers to various social and political movements aimed at securing equity and equal representation for LGBTQ+ people.
alternative label: Movement (LGBTQ)
broader: https://homosaurus.org/v3/homoit0001322
change note: Version 3.7.0
has top concept: Social movements
in scheme: v3
narrower: https://homosaurus.org/v3/homoit0000162
narrower: https://homosaurus.org/v3/homoit0000510
narrower: https://homosaurus.org/v3/homoit0000672
narrower: https://homosaurus.org/v3/homoit0000753
narrower: https://homosaurus.org/v3/homoit0001187
narrower: https://homosaurus.org/v3/homoit0001423
narrower: https://homosaurus.org/v3/homoit0002796
related: https://homosaurus.org/v3/homoit0000024
related: https://homosaurus.org/v3/homoit0000276
related: https://homosaurus.org/v3/homoit0000538
related: https://homosaurus.org/v3/homoit0001905
related: https://homosaurus.org/v3/homoit0002713
related: https://homosaurus.org/v3/homoit0003695

MtXs
type: Concept
issued: 2019-05-14
modified: 2025-02-23
replaces: mtxs
comment: People who transition from male to unknown or not male.
broader: https://homosaurus.org/v3/homoit0001378
change note: Version 3.7.0
has top concept: LGBTQ+ people
in scheme: v3
related: https://homosaurus.org/v3/homoit0000436
related: https://homosaurus.org/v3/homoit0000457
related: https://homosaurus.org/v3/homoit0000986
related: https://homosaurus.org/v3/homoit0001518

Mud sex
type: Concept
issued: 2019-05-14
modified: 2025-02-23
replaces: mudSex
comment: Sexual activities that take place outside in mud.
broader: https://homosaurus.org/v3/homoit0001267
broader: https://homosaurus.org/v3/homoit0001299
change note: Version 3.7.0
has top concept: Sex (Act)
in scheme: v3

Mukhannathun
type: Concept
issued: 2019-05-14
modified: 2025-02-23
replaces: mukhannathun
comment: A term used in classical Arabic to refer to men who are perceived as effeminate.
alternative label: Mukhannaths
broader: https://homosaurus.org/v3/homoit0000322
change note: Version 3.7.0
has top concept: Gender
in scheme: v3

LGBTQ+ museums
type: Concept
issued: 2019-05-14
modified: 2025-02-23
replaces: museumsLGBTQ
comment: Institutions dedicated to the storage, exhibition, conservation, and preservation of materials relating to LGBTQ+ people, LGBTQ+ communities, and LGBTQ+ history.
alternative label: Museums (LGBTQ)
broader: https://homosaurus.org/v3/homoit0001755
change note: Version 3.7.0
has top concept: LGBTQ+ cultural heritage institutions
in scheme: v3
narrower: https://homosaurus.org/v3/homoit0000163
narrower: https://homosaurus.org/v3/homoit0000511
narrower: https://homosaurus.org/v3/homoit0000754
narrower: https://homosaurus.org/v3/homoit0001188
narrower: https://homosaurus.org/v3/homoit0001424
related: https://homosaurus.org/v3/homoit0001813
related: https://homosaurus.org/v3/homoit0002716

LGBTQ+ musicals
type: Concept
issued: 2019-05-14
modified: 2025-02-23
replaces: musicals
comment: Films or theatrical productions in which singing and/or dancing are essential elements. Use for musicals created by LGBTQ+ directors, depicting LGBTQ+ people, or that are regarded as important within LGBTQ+ culture.
alternative label: Musicals (LGBTQ)
broader: https://homosaurus.org/v3/homoit0000816
change note: Version 3.7.0
has top concept: Subcultures
in scheme: v3
narrower: https://homosaurus.org/v3/homoit0003161
narrower: https://homosaurus.org/v3/homoit0003162
narrower: https://homosaurus.org/v3/homoit0003163
narrower: https://homosaurus.org/v3/homoit0003164
narrower: https://homosaurus.org/v3/homoit0003165
narrower: https://homosaurus.org/v3/homoit0003228
related: https://homosaurus.org/v3/homoit0000547
related: https://homosaurus.org/v3/homoit0000789
related: https://homosaurus.org/v3/homoit0001363

LGBTQ+ Muslims
type: Concept
issued: 2019-05-14
modified: 2025-02-23
replaces: muslimsLGBTQ
comment: LGBTQ+ people who are Muslim.
alternative label: Muslims (LGBTQ)
broader: https://homosaurus.org/v3/homoit0000928
change note: Version 3.7.0
has top concept: LGBTQ+ religious people
in scheme: v3
narrower: https://homosaurus.org/v3/homoit0000164
narrower: https://homosaurus.org/v3/homoit0000512
narrower: https://homosaurus.org/v3/homoit0000756
narrower: https://homosaurus.org/v3/homoit0001189
narrower: https://homosaurus.org/v3/homoit0001425
narrower: https://homosaurus.org/v3/homoit0002976
narrower: https://homosaurus.org/v3/homoit0002982

Mutual masturbation
type: Concept
issued: 2019-05-14
modified: 2025-02-23
replaces: mutualMasturbation
comment: Sex act in which two or more people simultaneously stimulate their own genitalia.
broader: https://homosaurus.org/v3/homoit0001000
broader: https://homosaurus.org/v3/homoit0001267
broader: https://homosaurus.org/v3/homoit0001299
change note: Version 3.7.0
has top concept: Sex (Act)
in scheme: v3

Muxe
type: Concept
issued: 2019-05-14
modified: 2025-02-23
replaces: muxe
comment: In Zapotec cultures of Oaxaca (southern Mexico), this term refers to people assigned male at birth who dress and behave in feminine ways; sometimes considered a third gender.
broader: https://homosaurus.org/v3/homoit0000322
change note: Version 3.7.0
has top concept: Gender
in scheme: v3

Nádleehi
type: Concept
issued: 2019-05-14
modified: 2025-02-23
replaces: nadleehi
comment: Term used in Native American Navajo tribes to describe people assigned male at birth who take on the role of girls in childhood and women in adulthood.
broader: https://homosaurus.org/v3/homoit0000322
change note: Version 3.7.0
has top concept: Gender
in scheme: v3
related: https://homosaurus.org/v3/homoit0000353
related: https://homosaurus.org/v3/homoit0001480

Native American LGBTQ+ people
type: Concept
issued: 2019-05-14
modified: 2025-02-23
replaces: nativeAmericansLGBTQ
comment: People who are part of the Native peoples of the continental United States and Canada (excluding Inuit people) and self-identity as LGBTQ+. Use more specific terms when available.
alternative label: American Indians (LGBTQ)
alternative label: Native Americans (LGBTQ)
alternative label: American Indian LGBTQ+ people
alternative label: LGBTQ+ American Indians
alternative label: LGBTQ+ Native Americans
broader: https://homosaurus.org/v3/homoit0000886
change note: Version 3.7.0
has top concept: LGBTQ+ people
in scheme: v3
narrower: https://homosaurus.org/v3/homoit0000165
narrower: https://homosaurus.org/v3/homoit0000513
narrower: https://homosaurus.org/v3/homoit0000758
narrower: https://homosaurus.org/v3/homoit0001190
narrower: https://homosaurus.org/v3/homoit0001426
narrower: https://homosaurus.org/v3/homoit0002925
narrower: https://homosaurus.org/v3/homoit0002964
narrower: https://homosaurus.org/v3/homoit0003422
related: https://homosaurus.org/v3/homoit0000098
related: https://homosaurus.org/v3/homoit0001480
related: https://homosaurus.org/v3/homoit0001809
related: https://homosaurus.org/v3/homoit0001810
related: https://homosaurus.org/v3/homoit0001914

Tantric sex
type: Concept
issued: 2019-05-14
modified: 2025-02-23
replaces: tantricSex
comment: Traditionally refers to a wide range of practices in Hindu and Buddhist yoga usually involving the ritual exercise of sexuality. Do not use outside of these contexts.
alternative label: Neotantra
broader: https://homosaurus.org/v3/homoit0001267
broader: https://homosaurus.org/v3/homoit0001299
change note: Version 3.7.0
has top concept: Sex (Act)
in scheme: v3

Neovagina
type: Concept
issued: 2019-05-14
modified: 2025-02-23
replaces: neovagina
comment: A surgically constructed vagina; typically made using tissue grafted from other parts of the body.
broader: https://homosaurus.org/v3/homoit0000561
broader: https://homosaurus.org/v3/homoit0001488
change note: Version 3.7.0
has top concept: Medical care
in scheme: v3
related: https://homosaurus.org/v3/homoit0001844
related: https://homosaurus.org/v3/homoit0001845
related: https://homosaurus.org/v3/homoit0001851

LGBTQ+ newsletters
type: Concept
issued: 2019-05-14
modified: 2025-02-23
replaces: newslettersLGBTQ
comment: Print or digital periodicals created by or for LGBTQ+ people, often with the purpose of sharing community news and information about related issues.
alternative label: Newsletters (LGBTQ)
broader: https://homosaurus.org/v3/homoit0001132
broader: https://homosaurus.org/v3/homoit0001830
change note: Version 3.7.0
has top concept: LGBTQ+ press
in scheme: v3
narrower: https://homosaurus.org/v3/homoit0000166
narrower: https://homosaurus.org/v3/homoit0000514
narrower: https://homosaurus.org/v3/homoit0000759
narrower: https://homosaurus.org/v3/homoit0001191
narrower: https://homosaurus.org/v3/homoit0001427
narrower: https://homosaurus.org/v3/homoit0002797
narrower: https://homosaurus.org/v3/homoit0002918
related: https://homosaurus.org/v3/homoit0000896
related: https://homosaurus.org/v3/homoit0001042
related: https://homosaurus.org/v3/homoit0002714

LGBTQ+ newspapers
type: Concept
issued: 2019-05-14
modified: 2025-02-23
replaces: newspapersLGBTQ
comment: Serialized print or digital publications about LGBTQ+ people and LGBTQ+ issues (typically produced by LGBTQ+ people or LGBTQ+ organizations) that contain news, articles, columns, correspondence, and advertisements.
alternative label: Newspapers (LGBTQ)
broader: https://homosaurus.org/v3/homoit0001132
broader: https://homosaurus.org/v3/homoit0001830
change note: Version 3.7.0
has top concept: LGBTQ+ press
in scheme: v3
narrower: https://homosaurus.org/v3/homoit0000167
narrower: https://homosaurus.org/v3/homoit0000515
narrower: https://homosaurus.org/v3/homoit0000760
narrower: https://homosaurus.org/v3/homoit0000911
narrower: https://homosaurus.org/v3/homoit0001192
narrower: https://homosaurus.org/v3/homoit0001428
narrower: https://homosaurus.org/v3/homoit0002798
narrower: https://homosaurus.org/v3/homoit0002919
related: https://homosaurus.org/v3/homoit0000896
related: https://homosaurus.org/v3/homoit0001041
related: https://homosaurus.org/v3/homoit0002715

Niizh manidoowag
type: Concept
issued: 2019-05-14
modified: 2025-02-23
replaces: niizhManidoowag
comment: Native American Ojibwa term for Two-Spirit people.
broader: https://homosaurus.org/v3/homoit0000322
change note: Version 3.7.0
has top concept: Gender
in scheme: v3
related: https://homosaurus.org/v3/homoit0001480

Ninauposkitzipxpe
type: Concept
issued: 2019-05-14
modified: 2025-02-23
replaces: ninauposkitzipxpe
comment: Used in Native American Blackfoot tribes for people assigned female at birth who are not constrained to the social roles of women; translates to "manly-hearted woman."
broader: https://homosaurus.org/v3/homoit0000322
change note: Version 3.7.0
has top concept: Gender
in scheme: v3
related: https://homosaurus.org/v3/homoit0001480

Nipple clamps
type: Concept
issued: 2019-05-14
modified: 2025-02-23
replaces: nippleClamps
comment: Sex toys consisting of clamps, usually connected by a chain, that are attached to the nipples to cause pain and erotic pleasure.
broader: https://homosaurus.org/v3/homoit0001266
broader: https://homosaurus.org/v3/homoit0003143
change note: Version 3.7.0
has top concept: Sex accessories
in scheme: v3
related: https://homosaurus.org/v3/homoit0001984

Nipple play
type: Concept
issued: 2019-05-14
modified: 2025-02-23
replaces: nipplePlay
comment: Sexual acts involving stimulation of the nipples.
alternative label: Nipple sex
broader: https://homosaurus.org/v3/homoit0001267
broader: https://homosaurus.org/v3/homoit0001299
broader: https://homosaurus.org/v3/homoit0003132
broader: https://homosaurus.org/v3/homoit0003133
change note: Version 3.7.0
has top concept: Sex (Act)
in scheme: v3
narrower: https://homosaurus.org/v3/homoit0003131
related: https://homosaurus.org/v3/homoit0001621
related: https://homosaurus.org/v3/homoit0001984
related: https://homosaurus.org/v3/homoit0003130

No hormone identity
type: Concept
issued: 2019-05-14
modified: 2025-02-23
replaces: noHormoneIdentity
comment: Individuals who have not undergone hormone treatment; typically used to describe trans people who have not undergone and/or do not plan to undergo hormone treatment.
broader: https://homosaurus.org/v3/homoit0001464
change note: Version 3.7.0
has top concept: Transitioning (Gender)
in scheme: v3
related: https://homosaurus.org/v3/homoit0000317
related: https://homosaurus.org/v3/homoit0000617
related: https://homosaurus.org/v3/homoit0001049
related: https://homosaurus.org/v3/homoit0001378
related: https://homosaurus.org/v3/homoit0001381

Non-binary people
type: Concept
issued: 2019-05-14
modified: 2025-02-23
replaces: nonBinaryPeople
comment: Individuals whose gender identity exists outside of the gender binary; only use to describe individuals who self-identify as non-binary.
alternative label: Nonbinary people
alternative label: Enbies
alternative label: NB-ies
broader: https://homosaurus.org/v3/homoit0001378
change note: Version 3.7.0
has top concept: LGBTQ+ people
in scheme: v3
narrower: https://homosaurus.org/v3/homoit0002223
narrower: https://homosaurus.org/v3/homoit0002387
narrower: https://homosaurus.org/v3/homoit0003043
narrower: https://homosaurus.org/v3/homoit0003227
related: https://homosaurus.org/v3/homoit0000021
related: https://homosaurus.org/v3/homoit0000045
related: https://homosaurus.org/v3/homoit0000566
related: https://homosaurus.org/v3/homoit0000571
related: https://homosaurus.org/v3/homoit0001652
related: https://homosaurus.org/v3/homoit0001653
related: https://homosaurus.org/v3/homoit0001670
related: https://homosaurus.org/v3/homoit0001671
related: https://homosaurus.org/v3/homoit0001920
related: https://homosaurus.org/v3/homoit0002185

Non-operative
type: Concept
issued: 2019-05-14
modified: 2025-02-23
replaces: nonOperative
comment: The medical status of individuals who do not plan to undertake a surgical procedure. Commonly used to describe trans people who have not and do not plan to undertake gender affirming surgery.
broader: https://homosaurus.org/v3/homoit0001464
change note: Version 3.7.0
has top concept: Transitioning (Gender)
in scheme: v3
related: https://homosaurus.org/v3/homoit0000561
related: https://homosaurus.org/v3/homoit0000617
related: https://homosaurus.org/v3/homoit0001047
related: https://homosaurus.org/v3/homoit0001378
related: https://homosaurus.org/v3/homoit0001381

Nude beaches
type: Concept
issued: 2019-05-14
modified: 2025-02-23
replaces: nudeBeaches
comment: Beaches that permit nudity.
broader: https://homosaurus.org/v3/homoit0000104
change note: Version 3.7.0
has top concept: LGBTQ+ meeting places
in scheme: v3
related: https://homosaurus.org/v3/homoit0001038

Nude photographs
type: Concept
issued: 2019-05-14
modified: 2025-02-23
replaces: nudePhotographs
comment: Images of naked individuals, including those taken by amateurs or professionals; may be produced for aesthetic or erotic purposes.
alternative label: Nudes
broader: https://homosaurus.org/v3/homoit0001052
change note: Version 3.7.0
has top concept: Nude art
in scheme: v3
related: https://homosaurus.org/v3/homoit0000816

Official documentation
type: Concept
issued: 2019-05-14
modified: 2025-02-23
replaces: officialDocumentation
comment: Legal documents issued by a government or institution to individuals that include identifying information and, typically, grant certain legal or governmental rights and responsibilities (e.g., driver's license, birth certificate, passport).
broader: https://homosaurus.org/v3/homoit0000712
change note: Version 3.7.0
has top concept: Legal status
in scheme: v3
narrower: https://homosaurus.org/v3/homoit0000119
narrower: https://homosaurus.org/v3/homoit0000247
narrower: https://homosaurus.org/v3/homoit0000275
narrower: https://homosaurus.org/v3/homoit0000277
narrower: https://homosaurus.org/v3/homoit0000311
narrower: https://homosaurus.org/v3/homoit0000360
narrower: https://homosaurus.org/v3/homoit0000377
narrower: https://homosaurus.org/v3/homoit0000991
narrower: https://homosaurus.org/v3/homoit0000993
narrower: https://homosaurus.org/v3/homoit0001005
narrower: https://homosaurus.org/v3/homoit0001092
narrower: https://homosaurus.org/v3/homoit0001324
related: https://homosaurus.org/v3/homoit0000274
related: https://homosaurus.org/v3/homoit0000362
related: https://homosaurus.org/v3/homoit0000711
related: https://homosaurus.org/v3/homoit0000883
related: https://homosaurus.org/v3/homoit0000918
related: https://homosaurus.org/v3/homoit0000990
related: https://homosaurus.org/v3/homoit0001815
related: https://homosaurus.org/v3/homoit0001853

Older bisexual people
type: Concept
issued: 2019-05-14
modified: 2025-02-23
replaces: olderBisexualPeople
comment: Bisexual people who are advanced in age, typically over 60 years of age.
broader: https://homosaurus.org/v3/homoit0000170
broader: https://homosaurus.org/v3/homoit0000393
change note: Version 3.7.0
has top concept: LGBTQ+ people
in scheme: v3

Older gay men
type: Concept
issued: 2019-05-14
modified: 2025-02-23
replaces: olderGayMen
comment: Gay men who are advanced in age, typically over 60 years of age.
broader: https://homosaurus.org/v3/homoit0000393
broader: https://homosaurus.org/v3/homoit0000506
change note: Version 3.7.0
has top concept: LGBTQ+ people
in scheme: v3

Older lesbians
type: Concept
issued: 2019-05-14
modified: 2025-02-23
replaces: olderLesbians
comment: Lesbians who are advanced in age, typically over 60 years of age.
broader: https://homosaurus.org/v3/homoit0000393
broader: https://homosaurus.org/v3/homoit0000556
change note: Version 3.7.0
has top concept: LGBTQ+ people
in scheme: v3

Older queer people
type: Concept
issued: 2019-05-14
modified: 2025-02-23
replaces: olderQueerPeople
comment: Queer people who are advanced in age, typically over 60 years of age.
broader: https://homosaurus.org/v3/homoit0000393
change note: Version 3.7.0
has top concept: LGBTQ+ people
in scheme: v3

Older transgender people
type: Concept
issued: 2019-05-14
modified: 2025-02-23
replaces: olderTransgenderPeople
comment: Transgender people who are advanced in age, typically over 60 years of age.
broader: https://homosaurus.org/v3/homoit0000393
broader: https://homosaurus.org/v3/homoit0001378
change note: Version 3.7.0
has top concept: LGBTQ+ people
in scheme: v3

Orchiectomy
type: Concept
issued: 2019-05-14
modified: 2025-02-23
replaces: orchiectomy
comment: Medical procedure to remove one or more testes; often part of gender affirming surgery, though it can be performed for other reasons.
broader: https://homosaurus.org/v3/homoit0000241
broader: https://homosaurus.org/v3/homoit0000584
change note: Version 3.7.0
has top concept: Castration
in scheme: v3

Organizations for sexual research and sexual reform
type: Concept
issued: 2019-05-14
modified: 2025-02-23
replaces: organisationsForSexualResearchAndSex
comment: Institutions or groups dedicated to research, education, policy work, and advocacy regarding human sexuality and sexual behavior, particularly to challenge taboos and encourage more open discussion of sex and sexuality within society.
alternative label: Sexual reform organizations
alternative label: Sexual research organizations
broader: https://homosaurus.org/v3/homoit0001306
change note: Version 3.7.0
has top concept: Sexuality
in scheme: v3
preferred label: Organisations for sexual research and sexual reform
related: https://homosaurus.org/v3/homoit0000836

Orgasm
type: Concept
issued: 2019-05-14
modified: 2025-02-23
replaces: orgasm
comment: Climax of sexual excitement, typically characterized by feelings of pleasure and physical sensations including rapid muscle contractions, higher blood pressure and heart rate, release of endorphins, and ejaculation.
broader: https://homosaurus.org/v3/homoit0001284
change note: Version 3.7.0
has top concept: Hypersexuality
in scheme: v3
related: https://homosaurus.org/v3/homoit0000323
related: https://homosaurus.org/v3/homoit0000460
related: https://homosaurus.org/v3/homoit0000589
related: https://homosaurus.org/v3/homoit0000610
related: https://homosaurus.org/v3/homoit0000683
related: https://homosaurus.org/v3/homoit0001267
related: https://homosaurus.org/v3/homoit0001288
related: https://homosaurus.org/v3/homoit0001306
related: https://homosaurus.org/v3/homoit0003073
related: https://homosaurus.org/v3/homoit0003114
related: https://homosaurus.org/v3/homoit0003127

Otters (Gay culture)
type: Concept
issued: 2019-05-14
modified: 2025-02-23
replaces: otters
comment: U.S. slang term term for gay men who blend the physical and social traits of bears and twinks.
alternative label: Otter men
alternative label: Otters
broader: https://homosaurus.org/v3/homoit0000487
broader: https://homosaurus.org/v3/homoit0000506
broader: https://homosaurus.org/v3/homoit0000577
broader: https://homosaurus.org/v3/homoit0001295
change note: Version 3.7.0
has top concept: Subcultures
in scheme: v3
related: https://homosaurus.org/v3/homoit0000105
related: https://homosaurus.org/v3/homoit0000568
related: https://homosaurus.org/v3/homoit0001145
related: https://homosaurus.org/v3/homoit0001508

Outing (LGBTQ+ culture)
type: Concept
issued: 2019-05-14
modified: 2025-02-23
replaces: outing
comment: The act of disclosing a person's sexual or gender identity without that person's consent.
alternative label: Outing
broader: https://homosaurus.org/v3/homoit0000853
change note: Version 3.7.0
has top concept: LGBTQ+ activism
in scheme: v3
related: https://homosaurus.org/v3/homoit0000088
related: https://homosaurus.org/v3/homoit0000089
related: https://homosaurus.org/v3/homoit0000285
related: https://homosaurus.org/v3/homoit0000286
related: https://homosaurus.org/v3/homoit0000287
related: https://homosaurus.org/v3/homoit0000288
related: https://homosaurus.org/v3/homoit0000295
related: https://homosaurus.org/v3/homoit0000336
related: https://homosaurus.org/v3/homoit0001261
related: https://homosaurus.org/v3/homoit0001783
related: https://homosaurus.org/v3/homoit0001784
related: https://homosaurus.org/v3/homoit0001785
related: https://homosaurus.org/v3/homoit0001786
related: https://homosaurus.org/v3/homoit0001787
related: https://homosaurus.org/v3/homoit0002392
related: https://homosaurus.org/v3/homoit0002905

Ovo-testes
type: Concept
issued: 2019-05-14
modified: 2025-02-23
replaces: ovoTestes
comment: People with this variation are born with both ovarian and testicular tissue. A person can develop one testis and one ovary, or they may develop one or more ovo-testes, which means that a single gonad is made up of both ovarian and testicular cells. The levels of hormones they produce can vary and how their genitals and secondary sex characteristics develop will depend partially on the levels of estrogen and testosterone that their bodies make. In adolescence, people with ovo-testes may develop features associated with either a typical estrogen puberty or a typical testosterone puberty, or they may develop some of each. Sometimes a person with an ovary and a testis or with ovo-testes can produce viable sperm and viable eggs.
alternative label: True hermaphroditism
alternative label: "Ovotesticular DSD "
broader: https://homosaurus.org/v3/homoit0000669
change note: Version 3.7.0
has top concept: Sex (Body)
in scheme: v3

Packing (Phallus)
type: Concept
issued: 2019-05-14
modified: 2025-02-23
replaces: packingPhallus
comment: The act of wearing padding or a phallic object in the front of the pants or underwear to give the appearance of having a bulge.
broader: https://homosaurus.org/v3/homoit0000568
change note: Version 3.7.0
has top concept: Gender
in scheme: v3
related: https://homosaurus.org/v3/homoit0000354
related: https://homosaurus.org/v3/homoit0001099
related: https://homosaurus.org/v3/homoit0001790

Spanking paddles
type: Concept
issued: 2019-05-14
modified: 2025-02-23
replaces: spankingPaddles
comment: A tool with a short handle at one end and a wide, flat surface at the other that is used to strike the buttocks as a form of impact play.
broader: https://homosaurus.org/v3/homoit0001266
change note: Version 3.7.0
has top concept: Sex accessories
in scheme: v3
related: https://homosaurus.org/v3/homoit0001335
related: https://homosaurus.org/v3/homoit0003075

LGBTQ+ Pagans
type: Concept
issued: 2019-05-14
modified: 2025-02-23
replaces: pagansLGBTQ
comment: LGBTQ+ people who are members of polytheistic religions or other religions outside of the dominant culture that typically incorporate nature worship and/or the sacred feminine, such as Wicca, Druidry, Heathenry, etc. Use to describe LGBTQ+ people who self-identify as Pagan.
alternative label: Pagans (LGBTQ)
broader: https://homosaurus.org/v3/homoit0000928
change note: Version 3.7.0
has top concept: LGBTQ+ religious people
in scheme: v3
narrower: https://homosaurus.org/v3/homoit0000168
narrower: https://homosaurus.org/v3/homoit0000516
narrower: https://homosaurus.org/v3/homoit0000761
narrower: https://homosaurus.org/v3/homoit0001193
narrower: https://homosaurus.org/v3/homoit0001429
narrower: https://homosaurus.org/v3/homoit0001907
narrower: https://homosaurus.org/v3/homoit0002977
narrower: https://homosaurus.org/v3/homoit0002983
related: https://homosaurus.org/v3/homoit0000596

Palao'ana
type: Concept
issued: 2019-05-14
modified: 2025-02-23
replaces: palaoana
comment: Chamorro (Mariana Islands) term for third gender people.
broader: https://homosaurus.org/v3/homoit0000322
change note: Version 3.7.0
has top concept: Gender
in scheme: v3

Pangender identity
type: Concept
issued: 2019-05-14
modified: 2025-02-23
replaces: pangenderIdentity
comment: Gender identity that encompasses multiple or all genders.
broader: https://homosaurus.org/v3/homoit0000571
change note: Version 3.7.0
has top concept: Gender
in scheme: v3
related: https://homosaurus.org/v3/homoit0001072

Pangender people
type: Concept
issued: 2019-05-14
modified: 2025-02-23
replaces: pangenderPeople
comment: People who identify as multiple or all genders.
broader: https://homosaurus.org/v3/homoit0000322
broader: https://homosaurus.org/v3/homoit0001378
broader: https://homosaurus.org/v3/homoit0001817
change note: Version 3.7.0
has top concept: Gender
in scheme: v3
related: https://homosaurus.org/v3/homoit0001071

Pansexual people
type: Concept
issued: 2019-05-14
modified: 2025-02-23
replaces: pansexualPeople
comment: Individuals who self-identify as pansexual, meaning that they are sexually attracted to people of all genders. Some but not all pansexual people also identify as "gender-blind" because gender is insignificant or irrelevant in determining their attraction.
alternative label: Omnisexual
broader: https://homosaurus.org/v3/homoit0000108
broader: https://homosaurus.org/v3/homoit0000915
change note: Version 3.7.0
has top concept: LGBTQ+ people
in scheme: v3
related: https://homosaurus.org/v3/homoit0000170
related: https://homosaurus.org/v3/homoit0001381
related: https://homosaurus.org/v3/homoit0001531
related: https://homosaurus.org/v3/homoit0001926

Parental rights
type: Concept
issued: 2019-05-14
modified: 2025-02-23
replaces: parentalRights
comment: The legal parent-child relationship that may be established by biological relations, at birth, or through adoption. These rights may include child custody and visitation, decision-making authority, and informational access.
broader: https://homosaurus.org/v3/homoit0000712
change note: Version 3.7.0
has top concept: Legal status
in scheme: v3
related: https://homosaurus.org/v3/homoit0000914
related: https://homosaurus.org/v3/homoit0000918

LGBTQ+ parents
type: Concept
issued: 2019-05-14
modified: 2025-02-23
replaces: parentsLGBTQ
comment: LGBTQ+ people who are parents.
alternative label: Parents (LGBTQ)
broader: https://homosaurus.org/v3/homoit0000420
broader: https://homosaurus.org/v3/homoit0002372
change note: Version 3.7.0
has top concept: LGBTQ+ families
in scheme: v3
narrower: https://homosaurus.org/v3/homoit0000169
narrower: https://homosaurus.org/v3/homoit0000492
narrower: https://homosaurus.org/v3/homoit0000752
narrower: https://homosaurus.org/v3/homoit0000812
narrower: https://homosaurus.org/v3/homoit0000819
narrower: https://homosaurus.org/v3/homoit0000821
narrower: https://homosaurus.org/v3/homoit0000840
narrower: https://homosaurus.org/v3/homoit0000872
narrower: https://homosaurus.org/v3/homoit0000944
narrower: https://homosaurus.org/v3/homoit0001194
narrower: https://homosaurus.org/v3/homoit0001430
narrower: https://homosaurus.org/v3/homoit0001761
narrower: https://homosaurus.org/v3/homoit0001762
narrower: https://homosaurus.org/v3/homoit0001763
narrower: https://homosaurus.org/v3/homoit0002337
narrower: https://homosaurus.org/v3/homoit0002343
narrower: https://homosaurus.org/v3/homoit0002387
related: https://homosaurus.org/v3/homoit0000809
related: https://homosaurus.org/v3/homoit0000811
related: https://homosaurus.org/v3/homoit0000843
related: https://homosaurus.org/v3/homoit0000864
related: https://homosaurus.org/v3/homoit0000870
related: https://homosaurus.org/v3/homoit0000914
related: https://homosaurus.org/v3/homoit0002584
related: https://homosaurus.org/v3/homoit0002586

Parents of crossdressers
type: Concept
issued: 2019-05-14
modified: 2025-02-23
replaces: parentsOfCrossdressers
comment: People who act as parents to one or more crossdresser. Only use to describe the parents of someone who self-identifies as a crossdresser.
broader: https://homosaurus.org/v3/homoit0002372
change note: Version 3.7.0
has top concept: Family members
in scheme: v3
related: https://homosaurus.org/v3/homoit0000316

Parents of queer people
type: Concept
issued: 2019-05-14
modified: 2025-02-23
replaces: parentsOfQueerPeople
comment: People who act as parents to one or more queer person. For parents who are themselves queer, use the term "Queer parents."
alternative label: Queer people's parents
broader: https://homosaurus.org/v3/homoit0002224
change note: Version 3.7.0
has top concept: Family members
in scheme: v3
related: https://homosaurus.org/v3/homoit0001195

Parents of transgender people
type: Concept
issued: 2019-05-14
modified: 2025-02-23
replaces: parentsOfTransgenderPeople
comment: People who act as parents to one or more transgender person. For parents who are themselves transgender, use the term "Transgender parents."
alternative label: Transgender people's parents
broader: https://homosaurus.org/v3/homoit0002224
change note: Version 3.7.0
has top concept: Family members
in scheme: v3
related: https://homosaurus.org/v3/homoit0001378

Partial androgen insensitivity syndrome
type: Concept
issued: 2019-05-14
modified: 2025-02-23
replaces: partialAndrogenInsensitivitySyndrome
comment: People with partial androgen insensitivity (PAIS) have some response to testosterone, but not as much as is typical for people with XY chromosomes without androgen insensitivity. People with PAIS may be born with testes that are undescended or partially descended and with genital differences such as a vaginal opening that is shallower than typical, a phallus that may be perceived as a large clitoris or a small penis, and variations affecting their urethra. They might also be born with genitals that look more like a penis or like a vulva and vagina. In adolescence, people with PAIS may develop some features that are associated with a typical testosterone puberty and others that are associated with a typical estrogen puberty since their body responds to some of the testosterone that their gonads produce while the rest is converted into estrogen.
alternative label: PAIS
broader: https://homosaurus.org/v3/homoit0000044
broader: https://homosaurus.org/v3/homoit0000669
change note: Version 3.7.0
has top concept: Sex (Body)
in scheme: v3

Partner preference
type: Concept
issued: 2019-05-14
modified: 2025-02-23
replaces: partnerPreference
comment: An enduring pattern of desire for connection and relationships (romantic, sexual, or play) with people of specific identities or within specific relationship orientations (monogamy, polyamory, polygamy).
broader: https://homosaurus.org/v3/homoit0001300
change note: Version 3.7.0
has top concept: Sexual preference
in scheme: v3
narrower: https://homosaurus.org/v3/homoit0001019
narrower: https://homosaurus.org/v3/homoit0001124
related: https://homosaurus.org/v3/homoit0001295
related: https://homosaurus.org/v3/homoit0001302
related: https://homosaurus.org/v3/homoit0001311
related: https://homosaurus.org/v3/homoit0001916
related: https://homosaurus.org/v3/homoit0002255
related: https://homosaurus.org/v3/homoit0002365

Partner rights
type: Concept
issued: 2019-05-14
modified: 2025-02-23
replaces: partnerRights
comment: Legal, economic, social, and cultural rights afforded to individuals who are in long-term partnerships (e.g., marriage, domestic partnership, civil union) that can include shared health insurance, life insurance benefits, adoption rights, and the authority to make medical and financial decisions on behalf of one's partner.
broader: https://homosaurus.org/v3/homoit0000712
change note: Version 3.7.0
has top concept: Legal status
in scheme: v3
related: https://homosaurus.org/v3/homoit0001311
related: https://homosaurus.org/v3/homoit0002365

LGBTQ+ partners
type: Concept
issued: 2019-05-14
modified: 2025-02-23
replaces: partnersLGBTQ
comment: Gender-neutral term for sexual, romantic, or play partners who are also LGBTQ+.
alternative label: Partners (LGBTQ)
broader: https://homosaurus.org/v3/homoit0000420
broader: https://homosaurus.org/v3/homoit0002365
change note: Version 3.7.0
has top concept: LGBTQ+ families
in scheme: v3
narrower: https://homosaurus.org/v3/homoit0000863
narrower: https://homosaurus.org/v3/homoit0002367
narrower: https://homosaurus.org/v3/homoit0002368
narrower: https://homosaurus.org/v3/homoit0002369
narrower: https://homosaurus.org/v3/homoit0002370
narrower: https://homosaurus.org/v3/homoit0002371
narrower: https://homosaurus.org/v3/homoit0002800
narrower: https://homosaurus.org/v3/homoit0002920
related: https://homosaurus.org/v3/homoit0000310
related: https://homosaurus.org/v3/homoit0000855
related: https://homosaurus.org/v3/homoit0000895
related: https://homosaurus.org/v3/homoit0001237

Partners of bisexual people
type: Concept
issued: 2019-05-14
modified: 2025-02-23
replaces: partnersOfBisexualPeople
comment: People whose sexual, romantic, or play partner is bisexual.
broader: https://homosaurus.org/v3/homoit0002366
change note: Version 3.7.0
has top concept: Partners
in scheme: v3

Partners of crossdressers
type: Concept
issued: 2019-05-14
modified: 2025-02-23
replaces: partnersOfCrossdressers
comment: People whose sexual, romantic, or play partner is a crossdresser. Only use to describe individuals whose partners self-identify as crossdressers.
broader: https://homosaurus.org/v3/homoit0002365
change note: Version 3.7.0
has top concept: Partners
in scheme: v3
related: https://homosaurus.org/v3/homoit0000316

Partners of gay men
type: Concept
issued: 2019-05-14
modified: 2025-02-23
replaces: partnersOfGayMen
comment: People whose sexual, romantic, or play partner is a gay man.
broader: https://homosaurus.org/v3/homoit0002366
change note: Version 3.7.0
has top concept: Partners
in scheme: v3

Partners of lesbians
type: Concept
issued: 2019-05-14
modified: 2025-02-23
replaces: partnersOfLesbians
comment: People whose sexual, romantic, or play partner is a lesbian.
broader: https://homosaurus.org/v3/homoit0002366
change note: Version 3.7.0
has top concept: Partners
in scheme: v3

Partners of queer people
type: Concept
issued: 2019-05-14
modified: 2025-02-23
replaces: partnersOfQueerPeople
comment: People whose sexual, romantic, or play partner is queer.
broader: https://homosaurus.org/v3/homoit0002366
change note: Version 3.7.0
has top concept: Partners
in scheme: v3

Partners of transgender people
type: Concept
issued: 2019-05-14
modified: 2025-02-23
replaces: partnersOfTransgenderPeople
comment: People whose sexual, romantic, or play partner is transgender.
broader: https://homosaurus.org/v3/homoit0002366
change note: Version 3.7.0
has top concept: Partners
in scheme: v3
related: https://homosaurus.org/v3/homoit0001378
related: https://homosaurus.org/v3/homoit0001780

Passive immune therapy
type: Concept
issued: 2019-05-14
modified: 2025-02-23
replaces: passiveImmuneTherapy
comment: A medical treatment in which a person receives laboratory-made antibodies to help fight an infection or disease.
broader: https://homosaurus.org/v3/homoit0001007
change note: Version 3.7.0
has top concept: Medical care
in scheme: v3
related: https://homosaurus.org/v3/homoit0000005

Passports
type: Concept
issued: 2019-05-14
modified: 2025-02-23
replaces: passports
comment: Official documentation issued by a government that certifies the holder’s identity and citizenship, entitling them to travel under to and from other countries.
broader: https://homosaurus.org/v3/homoit0001053
change note: Version 3.7.0
has top concept: Legal status
in scheme: v3
narrower: https://homosaurus.org/v3/homoit0000573
related: https://homosaurus.org/v3/homoit0000247
related: https://homosaurus.org/v3/homoit0000711
related: https://homosaurus.org/v3/homoit0000883
related: https://homosaurus.org/v3/homoit0001465
related: https://homosaurus.org/v3/homoit0001815
related: https://homosaurus.org/v3/homoit0001853

Pederasts
type: Concept
issued: 2019-05-14
modified: 2025-02-23
replaces: pederasts
comment: Adult men who have sexual and mentor/protégé relationships with adolescent boys. This term has historically been used to describe gay men. Only use in historical contexts.
broader: https://homosaurus.org/v3/homoit0000878
broader: https://homosaurus.org/v3/homoit0001295
broader: https://homosaurus.org/v3/homoit0001300
change note: Version 3.7.0
has top concept: LGBTQ+ historical terms
in scheme: v3
related: https://homosaurus.org/v3/homoit0001095

Pederasty
type: Concept
issued: 2019-05-14
modified: 2025-02-23
replaces: pederasty
comment: Term used to describe the practices of adult men who engage in sexual and mentor/protégé relationships with adolescent boys. This term has historically been used to describe the practices of gay men. Only use in historical contexts.
broader: https://homosaurus.org/v3/homoit0000878
change note: Version 3.7.0
has top concept: LGBTQ+ historical terms
in scheme: v3
related: https://homosaurus.org/v3/homoit0001094
related: https://homosaurus.org/v3/homoit0001300
related: https://homosaurus.org/v3/homoit0001325

Peep shows
type: Concept
issued: 2019-05-14
modified: 2025-02-23
replaces: peepShows
comment: Live sex shows or pornographic movies viewed through a small opening or magnifying lens, typically from a coin-operated booth.
alternative label: Peepshows
broader: https://homosaurus.org/v3/homoit0000011
change note: Version 3.7.0
has top concept: Sex industry
in scheme: v3

Penectomy
type: Concept
issued: 2019-05-14
modified: 2025-02-23
replaces: penectomy
comment: Surgical removal of the penis.
broader: https://homosaurus.org/v3/homoit0000241
broader: https://homosaurus.org/v3/homoit0000584
change note: Version 3.7.0
has top concept: Castration
in scheme: v3

Penis
type: Concept
issued: 2019-05-14
modified: 2025-02-23
replaces: penises
comment: External genital organ.
alternative label: Cock
alternative label: Dick
alternative label: Dong
alternative label: Penises
alternative label: Phallus
alternative label: Prick
alternative label: Wang
broader: https://homosaurus.org/v3/homoit0000401
broader: https://homosaurus.org/v3/homoit0000585
change note: Version 3.7.0
has top concept: Erogenous body parts
in scheme: v3
narrower: https://homosaurus.org/v3/homoit0001894
related: https://homosaurus.org/v3/homoit0000212
related: https://homosaurus.org/v3/homoit0000292
related: https://homosaurus.org/v3/homoit0000355
related: https://homosaurus.org/v3/homoit0000400
related: https://homosaurus.org/v3/homoit0001067
related: https://homosaurus.org/v3/homoit0001098
related: https://homosaurus.org/v3/homoit0001268
related: https://homosaurus.org/v3/homoit0001342
related: https://homosaurus.org/v3/homoit0001476
related: https://homosaurus.org/v3/homoit0001790
related: https://homosaurus.org/v3/homoit0001846
related: https://homosaurus.org/v3/homoit0001847
related: https://homosaurus.org/v3/homoit0001850

LGBTQ+ people in the military
type: Concept
issued: 2019-05-14
modified: 2025-02-23
replaces: peopleInTheMilitaryLGBTQ
comment: LGBTQ+ people serving in state and national armed forces.
alternative label: People in the military (LGBTQ)
broader: https://homosaurus.org/v3/homoit0000712
change note: Version 3.7.0
has top concept: Legal status
in scheme: v3
narrower: https://homosaurus.org/v3/homoit0000171
narrower: https://homosaurus.org/v3/homoit0000507
narrower: https://homosaurus.org/v3/homoit0000800
narrower: https://homosaurus.org/v3/homoit0001196
narrower: https://homosaurus.org/v3/homoit0001431
narrower: https://homosaurus.org/v3/homoit0002801
narrower: https://homosaurus.org/v3/homoit0002921
related: https://homosaurus.org/v3/homoit0000862
related: https://homosaurus.org/v3/homoit0002718

LGBTQ+ people of color
type: Concept
issued: 2019-05-14
modified: 2025-02-23
replaces: peopleOfColourLGBTQ
comment: Primarily used in the United States, this term refers to LGBTQ+ people who are not white and who identify as people of color.
broader: https://homosaurus.org/v3/homoit0000915
change note: Version 3.7.0
has top concept: LGBTQ+ people
in scheme: v3
narrower: https://homosaurus.org/v3/homoit0000074
narrower: https://homosaurus.org/v3/homoit0000172
narrower: https://homosaurus.org/v3/homoit0000208
narrower: https://homosaurus.org/v3/homoit0000508
narrower: https://homosaurus.org/v3/homoit0000801
narrower: https://homosaurus.org/v3/homoit0000820
narrower: https://homosaurus.org/v3/homoit0000886
narrower: https://homosaurus.org/v3/homoit0000903
narrower: https://homosaurus.org/v3/homoit0001146
narrower: https://homosaurus.org/v3/homoit0001432
narrower: https://homosaurus.org/v3/homoit0001812
narrower: https://homosaurus.org/v3/homoit0002009
narrower: https://homosaurus.org/v3/homoit0002044
narrower: https://homosaurus.org/v3/homoit0002060
narrower: https://homosaurus.org/v3/homoit0002070
narrower: https://homosaurus.org/v3/homoit0002078
narrower: https://homosaurus.org/v3/homoit0002086
narrower: https://homosaurus.org/v3/homoit0002094
narrower: https://homosaurus.org/v3/homoit0002102
narrower: https://homosaurus.org/v3/homoit0002110
narrower: https://homosaurus.org/v3/homoit0002118
narrower: https://homosaurus.org/v3/homoit0002126
narrower: https://homosaurus.org/v3/homoit0002134
narrower: https://homosaurus.org/v3/homoit0002231
narrower: https://homosaurus.org/v3/homoit0002239
narrower: https://homosaurus.org/v3/homoit0002247
narrower: https://homosaurus.org/v3/homoit0002295
narrower: https://homosaurus.org/v3/homoit0002303
narrower: https://homosaurus.org/v3/homoit0002311
narrower: https://homosaurus.org/v3/homoit0002319
narrower: https://homosaurus.org/v3/homoit0002755
narrower: https://homosaurus.org/v3/homoit0002802
narrower: https://homosaurus.org/v3/homoit0003557
preferred label: LGBTQ+ people of colour
related: https://homosaurus.org/v3/homoit0001928
related: https://homosaurus.org/v3/homoit0002190
related: https://homosaurus.org/v3/homoit0002273
related: https://homosaurus.org/v3/homoit0003801

Performance art
type: Concept
issued: 2019-05-14
modified: 2025-02-23
replaces: performanceArt
comment: Art created through actions performed by the artist or other participants, typically for a live audience.
broader: https://homosaurus.org/v3/homoit0001363
change note: Version 3.7.0
has top concept: LGBTQ+ theater
in scheme: v3

Persecution of bisexual people
type: Concept
issued: 2019-05-14
modified: 2025-02-23
replaces: persecutionOfBisexualPeople
comment: Systematic mistreatment of bisexual people on the basis of their sexual identity.
broader: https://homosaurus.org/v3/homoit0001108
change note: Version 3.7.0
has top concept: LGBTQ+ persecutions
in scheme: v3
related: https://homosaurus.org/v3/homoit0000170

Persecution of gay men
type: Concept
issued: 2019-05-14
modified: 2025-02-23
replaces: persecutionOfGayMen
comment: Systematic mistreatment of gay men on the basis of their sexual identity.
broader: https://homosaurus.org/v3/homoit0001108
change note: Version 3.7.0
has top concept: LGBTQ+ persecutions
in scheme: v3
related: https://homosaurus.org/v3/homoit0000506

Persecution of lesbians
type: Concept
issued: 2019-05-14
modified: 2025-02-23
replaces: persecutionOfLesbians
comment: Systematic mistreatment of lesbians on the basis of their sexual identity.
broader: https://homosaurus.org/v3/homoit0001108
change note: Version 3.7.0
has top concept: LGBTQ+ persecutions
in scheme: v3
related: https://homosaurus.org/v3/homoit0000556

Persecution of queer people
type: Concept
issued: 2019-05-14
modified: 2025-02-23
replaces: persecutionOfQueerPeople
comment: Systematic mistreatment of queer people on the basis of their gender and/or sexual identities.
broader: https://homosaurus.org/v3/homoit0001108
change note: Version 3.7.0
has top concept: LGBTQ+ persecutions
in scheme: v3
related: https://homosaurus.org/v3/homoit0001195

Persecution of transgender people
type: Concept
issued: 2019-05-14
modified: 2025-02-23
replaces: persecutionOfTransgenderPeople
comment: Systematic mistreatment of transgender people on the basis of their gender identity.
broader: https://homosaurus.org/v3/homoit0001108
change note: Version 3.7.0
has top concept: LGBTQ+ persecutions
in scheme: v3
related: https://homosaurus.org/v3/homoit0001378

Phallic sex
type: Concept
issued: 2019-05-14
modified: 2025-02-23
replaces: phallicSex
comment: Sexual stimulation or sexual practices involving penises or phallic objects (e.g., dildos).
broader: https://homosaurus.org/v3/homoit0001267
broader: https://homosaurus.org/v3/homoit0001299
change note: Version 3.7.0
has top concept: Sex (Act)
in scheme: v3
narrower: https://homosaurus.org/v3/homoit0000212
narrower: https://homosaurus.org/v3/homoit0000459
narrower: https://homosaurus.org/v3/homoit0001498
narrower: https://homosaurus.org/v3/homoit0001500

Phone sex
type: Concept
issued: 2019-05-14
modified: 2025-02-23
replaces: phoneSex
comment: Sexual encounters that take place over the phone, whether in a phone call or on a video call using a smartphone.
alternative label: Telephone sex
broader: https://homosaurus.org/v3/homoit0001267
broader: https://homosaurus.org/v3/homoit0001299
change note: Version 3.7.0
has top concept: Sex (Act)
in scheme: v3

Phone sex workers
type: Concept
issued: 2019-05-14
modified: 2025-02-23
replaces: phoneSexWorkers
comment: People who perform real-time sex work via phone calls, text messaging, or online voice calls. Use "Cam models" for individuals who perform real-time sex work via streaming video or video calls.
alternative label: Phone sex operators
alternative label: Telephone sex workers
alternative label: Telephone sex operators
broader: https://homosaurus.org/v3/homoit0003758
change note: Version 3.7.0
has top concept: Sex workers
in scheme: v3
related: https://homosaurus.org/v3/homoit0003763

Physical health care for LGBTQ+ people
type: Concept
issued: 2019-05-14
modified: 2025-02-23
replaces: physicalHealthCareForLGBTQPeople
comment: Organized measures taken for the maintenance, treatment, or improvement of physical health or conditions of the body; use in reference to physical health care addressing the particular needs of LGBTQ+ individuals or communities.
alternative label: Physical health care for LGBTQ people
broader: https://homosaurus.org/v3/homoit0000614
change note: Version 3.7.0
has top concept: Health care for LGBTQ+ people
in scheme: v3

Piercings
type: Concept
issued: 2019-05-14
modified: 2025-02-23
replaces: piercings
comment: Small holes or openings made in parts of the body to insert jewelry or implants, whether for aesthetic purposes, spiritual or religious reasons, or sexual pleasure.
broader: https://homosaurus.org/v3/homoit0000214
broader: https://homosaurus.org/v3/homoit0003076
change note: Version 3.7.0
has top concept: Body adornment
in scheme: v3
narrower: https://homosaurus.org/v3/homoit0003077

Pinching
type: Concept
issued: 2019-05-14
modified: 2025-02-23
replaces: pinching
comment: Form of manual stimulation involving gripping, pulling, or putting tension on parts of one’s body or another person's body for sexual stimulation, arousal, or pleasure.
broader: https://homosaurus.org/v3/homoit0000988
broader: https://homosaurus.org/v3/homoit0001299
change note: Version 3.7.0
has top concept: Sex (Act)
in scheme: v3

Pink triangles
type: Concept
issued: 2019-05-14
modified: 2025-02-23
replaces: pinkTriangles
comment: International symbol of gay pride and the gay rights movement that symbolizes the reclamation of the pink triangles used in Nazi Germany to identify gay men (and, later, bisexual men and transgender women) who were sent to concentration camps.
broader: https://homosaurus.org/v3/homoit0000954
change note: Version 3.7.0
has top concept: LGBTQ+ symbols
in scheme: v3

LGBTQ+ poetry
type: Concept
issued: 2019-05-14
modified: 2025-02-23
replaces: poetryLGBTQ
comment: Poetry about LGBTQ+ people or relating to LGBTQ+ issues.
alternative label: Poetry (LGBTQ)
broader: https://homosaurus.org/v3/homoit0000972
change note: Version 3.7.0
has top concept: Subcultures
in scheme: v3
narrower: https://homosaurus.org/v3/homoit0000174
narrower: https://homosaurus.org/v3/homoit0000517
narrower: https://homosaurus.org/v3/homoit0000762
narrower: https://homosaurus.org/v3/homoit0001197
narrower: https://homosaurus.org/v3/homoit0001433
narrower: https://homosaurus.org/v3/homoit0002401
narrower: https://homosaurus.org/v3/homoit0002403
narrower: https://homosaurus.org/v3/homoit0002405
narrower: https://homosaurus.org/v3/homoit0002408
narrower: https://homosaurus.org/v3/homoit0002508
narrower: https://homosaurus.org/v3/homoit0002536
narrower: https://homosaurus.org/v3/homoit0002576
related: https://homosaurus.org/v3/homoit0001723
related: https://homosaurus.org/v3/homoit0002630
related: https://homosaurus.org/v3/homoit0002642

Police entrapment
type: Concept
issued: 2019-05-14
modified: 2025-02-23
replaces: policeEntrapment
comment: A practice in which law enforcement agents or agents of the state coerce an individual to commit a "crime" they would have otherwise been unlikely or unwilling to commit. Legal definitions of entrapment vary widely depending on the jurisdiction, but the term is often used colloquially to refer to police acting dishonestly or in bad faith, as well as policing focused on anticipating and inducing crime, rather than responding to reports of crime.
broader: https://homosaurus.org/v3/homoit0001121
change note: Version 3.7.0
has top concept: Harassment
in scheme: v3
narrower: https://homosaurus.org/v3/homoit0002374
related: https://homosaurus.org/v3/homoit0000068
related: https://homosaurus.org/v3/homoit0001119

Police harassment
type: Concept
issued: 2019-05-14
modified: 2025-02-23
replaces: policeHarassment
comment: Any of various forms of inappropriate conduct, illegal actions, or abuses of power undertaken by law enforcement agents or agents of the state against members of the public. This includes but is not limited to racial, ethnic, and other forms of profiling; unwarranted surveillance, searches, and seizure; selective enforcement; excessive use of force; sexual misconduct; intimidation and witness tampering; falsification of evidence; coerced confessions; false arrests and imprisonment; and bribing or lobbying.
alternative label: Harrassment by police
alternative label: Misconduct by police
alternative label: Mistreatment by police
alternative label: Police misconduct
alternative label: Police mistreatment
broader: https://homosaurus.org/v3/homoit0000611
change note: Version 3.7.0
has top concept: Harassment
in scheme: v3
narrower: https://homosaurus.org/v3/homoit0001120
narrower: https://homosaurus.org/v3/homoit0001122
narrower: https://homosaurus.org/v3/homoit0002375

Police raids
type: Concept
issued: 2019-05-14
modified: 2025-02-23
replaces: policeRaids
comment: Unexpected and unannounced entry into and searches of residences or establishments by law enforcement officers with the aim of using surprise to seize evidence or arrest suspects. Police raids may be undertaken legally using a search warrant or through exigent circumstances, such as probable cause, though the latter is highly subjective and civilians often have little resources to appeal illegal raids.
alternative label: Dawn raids
alternative label: No-knock raids
broader: https://homosaurus.org/v3/homoit0001121
change note: Version 3.7.0
has top concept: Harassment
in scheme: v3
narrower: https://homosaurus.org/v3/homoit0002381
related: https://homosaurus.org/v3/homoit0001119

Polyamory
type: Concept
issued: 2019-05-14
modified: 2025-02-23
replaces: polyamory
comment: Practice of engaging in romantic, sexual, or play relationships with more than one person simultaneously, with the knowledge and consent of all parties involved.
broader: https://homosaurus.org/v3/homoit0001651
change note: Version 3.7.0
has top concept: Relationship orientation
in scheme: v3
narrower: https://homosaurus.org/v3/homoit0001554
narrower: https://homosaurus.org/v3/homoit0001629
narrower: https://homosaurus.org/v3/homoit0001662
related: https://homosaurus.org/v3/homoit0000302
related: https://homosaurus.org/v3/homoit0000603
related: https://homosaurus.org/v3/homoit0001124
related: https://homosaurus.org/v3/homoit0001295
related: https://homosaurus.org/v3/homoit0001558
related: https://homosaurus.org/v3/homoit0001645
related: https://homosaurus.org/v3/homoit0001649
related: https://homosaurus.org/v3/homoit0001657
related: https://homosaurus.org/v3/homoit0001661
related: https://homosaurus.org/v3/homoit0001663
related: https://homosaurus.org/v3/homoit0001664
related: https://homosaurus.org/v3/homoit0002255

Polygamy
type: Concept
issued: 2019-05-14
modified: 2025-02-23
replaces: polygamy
comment: The practice of engaging in romantic, sexual, or play relationships where the dominant partner has multiple spouses, though these marriages are not always recognized by law or within society.
broader: https://homosaurus.org/v3/homoit0001081
broader: https://homosaurus.org/v3/homoit0001302
change note: Version 3.7.0
has top concept: Sexual preference
in scheme: v3
related: https://homosaurus.org/v3/homoit0000302
related: https://homosaurus.org/v3/homoit0000603
related: https://homosaurus.org/v3/homoit0001123
related: https://homosaurus.org/v3/homoit0001295
related: https://homosaurus.org/v3/homoit0002255

Poppers
type: Concept
issued: 2019-05-14
modified: 2025-02-23
replaces: poppers
comment: A slang term commonly used in LGBTQ+ subcultures to describe alkyl nitrites, a class of drug that produces a high when inhaled. Poppers are often associated with gay nightlife because they can be used to facilitate anal sex by relaxining the anal muscles.
alternative label: Tape head cleaner
broader: https://homosaurus.org/v3/homoit0001317
change note: Version 3.7.0
has top concept: LGBTQ+ slang
in scheme: v3
related: https://homosaurus.org/v3/homoit0000380

Porn industry
type: Concept
issued: 2019-05-14
modified: 2025-02-23
replaces: pornIndustry
comment: Businesses that sell pornography, or materials intended for sexual arousal, including images, videos, literature, etc.
alternative label: Porno industry
alternative label: Pornography industry
broader: https://homosaurus.org/v3/homoit0000011
change note: Version 3.7.0
has top concept: Sex industry
in scheme: v3
related: https://homosaurus.org/v3/homoit0000013
related: https://homosaurus.org/v3/homoit0000923

Porn stars
type: Concept
issued: 2019-05-14
modified: 2025-02-23
replaces: pornStars
comment: Actors in erotic or sexually explicit films.
alternative label: Pornographic actors
alternative label: Pornstars
alternative label: Porn actresses
alternative label: Adult entertainers
broader: https://homosaurus.org/v3/homoit0003758
change note: Version 3.7.0
has top concept: Sex workers
in scheme: v3
narrower: https://homosaurus.org/v3/homoit0003798
related: https://homosaurus.org/v3/homoit0000494
related: https://homosaurus.org/v3/homoit0001128

Pornography
type: Concept
issued: 2019-05-14
modified: 2025-02-23
replaces: pornography
comment: Printed or visual materials that explicitly depict sexual acts.
broader: https://homosaurus.org/v3/homoit0000011
change note: Version 3.7.0
has top concept: Sex industry
in scheme: v3
narrower: https://homosaurus.org/v3/homoit0002172
narrower: https://homosaurus.org/v3/homoit0003802
related: https://homosaurus.org/v3/homoit0000403
related: https://homosaurus.org/v3/homoit0001127
related: https://homosaurus.org/v3/homoit0001281
related: https://homosaurus.org/v3/homoit0003127
related: https://homosaurus.org/v3/homoit0003128

Post-operative
type: Concept
issued: 2019-05-14
modified: 2025-02-23
replaces: postOperative
comment: Individuals who have recently undergone a surgical operation; commonly used to describe trans people who have undergone gender affirming surgery.
broader: https://homosaurus.org/v3/homoit0001464
change note: Version 3.7.0
has top concept: Transitioning (Gender)
in scheme: v3
related: https://homosaurus.org/v3/homoit0000561
related: https://homosaurus.org/v3/homoit0001378
related: https://homosaurus.org/v3/homoit0001381

PrEP
type: Concept
issued: 2019-05-14
modified: 2025-02-23
replaces: prep
comment: Medication taken to prevent the contraction of HIV.
alternative label: Pre-exposure prophylaxis
broader: https://homosaurus.org/v3/homoit0001007
change note: Version 3.7.0
has top concept: Medical care
in scheme: v3
related: https://homosaurus.org/v3/homoit0000005

Pre-operative
type: Concept
issued: 2019-05-14
modified: 2025-02-23
replaces: preOperative
comment: The medical status of individuals who plan to undertake a surgical procedure but have not yet done so. Commonly used to describe trans people who have not yet undergone gender affirming surgery but plan to do so.
broader: https://homosaurus.org/v3/homoit0001464
change note: Version 3.7.0
has top concept: Transitioning (Gender)
in scheme: v3
related: https://homosaurus.org/v3/homoit0000561
related: https://homosaurus.org/v3/homoit0001378
related: https://homosaurus.org/v3/homoit0001381

Progestin induced virilization
type: Concept
issued: 2019-05-14
modified: 2025-02-23
replaces: progestinInducedVirilization
comment: People born with progestin-induced virilization have XX chromosomes and may have visible genital variations at birth such as a larger-than-typical clitoris, sometimes also with fused or partially fused labia. They usually have a typical uterus, ovaries, and fallopian tubes, though their vagina may or may not have differences. This variation develops in utero as a result of the individual's parent taking progestin medication while pregnant. Being exposed to these additional hormones before birth can change how someone’s genitals develop, but it generally will not change how their own body will produce or respond to hormones later on. This means that someone born with progestin-induced virilization will usually develop features associated with a typical estrogen puberty.
broader: https://homosaurus.org/v3/homoit0000669
change note: Version 3.7.0
has top concept: Sex (Body)
in scheme: v3

LGBTQ+ Protestants
type: Concept
issued: 2019-05-14
modified: 2025-02-23
replaces: protestantsLGBTQ
comment: LGBTQ+ people who are members of the Protestant Church.
alternative label: Protestants (LGBTQ)
broader: https://homosaurus.org/v3/homoit0000265
change note: Version 3.7.0
has top concept: LGBTQ+ religious people
in scheme: v3
narrower: https://homosaurus.org/v3/homoit0000048
narrower: https://homosaurus.org/v3/homoit0000097
narrower: https://homosaurus.org/v3/homoit0000179
narrower: https://homosaurus.org/v3/homoit0000237
narrower: https://homosaurus.org/v3/homoit0000526
narrower: https://homosaurus.org/v3/homoit0000770
narrower: https://homosaurus.org/v3/homoit0000926
narrower: https://homosaurus.org/v3/homoit0001202
narrower: https://homosaurus.org/v3/homoit0001439
narrower: https://homosaurus.org/v3/homoit0002978
narrower: https://homosaurus.org/v3/homoit0002984

Puberty blockers
type: Concept
issued: 2019-05-14
modified: 2025-02-23
replaces: pubertyBlockers
comment: Group of medications used to inhibit puberty.
broader: https://homosaurus.org/v3/homoit0000650
broader: https://homosaurus.org/v3/homoit0001007
change note: Version 3.7.0
has top concept: Medical care
in scheme: v3
related: https://homosaurus.org/v3/homoit0001400

Bathroom bans
type: Concept
issued: 2019-05-14
modified: 2025-02-23
replaces: publicBathroomBills
comment: Laws or policies instituted to prevent trans and non-binary individuals from using public bathrooms and facilities, such as locker rooms, shower rooms, changing rooms, and other sex-segregated spaces, on the basis of their gender identity.
alternative label: Changing room bans
alternative label: Locker room bans
alternative label: Restroom bans
broader: https://homosaurus.org/v3/homoit0003499
change note: Version 3.7.0
has top concept: Law
in scheme: v3
related: https://homosaurus.org/v3/homoit0000248
related: https://homosaurus.org/v3/homoit0000975
related: https://homosaurus.org/v3/homoit0001140
related: https://homosaurus.org/v3/homoit0001141
related: https://homosaurus.org/v3/homoit0001143

Public bathrooms
type: Concept
issued: 2019-05-14
modified: 2025-02-23
replaces: publicBathrooms
comment: Rooms or small buildings with one or more toilets (or urinals) available for use by the general public or by customers or employees of a business.
alternative label: Public restrooms
alternative label: Toilets
broader: https://homosaurus.org/v3/homoit0001141
change note: Version 3.7.0
has top concept: Public facilities
in scheme: v3
narrower: https://homosaurus.org/v3/homoit0000595
related: https://homosaurus.org/v3/homoit0000062
related: https://homosaurus.org/v3/homoit0000308
related: https://homosaurus.org/v3/homoit0001090
related: https://homosaurus.org/v3/homoit0001139
related: https://homosaurus.org/v3/homoit0001358

Public sex
type: Concept
issued: 2019-05-14
modified: 2025-02-23
replaces: publicSex
comment: Sex in public places such as beaches, parks, cottages, etc.
broader: https://homosaurus.org/v3/homoit0001299
change note: Version 3.7.0
has top concept: Sexual practices
in scheme: v3
related: https://homosaurus.org/v3/homoit0000309
related: https://homosaurus.org/v3/homoit0000319
related: https://homosaurus.org/v3/homoit0000412
related: https://homosaurus.org/v3/homoit0000475
related: https://homosaurus.org/v3/homoit0000900
related: https://homosaurus.org/v3/homoit0000974
related: https://homosaurus.org/v3/homoit0001257
related: https://homosaurus.org/v3/homoit0001306
related: https://homosaurus.org/v3/homoit0001357

Public showers
type: Concept
issued: 2019-05-14
modified: 2025-02-23
replaces: publicShowers
comment: Public or commercial facilities equipped with showers or places to bathe.
broader: https://homosaurus.org/v3/homoit0001141
change note: Version 3.7.0
has top concept: Public facilities
in scheme: v3
related: https://homosaurus.org/v3/homoit0001139

Pups (Roleplay)
type: Concept
issued: 2019-05-14
modified: 2025-02-23
replaces: pups
comment: Individuals who take on the pup or puppy role in puppy play, a form of animal roleplay that is often but not always associated with BDSM and kink communities.
alternative label: Puppers
alternative label: Puppies
broader: https://homosaurus.org/v3/homoit0000487
broader: https://homosaurus.org/v3/homoit0000506
broader: https://homosaurus.org/v3/homoit0000705
broader: https://homosaurus.org/v3/homoit0001242
broader: https://homosaurus.org/v3/homoit0001295
change note: Version 3.7.0
has top concept: Subcultures
in scheme: v3
related: https://homosaurus.org/v3/homoit0000105
related: https://homosaurus.org/v3/homoit0000568
related: https://homosaurus.org/v3/homoit0001063
related: https://homosaurus.org/v3/homoit0003083
related: https://homosaurus.org/v3/homoit0003086

Queer people of color
type: Concept
issued: 2019-05-14
modified: 2025-02-23
replaces: queerPeopleOfColour
comment: Primarily used in the United States, this term refers to queer people who are not white and who identify as people of color.
alternative label: QPOC
broader: https://homosaurus.org/v3/homoit0001101
change note: Version 3.7.0
has top concept: LGBTQ+ people
in scheme: v3
preferred label: Queer people of colour

Quariwarmi
type: Concept
issued: 2019-05-14
modified: 2025-02-23
replaces: quariwarmi
comment: North American Inca term for people assigned male at birth who fulfill a third gender role that is often spiritual in nature.
broader: https://homosaurus.org/v3/homoit0000322
change note: Version 3.7.0
has top concept: Gender
in scheme: v3
related: https://homosaurus.org/v3/homoit0001480

Queens (Gay culture)
type: Concept
issued: 2019-05-14
modified: 2025-02-23
replaces: queens
comment: Slang term for effeminate gay men; predominantly used in the United States.
alternative label: Queens
broader: https://homosaurus.org/v3/homoit0000487
broader: https://homosaurus.org/v3/homoit0000506
change note: Version 3.7.0
has top concept: Subcultures
in scheme: v3
narrower: https://homosaurus.org/v3/homoit0000375
related: https://homosaurus.org/v3/homoit0000568
related: https://homosaurus.org/v3/homoit0001313

Queer activism
type: Concept
issued: 2019-05-14
modified: 2025-02-23
replaces: queerActivism
comment: Direct action and organizing to achieve political or social change and acceptance for queer people.
broader: https://homosaurus.org/v3/homoit0000006
change note: Version 3.7.0
has top concept: LGBTQ+ activism
in scheme: v3
related: https://homosaurus.org/v3/homoit0001198

African American queer people
type: Concept
issued: 2019-05-14
modified: 2025-02-23
replaces: queerAfricanAmericans
comment: Queer people of African descent born in the United States or queer people born in African countries who live in or have a strong connection to the United States. Use for individuals who self-identity as African American. Follow the individual’s preference for African American or Black whenever possible.
alternative label: Queer African American people
alternative label: Queer African Americans
broader: https://homosaurus.org/v3/homoit0000015
change note: Version 3.7.0
has top concept: LGBTQ+ people
in scheme: v3

Afro-Canadian queer people
type: Concept
issued: 2019-05-14
modified: 2025-02-23
replaces: queerAfroCanadians
comment: Queer people of African descent born in Canada or queer people born in African countries who live in or have a strong connection to Canada. Use for individuals who self-identify as Afro-Canadian.
alternative label: Queer Afro-Canadian people
alternative label: Queer Afro-Canadians
broader: https://homosaurus.org/v3/homoit0000016
change note: Version 3.7.0
has top concept: LGBTQ+ people
in scheme: v3

Afro-Caribbean queer people
type: Concept
issued: 2019-05-14
modified: 2025-02-23
replaces: queerAfroCaribbeans
comment: Queer people of African descent born in the Caribbean or queer people born in African countries who live in or have a strong connection to the Caribbean. Only use for individuals who self-identify as Afro-Caribbean.
alternative label: Queer Afro-Caribbean people
alternative label: Queer Afro-Caribbeans
broader: https://homosaurus.org/v3/homoit0000017
change note: Version 3.7.0
has top concept: LGBTQ+ people
in scheme: v3

Afro-European queer people
type: Concept
issued: 2019-05-14
modified: 2025-02-23
replaces: queerAfroEuropeans
comment: Queer people of African descent born in European countries or queer people born in African countries who live in or have a strong connection to Europe. Only use for individuals who self-identify as Afro-European.
alternative label: Queer Afro-European people
alternative label: Queer Afro-Europeans
broader: https://homosaurus.org/v3/homoit0000018
change note: Version 3.7.0
has top concept: LGBTQ+ people
in scheme: v3

Afro-Latin American queer people
type: Concept
issued: 2019-05-14
modified: 2025-02-23
replaces: queerAfroLatinAmericans
comment: Queer people of African descent born in Latin American countries or queer people born in African countries who live in or have a strong connection to Latin America. Only use for individuals who self-identify as Afro-Latin American.
alternative label: Queer Afro-Latin American people
alternative label: Queer Afro-Latin Americans
broader: https://homosaurus.org/v3/homoit0000019
change note: Version 3.7.0
has top concept: LGBTQ+ people
in scheme: v3

Queer archives
type: Concept
issued: 2019-05-14
modified: 2025-02-23
replaces: queerArchives
comment: Collections of records and materials relating to queer people or queer communities; can include a variety of organizations and institutions from community to government archives.
broader: https://homosaurus.org/v3/homoit0000066
change note: Version 3.7.0
has top concept: LGBTQ+ cultural heritage institutions
in scheme: v3
related: https://homosaurus.org/v3/homoit0001149

Queer artists
type: Concept
issued: 2019-05-14
modified: 2025-02-23
replaces: queerArtists
comment: Queer people who practice any of various creative arts.
broader: https://homosaurus.org/v3/homoit0000070
change note: Version 3.7.0
has top concept: LGBTQ+ people
in scheme: v3

Asian American queer people
type: Concept
issued: 2019-05-14
modified: 2025-02-23
replaces: queerAsianAmericans
comment: Queer people of Asian heritage or descent born in the United States or born in Asian countries who live in or have a strong connection to the United States. Only use for individuals who self-identify as Asian American.
alternative label: Queer Asian American people
alternative label: Queer Asian Americans
broader: https://homosaurus.org/v3/homoit0000073
broader: https://homosaurus.org/v3/homoit0001159
change note: Version 3.7.0
has top concept: LGBTQ+ people
in scheme: v3

Asian queer people
type: Concept
issued: 2019-05-14
modified: 2025-02-23
replaces: queerAsians
comment: Queer people of Asian heritage or descent, living in Asia or part of the Asian diaspora. Only use for people who self-identify as Asian.
alternative label: Queer Asian people
alternative label: Queer Asians
broader: https://homosaurus.org/v3/homoit0000074
change note: Version 3.7.0
has top concept: LGBTQ+ people
in scheme: v3
narrower: https://homosaurus.org/v3/homoit0001158

Queer atheists
type: Concept
issued: 2019-05-14
modified: 2025-02-23
replaces: queerAtheists
comment: Queer people who are atheists.
broader: https://homosaurus.org/v3/homoit0000082
change note: Version 3.7.0
has top concept: LGBTQ+ people
in scheme: v3

Queer bars
type: Concept
issued: 2019-05-14
modified: 2025-02-23
replaces: queerBars
comment: Drinking establishments that primarily cater to queer people.
broader: https://homosaurus.org/v3/homoit0000100
change note: Version 3.7.0
has top concept: LGBTQ+ meeting places
in scheme: v3
related: https://homosaurus.org/v3/homoit0001170

Queer beaches
type: Concept
issued: 2019-05-14
modified: 2025-02-23
replaces: queerBeaches
comment: Beaches set aside for use by queer people or beaches known to be frequented by queer people.
broader: https://homosaurus.org/v3/homoit0000104
change note: Version 3.7.0
has top concept: LGBTQ+ meeting places
in scheme: v3

Black queer people
type: Concept
issued: 2019-05-14
modified: 2025-02-23
replaces: queerBlackPeople
comment: Black people who are queer. Use only for individuals who self-identity as Black. Follow the individual’s preference for African American or Black whenever possible.
alternative label: Queer Black people
broader: https://homosaurus.org/v3/homoit0000208
change note: Version 3.7.0
has top concept: LGBTQ+ people
in scheme: v3
related: https://homosaurus.org/v3/homoit0003608

Queer bookshops
type: Concept
issued: 2019-05-14
modified: 2025-02-23
replaces: queerBookshops
comment: Bookshops that sell materials intended for use by queer people or addressing topics related to queerness.
broader: https://homosaurus.org/v3/homoit0000216
change note: Version 3.7.0
has top concept: LGBTQ+ bookshops
in scheme: v3

Queer Buddhists
type: Concept
issued: 2019-05-14
modified: 2025-02-23
replaces: queerBuddhists
comment: Queer people who are Buddhist.
broader: https://homosaurus.org/v3/homoit0000225
change note: Version 3.7.0
has top concept: LGBTQ+ religious people
in scheme: v3

Queer characters
type: Concept
issued: 2019-05-14
modified: 2025-02-23
replaces: queerCharacters
comment: Characters in creative works who are queer.
broader: https://homosaurus.org/v3/homoit0000249
change note: Version 3.7.0
has top concept: LGBTQ+ characters
in scheme: v3
related: https://homosaurus.org/v3/homoit0001167
related: https://homosaurus.org/v3/homoit0001195

Queer children
type: Concept
issued: 2019-05-14
modified: 2025-02-23
replaces: queerChildren
comment: Queer people who have not yet reached the age of adolescence.
broader: https://homosaurus.org/v3/homoit0000256
broader: https://homosaurus.org/v3/homoit0001215
change note: Version 3.7.0
has top concept: Family members
in scheme: v3
related: https://homosaurus.org/v3/homoit0001166
related: https://homosaurus.org/v3/homoit0001178

Queer Christians
type: Concept
issued: 2019-05-14
modified: 2025-02-23
replaces: queerChristians
comment: Queer people who are Christian.
broader: https://homosaurus.org/v3/homoit0000265
change note: Version 3.7.0
has top concept: LGBTQ+ religious people
in scheme: v3

Queer clergy
type: Concept
issued: 2019-05-14
modified: 2025-02-23
replaces: queerClergy
comment: Queer people who are ordained for religious duties, particularly in the Christian Church.
broader: https://homosaurus.org/v3/homoit0001624
change note: Version 3.7.0
has top concept: LGBTQ+ clergy
in scheme: v3
related: https://homosaurus.org/v3/homoit0000142
related: https://homosaurus.org/v3/homoit0000244
related: https://homosaurus.org/v3/homoit0000484
related: https://homosaurus.org/v3/homoit0000732
related: https://homosaurus.org/v3/homoit0001402

Queer community
type: Concept
issued: 2019-05-14
modified: 2025-02-23
replaces: queerCommunity
comment: Groups of people who share the experience of being queer.
broader: https://homosaurus.org/v3/homoit0000297
change note: Version 3.7.0
has top concept: LGBTQ+ communities
in scheme: v3
related: https://homosaurus.org/v3/homoit0000806
related: https://homosaurus.org/v3/homoit0000807
related: https://homosaurus.org/v3/homoit0000882
related: https://homosaurus.org/v3/homoit0001161
related: https://homosaurus.org/v3/homoit0001789
related: https://homosaurus.org/v3/homoit0003193

Queer community centers
type: Concept
issued: 2019-05-14
modified: 2025-02-23
replaces: queerCommunityCentres
comment: Spaces in which people from queer communities meet for social, education, recreational, or organizing activities.
broader: https://homosaurus.org/v3/homoit0000298
change note: Version 3.7.0
has top concept: LGBTQ+ centers
in scheme: v3
preferred label: Queer community centres

Queer couples
type: Concept
issued: 2019-05-14
modified: 2025-02-23
replaces: queerCouples
comment: Partnerships in which both people are queer.
broader: https://homosaurus.org/v3/homoit0000310
change note: Version 3.7.0
has top concept: LGBTQ+ relationships
in scheme: v3

Queer daughters
type: Concept
issued: 2019-05-14
modified: 2025-02-23
replaces: queerDaughters
comment: Daughters who identify as queer.
broader: https://homosaurus.org/v3/homoit0000330
change note: Version 3.7.0
has top concept: LGBTQ+ people
in scheme: v3

Queer drama
type: Concept
issued: 2019-05-14
modified: 2025-02-23
replaces: queerDrama
comment: Works of fiction written to be performed; use in reference to dramatic works focusing on queer characters or themes.
broader: https://homosaurus.org/v3/homoit0000376
change note: Version 3.7.0
has top concept: Subcultures
in scheme: v3
related: https://homosaurus.org/v3/homoit0001728

Queer dominatrices
type: Concept
issued: 2019-05-14
modified: 2025-02-23
replaces: queerDominatrices
comment: Women who take a dominant role in BDSM activities; use for dominatrices who identify as queer.
broader: https://homosaurus.org/v3/homoit0000363
change note: Version 3.7.0
has top concept: Relationship minorities
in scheme: v3
related: https://homosaurus.org/v3/homoit0000148
related: https://homosaurus.org/v3/homoit0000738
related: https://homosaurus.org/v3/homoit0001410

Queer families
type: Concept
issued: 2019-05-14
modified: 2025-02-23
replaces: queerFamilies
comment: Families, whether biological, adoptive, or chosen, in which one or more individuals identify as queer.
broader: https://homosaurus.org/v3/homoit0000420
change note: Version 3.7.0
has top concept: LGBTQ+ families
in scheme: v3
related: https://homosaurus.org/v3/homoit0000262
related: https://homosaurus.org/v3/homoit0000914
related: https://homosaurus.org/v3/homoit0001195
related: https://homosaurus.org/v3/homoit0002583
related: https://homosaurus.org/v3/homoit0002588

Queer fiction
type: Concept
issued: 2019-05-14
modified: 2025-02-23
replaces: queerFiction
comment: Written works that describe imagined events or people; use in reference to fictional works focusing on queer characters or themes.
broader: https://homosaurus.org/v3/homoit0000443
change note: Version 3.7.0
has top concept: Subcultures
in scheme: v3
related: https://homosaurus.org/v3/homoit0001728
related: https://homosaurus.org/v3/homoit0001752
related: https://homosaurus.org/v3/homoit0001753
related: https://homosaurus.org/v3/homoit0001754
related: https://homosaurus.org/v3/homoit0002193

Queer identity
type: Concept
issued: 2019-05-14
modified: 2025-02-23
replaces: queerIdentity
comment: Identity term that can be used to describe several not-necessarily-mutually-exclusive understandings of queerness. Queerness can describe identities that exist outside of or between different identities, and also identities that actively resist normative understandings of sexuality and/or gender. This term should only be used for those who self-identify as queer.
broader: https://homosaurus.org/v3/homoit0001295
change note: Version 3.7.0
has top concept: Sexual identity
in scheme: v3
related: https://homosaurus.org/v3/homoit0001167
related: https://homosaurus.org/v3/homoit0001195

Queer information centers
type: Concept
issued: 2019-05-14
modified: 2025-02-23
replaces: queerInformationCentres
comment: Institutions that provide education, support, and information about queerness and queer communities to queer people.
broader: https://homosaurus.org/v3/homoit0000660
change note: Version 3.7.0
has top concept: LGBTQ+ centers
in scheme: v3
preferred label: Queer information centres
related: https://homosaurus.org/v3/homoit0001187

Jewish queer people
type: Concept
issued: 2019-05-14
modified: 2025-02-23
replaces: queerJews
comment: Queer people who are Jewish.
alternative label: Jewish queers
alternative label: Queer Jews
broader: https://homosaurus.org/v3/homoit0000682
change note: Version 3.7.0
has top concept: LGBTQ+ people
in scheme: v3

Latino/a/x queer people
type: Concept
issued: 2019-05-14
modified: 2025-02-23
replaces: queerLatinx
comment: Latin American people who are queer; only use to describe individuals who self-identify as Latino, Latina, or Latinx. Do not conflate with Chicano/a/x or Hispanic.
alternative label: Latina queer people
alternative label: Latine queer people
alternative label: Latino queer people
alternative label: Latinx queer people
alternative label: Queer Latinas
alternative label: Queer Latine people
alternative label: Queer Latinos
alternative label: Queer Latinx people
broader: https://homosaurus.org/v3/homoit0000253
change note: Version 3.7.0
has top concept: LGBTQ+ people
in scheme: v3

Queer libraries
type: Concept
issued: 2019-05-14
modified: 2025-02-23
replaces: queerLibraries
comment: Libraries that hold materials primarily pertaining to queer people or intended for use by queer people.
broader: https://homosaurus.org/v3/homoit0000968
change note: Version 3.7.0
has top concept: LGBTQ+ cultural heritage institutions
in scheme: v3

Queer literature
type: Concept
issued: 2019-05-14
modified: 2025-02-23
replaces: queerLiterature
comment: Written literary works about queerness, queer characters, or queer themes.
broader: https://homosaurus.org/v3/homoit0000972
change note: Version 3.7.0
has top concept: Subcultures
in scheme: v3
related: https://homosaurus.org/v3/homoit0001728

Queer dominants
type: Concept
issued: 2019-05-14
modified: 2025-02-23
replaces: queerMasters
comment: Queer people who are part of the BDSM scene and assume the dominant role in sexual relationships with a dominant/submissive dynamic.
alternative label: Queer masters
broader: https://homosaurus.org/v3/homoit0000999
change note: Version 3.7.0
has top concept: Sexual identity
in scheme: v3

Queer men
type: Concept
issued: 2019-05-14
modified: 2025-02-23
replaces: queerMen
comment: Men who identify as queer.
broader: https://homosaurus.org/v3/homoit0001195
change note: Version 3.7.0
has top concept: LGBTQ+ people
in scheme: v3
related: https://homosaurus.org/v3/homoit0000160
related: https://homosaurus.org/v3/homoit0000506

Queer mistresses
type: Concept
issued: 2019-05-14
modified: 2025-02-23
replaces: queerMistresses
comment: Queer women who are part of the BDSM scene and assume the mistress role in sexual relationships with a mistress/submissive dynamic.
broader: https://homosaurus.org/v3/homoit0001018
change note: Version 3.7.0
has top concept: Sexual identity
in scheme: v3
related: https://homosaurus.org/v3/homoit0000161
related: https://homosaurus.org/v3/homoit0000751
related: https://homosaurus.org/v3/homoit0001421

Queer movement
type: Concept
issued: 2019-05-14
modified: 2025-02-23
replaces: queerMovement
comment: Umbrella term for activism focused on the rights of queer people and issues faced by queer communities.
broader: https://homosaurus.org/v3/homoit0001026
change note: Version 3.7.0
has top concept: Social movements
in scheme: v3
related: https://homosaurus.org/v3/homoit0001179

Queer museums
type: Concept
issued: 2019-05-14
modified: 2025-02-23
replaces: queerMuseums
comment: Institutions dedicated to the storage, exhibition, conservation, and preservation of materials relating to queerness, queer people, or queer history.
broader: https://homosaurus.org/v3/homoit0001030
change note: Version 3.7.0
has top concept: LGBTQ+ cultural heritage institutions
in scheme: v3

Queer Muslims
type: Concept
issued: 2019-05-14
modified: 2025-02-23
replaces: queerMuslims
comment: Queer people who are Muslim.
broader: https://homosaurus.org/v3/homoit0001032
change note: Version 3.7.0
has top concept: LGBTQ+ religious people
in scheme: v3

Native American queer people
type: Concept
issued: 2019-05-14
modified: 2025-02-23
replaces: queerNativeAmericans
comment: People who are part of the Native peoples of the continental United States and Canada (excluding Inuit people) and self-identity as queer. Use more specific terms when available.
alternative label: American Indian queer people
alternative label: Queer American Indians
alternative label: Queer Native Americans
broader: https://homosaurus.org/v3/homoit0001037
change note: Version 3.7.0
has top concept: LGBTQ+ people
in scheme: v3

Queer newsletters
type: Concept
issued: 2019-05-14
modified: 2025-02-23
replaces: queerNewsletters
comment: Serialized print or digital periodicals created by or for queer people, often with the purpose of sharing news and information related to queer communities and queer issues.
broader: https://homosaurus.org/v3/homoit0001041
change note: Version 3.7.0
has top concept: LGBTQ+ press
in scheme: v3

Queer newspapers
type: Concept
issued: 2019-05-14
modified: 2025-02-23
replaces: queerNewspapers
comment: Serialized print or digital publications about queer people or queer issues (and typically produced by queer people or queer organizations) that contain news, articles, columns, correspondence, and advertisements.
broader: https://homosaurus.org/v3/homoit0001042
change note: Version 3.7.0
has top concept: LGBTQ+ press
in scheme: v3

Queer Pagans
type: Concept
issued: 2019-05-14
modified: 2025-02-23
replaces: queerPagans
comment: Queer people who are members of polytheistic religions or other religions outside of the dominant culture that typically incorporate nature worship and/or the sacred feminine, such as Wicca, Druidry, Heathenry, etc. Use to describe queer people who self-identify as Pagan.
broader: https://homosaurus.org/v3/homoit0001069
change note: Version 3.7.0
has top concept: LGBTQ+ religious people
in scheme: v3
related: https://homosaurus.org/v3/homoit0001912

Queer parents
type: Concept
issued: 2019-05-14
modified: 2025-02-23
replaces: queerParents
comment: Queer people who are parents.
broader: https://homosaurus.org/v3/homoit0001075
change note: Version 3.7.0
has top concept: LGBTQ+ families
in scheme: v3
related: https://homosaurus.org/v3/homoit0000262
related: https://homosaurus.org/v3/homoit0001195
related: https://homosaurus.org/v3/homoit0002583

Queer people
type: Concept
issued: 2019-05-14
modified: 2025-02-23
replaces: queerPeople
comment: Individuals who identify with non-normative gender and/or sexual identities, typically people who are not heterosexual and/or are not cisgender. Only use for people who identify as queer.
broader: https://homosaurus.org/v3/homoit0000108
broader: https://homosaurus.org/v3/homoit0000915
broader: https://homosaurus.org/v3/homoit0001559
change note: Version 3.7.0
has top concept: LGBTQ+ people
in scheme: v3
narrower: https://homosaurus.org/v3/homoit0000582
narrower: https://homosaurus.org/v3/homoit0001185
narrower: https://homosaurus.org/v3/homoit0001215
narrower: https://homosaurus.org/v3/homoit0001220
narrower: https://homosaurus.org/v3/homoit0001227
narrower: https://homosaurus.org/v3/homoit0001785
narrower: https://homosaurus.org/v3/homoit0001809
narrower: https://homosaurus.org/v3/homoit0003044
related: https://homosaurus.org/v3/homoit0001077
related: https://homosaurus.org/v3/homoit0001106
related: https://homosaurus.org/v3/homoit0001166
related: https://homosaurus.org/v3/homoit0001176
related: https://homosaurus.org/v3/homoit0001178
related: https://homosaurus.org/v3/homoit0001194
related: https://homosaurus.org/v3/homoit0001229
related: https://homosaurus.org/v3/homoit0001921
related: https://homosaurus.org/v3/homoit0002193
related: https://homosaurus.org/v3/homoit0002577
related: https://homosaurus.org/v3/homoit0002588
related: https://homosaurus.org/v3/homoit0003823

Queer people in the military
type: Concept
issued: 2019-05-14
modified: 2025-02-23
replaces: queerPeopleInTheMilitary
comment: Queer people serving in state and national armed forces.
broader: https://homosaurus.org/v3/homoit0001100
change note: Version 3.7.0
has top concept: Legal status
in scheme: v3

Queer poetry
type: Concept
issued: 2019-05-14
modified: 2025-02-23
replaces: queerPoetry
comment: Literary works, typically written in verse, that focus on queer characters, themes, or identity.
broader: https://homosaurus.org/v3/homoit0001118
change note: Version 3.7.0
has top concept: Subcultures
in scheme: v3
related: https://homosaurus.org/v3/homoit0001728

Queer political activists
type: Concept
issued: 2019-05-14
modified: 2025-02-23
replaces: queerPoliticalActivists
comment: Queer people working to bring about political or social change through public organizing.
broader: https://homosaurus.org/v3/homoit0000007
change note: Version 3.7.0
has top concept: LGBTQ+ people
in scheme: v3
related: https://homosaurus.org/v3/homoit0001150

Queer porn films
type: Concept
issued: 2019-05-14
modified: 2025-02-23
replaces: queerPornFilms
comment: Erotic or sexually explicit films featuring queer people.
broader: https://homosaurus.org/v3/homoit0000013
broader: https://homosaurus.org/v3/homoit0002611
change note: Version 3.7.0
has top concept: Subcultures
in scheme: v3
related: https://homosaurus.org/v3/homoit0002550

Queer press
type: Concept
issued: 2019-05-14
modified: 2025-02-23
replaces: queerPress
comment: Newspapers, magazines, or other publishing outlets aimed at queer audiences and/or operated by queer people.
broader: https://homosaurus.org/v3/homoit0001132
change note: Version 3.7.0
has top concept: LGBTQ+ press
in scheme: v3
narrower: https://homosaurus.org/v3/homoit0003154

Queer sex workers
type: Concept
issued: 2019-05-14
modified: 2025-02-23
replaces: queerProstitutes
comment: Queer people who receive money or goods in exchange for sexual services, performances, or companionship. Use to describe queer people working across the broad spectrum of sex work.
alternative label: Queer prostitutes
alternative label: Queer prostitution
alternative label: Queer sex work
broader: https://homosaurus.org/v3/homoit0001277
change note: Version 3.7.0
has top concept: Sex workers
in scheme: v3

Queer Protestants
type: Concept
issued: 2019-05-14
modified: 2025-02-23
replaces: queerProtestants
comment: Queer people who are members of the Protestant Church.
broader: https://homosaurus.org/v3/homoit0001137
change note: Version 3.7.0
has top concept: LGBTQ+ religious people
in scheme: v3

Queer publishers
type: Concept
issued: 2019-05-14
modified: 2025-02-23
replaces: queerPublishers
comment: Companies and organizations that publish materials for queer communities or addressing queer issues.
broader: https://homosaurus.org/v3/homoit0001144
change note: Version 3.7.0
has top concept: LGBTQ+ publishers
in scheme: v3

Queer radio
type: Concept
issued: 2019-05-14
modified: 2025-02-23
replaces: queerRadio
comment: Auditory content broadcast on the radio (analog or digital) about queer people and queer issues.
broader: https://homosaurus.org/v3/homoit0001231
change note: Version 3.7.0
has top concept: LGBTQ+ radio
in scheme: v3

Queer relationships
type: Concept
issued: 2019-05-14
modified: 2025-02-23
replaces: queerRelationships
comment: Ongoing connections (romantic, sexual, or platonic) between two or more queer people.
broader: https://homosaurus.org/v3/homoit0001237
broader: https://homosaurus.org/v3/homoit0003826
change note: Version 3.7.0
has top concept: LGBTQ+ relationships
in scheme: v3
related: https://homosaurus.org/v3/homoit0000182
related: https://homosaurus.org/v3/homoit0000529
related: https://homosaurus.org/v3/homoit0000773
related: https://homosaurus.org/v3/homoit0001442

Queer rights
type: Concept
issued: 2019-05-14
modified: 2025-02-23
replaces: queerRights
comment: Legal, social, or ethical principles of freedom or entitlement held by queer people.
broader: https://homosaurus.org/v3/homoit0000276
change note: Version 3.7.0
has top concept: Human rights
in scheme: v3

Queer Roman Catholics
type: Concept
issued: 2019-05-14
modified: 2025-02-23
replaces: queerRomanCatholics
comment: Queer people who are members of the Roman Catholic Church.
broader: https://homosaurus.org/v3/homoit0001244
change note: Version 3.7.0
has top concept: LGBTQ+ religious people
in scheme: v3

Queer slang
type: Concept
issued: 2019-05-14
modified: 2025-02-23
replaces: queerSlang
comment: Colloquial or informal language related to queer people or used by queer people.
broader: https://homosaurus.org/v3/homoit0001317
change note: Version 3.7.0
has top concept: LGBTQ+ slang
in scheme: v3
related: https://homosaurus.org/v3/homoit0001559

Queer sons
type: Concept
issued: 2019-05-14
modified: 2025-02-23
replaces: queerSons
comment: Sons who identify as queer.
broader: https://homosaurus.org/v3/homoit0001329
change note: Version 3.7.0
has top concept: LGBTQ+ people
in scheme: v3

Queer survivors of hate crimes
type: Concept
issued: 2019-05-14
modified: 2025-02-23
replaces: queerSurvivorsOfHateCrimes
comment: Queer people who have experienced and survived hate crimes; follow the individual's preference for "victims" or "survivors" whenever possible.
broader: https://homosaurus.org/v3/homoit0001221
broader: https://homosaurus.org/v3/homoit0001349
change note: Version 3.7.0
has top concept: LGBTQ+ people
in scheme: v3

Queer survivors of rape
type: Concept
issued: 2019-05-14
modified: 2025-02-23
replaces: queerSurvivorsOfRape
comment: Queer people who have experienced and survived rape; follow the individual's preference for "victims" or "survivors" whenever possible.
broader: https://homosaurus.org/v3/homoit0001222
broader: https://homosaurus.org/v3/homoit0001350
change note: Version 3.7.0
has top concept: LGBTQ+ people
in scheme: v3

Queer survivors of sexual abuse
type: Concept
issued: 2019-05-14
modified: 2025-02-23
replaces: queerSurvivorsOfSexualAbuse
comment: Queer people who have experienced and survived sexual abuse; follow the individual's preference for "victims" or "survivors" whenever possible.
broader: https://homosaurus.org/v3/homoit0001223
broader: https://homosaurus.org/v3/homoit0001351
change note: Version 3.7.0
has top concept: LGBTQ+ people
in scheme: v3

Queer survivors of war
type: Concept
issued: 2019-05-14
modified: 2025-02-23
replaces: queerSurvivorsOfWar
comment: Queer people who have experienced and survived war; follow the individual's preference for "victims" or "survivors" whenever possible.
broader: https://homosaurus.org/v3/homoit0001224
broader: https://homosaurus.org/v3/homoit0001352
change note: Version 3.7.0
has top concept: LGBTQ+ people
in scheme: v3

Queer youth
type: Concept
issued: 2019-05-14
modified: 2025-02-23
replaces: queerYouth
comment: Queer people who are between the ages of childhood and adulthood.
alternative label: Queer teenagers
alternative label: Queer adolescents
alternative label: Queer teens
broader: https://homosaurus.org/v3/homoit0001195
broader: https://homosaurus.org/v3/homoit0001521
change note: Version 3.7.0
has top concept: LGBTQ+ people
in scheme: v3
narrower: https://homosaurus.org/v3/homoit0001167
related: https://homosaurus.org/v3/homoit0001228

Queer television
type: Concept
issued: 2019-05-14
modified: 2025-02-23
replaces: queerTelevision
comment: Television shows featuring queer people or queer themes.
broader: https://homosaurus.org/v3/homoit0001359
change note: Version 3.7.0
has top concept: LGBTQ+ television
in scheme: v3

Queer theater
type: Concept
issued: 2019-05-14
modified: 2025-02-23
replaces: queerTheatre
comment: Works in the performance arts that focus on queer characters, communities, or issues.
broader: https://homosaurus.org/v3/homoit0001363
change note: Version 3.7.0
has top concept: LGBTQ+ theater
in scheme: v3
preferred label: Queer theatre

Queer theory
type: Concept
issued: 2019-05-14
modified: 2025-02-23
replaces: queerTheory
comment: Field of critical theory that emerged in the 1990s out of queer studies and women's studies. Queer theory involves the study and theorization of gender and sexual practices and identities that exist outside of heterosexuality and which challenge heteronormativity and essentialism.
broader: https://homosaurus.org/v3/homoit0001365
change note: Version 3.7.0
has top concept: Theories
in scheme: v3
narrower: https://homosaurus.org/v3/homoit0002042
narrower: https://homosaurus.org/v3/homoit0003614
narrower: https://homosaurus.org/v3/homoit0003615
narrower: https://homosaurus.org/v3/homoit0003707
narrower: https://homosaurus.org/v3/homoit0003823
narrower: https://homosaurus.org/v3/homoit0003826
related: https://homosaurus.org/v3/homoit0000115
related: https://homosaurus.org/v3/homoit0000579
related: https://homosaurus.org/v3/homoit0001149
related: https://homosaurus.org/v3/homoit0001210
related: https://homosaurus.org/v3/homoit0001218
related: https://homosaurus.org/v3/homoit0001320

Queer transgender people
type: Concept
issued: 2019-05-14
modified: 2025-02-23
replaces: queerTransgenderPeople
comment: Queer people who identify as transgender.
broader: https://homosaurus.org/v3/homoit0001195
change note: Version 3.7.0
has top concept: LGBTQ+ people
in scheme: v3

Queer victims of hate crimes
type: Concept
issued: 2019-05-14
modified: 2025-02-23
replaces: queerVictimsOfHateCrimes
comment: Queer people who have experienced hate crimes and may or may not have survived; follow the individual's preference for "victims" or "survivors" whenever possible.
broader: https://homosaurus.org/v3/homoit0000613
change note: Version 3.7.0
has top concept: LGBTQ+ people
in scheme: v3
narrower: https://homosaurus.org/v3/homoit0001211

Queer victims of rape
type: Concept
issued: 2019-05-14
modified: 2025-02-23
replaces: queerVictimsOfRape
comment: Queer people who have experienced rape and may or may not have survived; follow the individual's preference for "victims" or "survivors" whenever possible.
broader: https://homosaurus.org/v3/homoit0000958
change note: Version 3.7.0
has top concept: LGBTQ+ people
in scheme: v3
narrower: https://homosaurus.org/v3/homoit0001212

Queer victims of sexual abuse
type: Concept
issued: 2019-05-14
modified: 2025-02-23
replaces: queerVictimsOfSexualAbuse
comment: Queer people who have experienced sexual abuse and may or may not have survived; follow the individual's preference for "victims" or "survivors" whenever possible.
broader: https://homosaurus.org/v3/homoit0000959
change note: Version 3.7.0
has top concept: LGBTQ+ people
in scheme: v3
narrower: https://homosaurus.org/v3/homoit0001213

Queer victims of war
type: Concept
issued: 2019-05-14
modified: 2025-02-23
replaces: queerVictimsOfWar
comment: Queer people who have experienced war and may or may not have survived; follow the individual's preference for "victims" or "survivors" whenever possible.
broader: https://homosaurus.org/v3/homoit0000961
change note: Version 3.7.0
has top concept: LGBTQ+ people
in scheme: v3
narrower: https://homosaurus.org/v3/homoit0001214

Queer victims' rights
type: Concept
issued: 2019-05-14
modified: 2025-02-23
replaces: queerVictimsRights
comment: Queer people’s legal rights to be informed, present, and heard within the criminal justice system after having been harmed or injured as the result of a crime, accident, or other event.
broader: https://homosaurus.org/v3/homoit0001492
change note: Version 3.7.0
has top concept: Law
in scheme: v3

White queer people
type: Concept
issued: 2019-05-14
modified: 2025-02-23
replaces: queerWhitePeople
comment: Queer people who are white.
alternative label: Caucasian queer people
alternative label: Queer Caucasian people
alternative label: Queer white people
broader: https://homosaurus.org/v3/homoit0000243
change note: Version 3.7.0
has top concept: White LGBTQ+ people
in scheme: v3

Queer women
type: Concept
issued: 2019-05-14
modified: 2025-02-23
replaces: queerWomen
comment: Women who identify as queer.
broader: https://homosaurus.org/v3/homoit0001195
change note: Version 3.7.0
has top concept: LGBTQ+ people
in scheme: v3
related: https://homosaurus.org/v3/homoit0000556

Queer youth literature
type: Concept
issued: 2019-05-14
modified: 2025-02-23
replaces: queerYouthLiterature
comment: Written literary works for an audience of readers from 12-18 years of age, also known as young adult literature or YA; use in reference to youth literature focusing on queer characters or themes.
broader: https://homosaurus.org/v3/homoit0001522
change note: Version 3.7.0
has top concept: Subcultures
in scheme: v3
related: https://homosaurus.org/v3/homoit0001215

Queerphobia
type: Concept
issued: 2019-05-14
modified: 2025-02-23
replaces: queerphobia
comment: Antagonism or disgust directed towards queerness as an identity or queer people due to their identity, perceived or actual. Queerphobia can include denial of the existence of queerness, stereotypes, verbal harassment, and physical violence.
broader: https://homosaurus.org/v3/homoit0000920
change note: Version 3.7.0
has top concept: LGBTQ+ phobia
in scheme: v3
narrower: https://homosaurus.org/v3/homoit0002594
related: https://homosaurus.org/v3/homoit0000060
related: https://homosaurus.org/v3/homoit0000061
related: https://homosaurus.org/v3/homoit0000619
related: https://homosaurus.org/v3/homoit0001195

Radical feminism
type: Concept
issued: 2019-05-14
modified: 2025-02-23
replaces: radicalFeminism
comment: Perspective within feminism that calls for a radical reordering of society in which male supremacy is eliminated in all social and economic contexts.
broader: https://homosaurus.org/v3/homoit0000437
change note: Version 3.7.0
has top concept: Feminism
in scheme: v3
related: https://homosaurus.org/v3/homoit0001133
related: https://homosaurus.org/v3/homoit0001516
related: https://homosaurus.org/v3/homoit0003177

Rainbow flags
type: Concept
issued: 2019-05-14
modified: 2025-02-23
replaces: rainbowFlags
comment: Rainbow-striped flags that symbolize LGBTQ+ pride and LGBTQ+ social movements. The first rainbow pride flag, which had eight colors, was created by Gilbert Baker, Lynn Segerblom, and others in San Francisco, California in 1978. Due to difficulties obtaining hot pink fabric and a desire for an even number of stripes, Baker modified his design in 1979 to contain six colors. The six-color version of the flag has been the most popular design since then.
alternative label: Baker flags
broader: https://homosaurus.org/v3/homoit0003246
change note: Version 3.7.0
has top concept: LGBTQ+ symbols
in scheme: v3

Reciprocal in vitro fertilization
type: Concept
issued: 2019-05-14
modified: 2025-02-23
replaces: reciprocalInVitroFertilisation
comment: A medical procedure in which the egg of one partner is fertilized with donor sperm and then transferred to the uterus of the other partner to bring to term.
alternative label: Shared motherhood
broader: https://homosaurus.org/v3/homoit0000659
change note: Version 3.7.0
has top concept: LGBTQ+ family planning
in scheme: v3
preferred label: Reciprocal in vitro fertilisation

LGBTQ+ people who use substances recreationally
type: Concept
issued: 2019-05-14
modified: 2025-02-23
replaces: recreationalDrugUse
comment: The use of substances (that are typically deemed harmful or are subject to legal restriction, such as drugs or alcohol) by LGBTQ+ people for recreational or social purposes.
broader: https://homosaurus.org/v3/homoit0000379
change note: Version 3.7.0
has top concept: LGBTQ+ people
in scheme: v3
related: https://homosaurus.org/v3/homoit0000380
related: https://homosaurus.org/v3/homoit0002289

Restraints
type: Concept
issued: 2019-05-14
modified: 2025-02-23
replaces: restraints
comment: Binding tools, devices, and accessories such as handcuffs, legcuffs, ropes, chains, straps, or straitjackets.
broader: https://homosaurus.org/v3/homoit0001266
change note: Version 3.7.0
has top concept: Sex accessories
in scheme: v3
narrower: https://homosaurus.org/v3/homoit0001337
narrower: https://homosaurus.org/v3/homoit0003115
narrower: https://homosaurus.org/v3/homoit0003117
related: https://homosaurus.org/v3/homoit0000086
related: https://homosaurus.org/v3/homoit0000704
related: https://homosaurus.org/v3/homoit0003059
related: https://homosaurus.org/v3/homoit0003071
related: https://homosaurus.org/v3/homoit0003089
related: https://homosaurus.org/v3/homoit0003090
related: https://homosaurus.org/v3/homoit0003145

Ritual homosexuality
type: Concept
issued: 2019-05-14
modified: 2025-02-23
replaces: ritualHomosexuality
comment: Non-reciprocal genital contact, typically fellatio, between younger and older men that takes place during initiation rituals practiced by the Sambari people of Papua New Guinea. This term was developed by Western outsiders and has been strongly criticized by the affected community.
broader: https://homosaurus.org/v3/homoit0000647
broader: https://homosaurus.org/v3/homoit0001299
change note: Version 3.7.0
has top concept: Sexual orientation
in scheme: v3
related: https://homosaurus.org/v3/homoit0000886

Roleplay
type: Concept
issued: 2019-05-14
modified: 2025-02-23
replaces: roleplay
comment: Practice in which one or more people take on a different identity or role to fulfill a desire or fantasy.
broader: https://homosaurus.org/v3/homoit0001267
broader: https://homosaurus.org/v3/homoit0003068
change note: Version 3.7.0
has top concept: Sex (Act)
in scheme: v3
narrower: https://homosaurus.org/v3/homoit0000022
narrower: https://homosaurus.org/v3/homoit0000576
narrower: https://homosaurus.org/v3/homoit0001145
narrower: https://homosaurus.org/v3/homoit0003067
narrower: https://homosaurus.org/v3/homoit0003082
related: https://homosaurus.org/v3/homoit0000217
related: https://homosaurus.org/v3/homoit0001241
related: https://homosaurus.org/v3/homoit0001295
related: https://homosaurus.org/v3/homoit0001304
related: https://homosaurus.org/v3/homoit0002165
related: https://homosaurus.org/v3/homoit0002169
related: https://homosaurus.org/v3/homoit0002207
related: https://homosaurus.org/v3/homoit0003052
related: https://homosaurus.org/v3/homoit0003063
related: https://homosaurus.org/v3/homoit0003089
related: https://homosaurus.org/v3/homoit0003125
related: https://homosaurus.org/v3/homoit0003138
related: https://homosaurus.org/v3/homoit0003139

Rope play
type: Concept
issued: 2019-05-14
modified: 2025-02-23
replaces: ropePlay
comment: Bondage involving the use of rope for sexual stimulation.
alternative label: Shibari
broader: https://homosaurus.org/v3/homoit0001266
change note: Version 3.7.0
has top concept: Sex accessories
in scheme: v3

LGBTQ+ Roman Catholics
type: Concept
issued: 2019-05-14
modified: 2025-02-23
replaces: romanCatholicsLGBTQ
comment: LGBTQ+ people who are members of the Roman Catholic Church.
alternative label: Roman Catholics (LGBTQ)
broader: https://homosaurus.org/v3/homoit0000265
change note: Version 3.7.0
has top concept: LGBTQ+ religious people
in scheme: v3
narrower: https://homosaurus.org/v3/homoit0000184
narrower: https://homosaurus.org/v3/homoit0000532
narrower: https://homosaurus.org/v3/homoit0000776
narrower: https://homosaurus.org/v3/homoit0001207
narrower: https://homosaurus.org/v3/homoit0001444
narrower: https://homosaurus.org/v3/homoit0002986
narrower: https://homosaurus.org/v3/homoit0002987

Romantic friendships
type: Concept
issued: 2019-05-14
modified: 2025-02-23
replaces: romanticFriendships
comment: Very close but non-sexual relationships between friends, often involving a degree of physical closeness beyond that which is common in modern Western societies; this may include, for example, friends holding hands, cuddling, kissing, and/or sharing a bed.
broader: https://homosaurus.org/v3/homoit0000455
change note: Version 3.7.0
has top concept: LGBTQ+ relationships
in scheme: v3

Rubber and latex fetish
type: Concept
issued: 2019-05-14
modified: 2025-02-23
replaces: rubberSex
comment: Eroticization of rubber, latex, and related materials.
alternative label: Rubber and latex sex
alternative label: Rubber sex
alternative label: Rubbersex
broader: https://homosaurus.org/v3/homoit0000442
broader: https://homosaurus.org/v3/homoit0001247
broader: https://homosaurus.org/v3/homoit0001267
broader: https://homosaurus.org/v3/homoit0001299
broader: https://homosaurus.org/v3/homoit0003066
change note: Version 3.7.0
has top concept: Eroticism
in scheme: v3
related: https://homosaurus.org/v3/homoit0003099
related: https://homosaurus.org/v3/homoit0003126

Rubber and latex community
type: Concept
issued: 2019-05-14
modified: 2025-02-23
replaces: rubberSubculture
comment: Communities of people with an interest in rubber or latex materials for fashion and kink.
alternative label: Rubber subculture
broader: https://homosaurus.org/v3/homoit0000297
broader: https://homosaurus.org/v3/homoit0001345
change note: Version 3.7.0
has top concept: LGBTQ+ communities
in scheme: v3
narrower: https://homosaurus.org/v3/homoit0001246
narrower: https://homosaurus.org/v3/homoit0001248
narrower: https://homosaurus.org/v3/homoit0001249
related: https://homosaurus.org/v3/homoit0000705
related: https://homosaurus.org/v3/homoit0003098

Rubbermen
type: Concept
issued: 2019-05-14
modified: 2025-02-23
replaces: rubbermen
comment: Men who have fetishes for or engage in fetish activities involving rubber and belong to the rubber community; frequently associated with U.S. LGBTQ+ subcultures.
broader: https://homosaurus.org/v3/homoit0001247
change note: Version 3.7.0
has top concept: LGBTQ+ communities
in scheme: v3
related: https://homosaurus.org/v3/homoit0001249

Rubberwomen
type: Concept
issued: 2019-05-14
modified: 2025-02-23
replaces: rubberwomen
comment: Women who have fetishes for or engage in fetish activities involving rubber and belong to the rubber community; frequently associated with U.S. LGBTQ+ subcultures.
broader: https://homosaurus.org/v3/homoit0001247
change note: Version 3.7.0
has top concept: LGBTQ+ communities
in scheme: v3
related: https://homosaurus.org/v3/homoit0001248

Sadism
type: Concept
issued: 2019-05-14
modified: 2025-02-23
replaces: sadism
comment: Erotic or sexual enjoyment of the application of pain or intense sensations. Derived from the literary works of the Marquis de Sade.
broader: https://homosaurus.org/v3/homoit0000036
broader: https://homosaurus.org/v3/homoit0001300
change note: Version 3.7.0
has top concept: Eroticism
in scheme: v3
related: https://homosaurus.org/v3/homoit0000997
related: https://homosaurus.org/v3/homoit0001295

Safer sex
type: Concept
issued: 2019-05-14
modified: 2025-02-23
replaces: saferSex
comment: A set of practices aimed to minimize the risk of STI transmission, including but not limited to using condoms and dental dams, taking PrEP, and participating in regular STI testing.
broader: https://homosaurus.org/v3/homoit0001267
broader: https://homosaurus.org/v3/homoit0001299
change note: Version 3.7.0
has top concept: Sex (Act)
in scheme: v3
related: https://homosaurus.org/v3/homoit0000027
related: https://homosaurus.org/v3/homoit0000299
related: https://homosaurus.org/v3/homoit0000346
related: https://homosaurus.org/v3/homoit0000700
related: https://homosaurus.org/v3/homoit0001239
related: https://homosaurus.org/v3/homoit0001252
related: https://homosaurus.org/v3/homoit0001287

Safer sex parties
type: Concept
issued: 2019-05-14
modified: 2025-02-23
replaces: saferSexParties
comment: Social gatherings or events originating from Black lesbian communities in the Southern United States in the 1990s. Safer sex parties are typically held at private locations where organizers and participants discuss safer sex practices, sexuality, and sexual experiences.
broader: https://homosaurus.org/v3/homoit0001272
change note: Version 3.7.0
has top concept: Sex locations
in scheme: v3
related: https://homosaurus.org/v3/homoit0001251

Sak veng
type: Concept
issued: 2019-05-14
modified: 2025-02-23
replaces: sakVeng
comment: Term used in Cambodia for people assigned male at birth who identify as women; translates to "long hairs."
broader: https://homosaurus.org/v3/homoit0000322
change note: Version 3.7.0
has top concept: Gender
in scheme: v3
related: https://homosaurus.org/v3/homoit0000695
related: https://homosaurus.org/v3/homoit0001338

Same-gender-loving
type: Concept
issued: 2019-05-14
modified: 2025-02-23
replaces: sameGenderLoving
comment: Culturally affirming term for sexual identity that is often used to describe African American homosexual people.
alternative label: SGL
broader: https://homosaurus.org/v3/homoit0001295
change note: Version 3.7.0
has top concept: Sexual identity
in scheme: v3
related: https://homosaurus.org/v3/homoit0000015
related: https://homosaurus.org/v3/homoit0001009
related: https://homosaurus.org/v3/homoit0001510
related: https://homosaurus.org/v3/homoit0002278
related: https://homosaurus.org/v3/homoit0002279

Same-sex divorce
type: Concept
issued: 2019-05-14
modified: 2025-02-23
replaces: sameSexDivorce
comment: A legal proceeding undertaken to dissolve a marriage between two individuals of the same sex.
broader: https://homosaurus.org/v3/homoit0000854
change note: Version 3.7.0
has top concept: Living arrangements
in scheme: v3

Saris
type: Concept
issued: 2019-05-14
modified: 2025-02-23
replaces: saris
comment: In Jewish culture, this term is used to refer to individuals who were assigned male at birth but later developed feminine characteristics..
broader: https://homosaurus.org/v3/homoit0000322
change note: Version 3.7.0
has top concept: Gender
in scheme: v3

Voyeurism
type: Concept
issued: 2019-05-14
modified: 2025-02-23
replaces: voyeurism
comment: Practice of watching or listening to others, typically without their awareness or consent. In consensual sexual encounters, voyeurism involves watching or listening to someone undress or engage in sexual activity without actively participating.
alternative label: Scopophilia
alternative label: Scoptophilia
broader: https://homosaurus.org/v3/homoit0000442
broader: https://homosaurus.org/v3/homoit0001267
change note: Version 3.7.0
has top concept: Eroticism
in scheme: v3
related: https://homosaurus.org/v3/homoit0000412
related: https://homosaurus.org/v3/homoit0001142

Sea queens
type: Concept
issued: 2019-05-14
modified: 2025-02-23
replaces: seaQueens
comment: Term used before the 1960s to describe gay men who worked aboard ships, mainly merchant vessels.
broader: https://homosaurus.org/v3/homoit0000878
change note: Version 3.7.0
has top concept: LGBTQ+ historical terms
in scheme: v3
related: https://homosaurus.org/v3/homoit0000506

Secondary sex characteristics
type: Concept
issued: 2019-05-14
modified: 2025-02-23
replaces: secondarySexCharacteristics
comment: Features that appear during puberty that are not directly related to reproduction, like changes in the voice and the development of body hair.
broader: https://homosaurus.org/v3/homoit0001269
change note: Version 3.7.0
has top concept: Sex (Body)
in scheme: v3
narrower: https://homosaurus.org/v3/homoit0000222
narrower: https://homosaurus.org/v3/homoit0000422
narrower: https://homosaurus.org/v3/homoit0000605
narrower: https://homosaurus.org/v3/homoit0001339
narrower: https://homosaurus.org/v3/homoit0001495

Second-wave feminism
type: Concept
issued: 2019-05-14
modified: 2025-02-23
replaces: secondWaveFeminism
comment: Period of feminist political activity (also referred to as women’s liberation) beginning in the early 1960s that critiqued male-dominated institutions and cultural practices in society.
alternative label: Second wave feminism
broader: https://homosaurus.org/v3/homoit0000437
change note: Version 3.7.0
has top concept: Feminism
in scheme: v3
related: https://homosaurus.org/v3/homoit0003158
related: https://homosaurus.org/v3/homoit0003173

Sekhet
type: Concept
issued: 2019-05-14
modified: 2025-02-23
replaces: sekhet
comment: Egyptian term that refers to a range of people of non-normative gender and sexual identities, including gay people, eunuchs, trans people, etc. Only use to describe people who self-identify as sekhet.
alternative label: Sht
broader: https://homosaurus.org/v3/homoit0000322
change note: Version 3.7.0
has top concept: Gender
in scheme: v3

Sekrata
type: Concept
issued: 2019-05-14
modified: 2025-02-23
replaces: sekrata
comment: In Madagascar, this term refers to people of a third gender who were assigned male at birth and present feminine characteristics.
broader: https://homosaurus.org/v3/homoit0000322
change note: Version 3.7.0
has top concept: Gender
in scheme: v3

Self-insemination
type: Concept
issued: 2019-05-14
modified: 2025-02-23
replaces: self-insemination
comment: The practice of using collected sperm to induce one's own pregnancy outside of a clinical environment.
broader: https://homosaurus.org/v3/homoit0000069
broader: https://homosaurus.org/v3/homoit0000843
broader: https://homosaurus.org/v3/homoit0002618
change note: Version 3.7.0
has top concept: LGBTQ+ family planning
in scheme: v3

Sex assigned at birth
type: Concept
issued: 2019-05-14
modified: 2025-02-23
replaces: sexAssignedAtBirth
comment: The process of determining an individual’s sex relatively shortly after birth, usually documented on official records, such as a birth certificate. Determination is usually based on the appearance of external genitalia but may use other methodologies. In practice, sex assigned at birth is often culturally variable; the term “gender assigned at birth” is often more applicable or accurate.
alternative label: Birth sex
alternative label: Birth-assigned sex
alternative label: Natal sex
alternative label: Sex at birth
alternative label: Sex reported at birth
alternative label: ASAB
alternative label: SAAB
broader: https://homosaurus.org/v3/homoit0001648
change note: Version 3.7.0
has top concept: Sex (Body)
in scheme: v3
narrower: https://homosaurus.org/v3/homoit0000077
narrower: https://homosaurus.org/v3/homoit0000079
narrower: https://homosaurus.org/v3/homoit0001646
related: https://homosaurus.org/v3/homoit0000120
related: https://homosaurus.org/v3/homoit0000585
related: https://homosaurus.org/v3/homoit0000600
related: https://homosaurus.org/v3/homoit0000668
related: https://homosaurus.org/v3/homoit0000669
related: https://homosaurus.org/v3/homoit0000670
related: https://homosaurus.org/v3/homoit0001006
related: https://homosaurus.org/v3/homoit0001099
related: https://homosaurus.org/v3/homoit0001488
related: https://homosaurus.org/v3/homoit0001896
related: https://homosaurus.org/v3/homoit0001897

Sex clubs
type: Concept
issued: 2019-05-14
modified: 2025-02-23
replaces: sexClubs
comment: Establishments where patrons can engage in sex with other patrons, as well as formal or informal groups that organize sex-related activities.
broader: https://homosaurus.org/v3/homoit0000011
change note: Version 3.7.0
has top concept: Sex industry
in scheme: v3
related: https://homosaurus.org/v3/homoit0000087
related: https://homosaurus.org/v3/homoit0000475
related: https://homosaurus.org/v3/homoit0001272
related: https://homosaurus.org/v3/homoit0003079

Sex education
type: Concept
issued: 2019-05-14
modified: 2025-02-23
replaces: sexEducation
comment: Instruction about sexual health and sexuality, including topics such as consent, safer sex, transmission of STIs, and reproduction.
broader: https://homosaurus.org/v3/homoit0000661
change note: Version 3.7.0
has top concept: Information provision
in scheme: v3
related: https://homosaurus.org/v3/homoit0000027

Sex parties
type: Concept
issued: 2019-05-14
modified: 2025-02-23
replaces: sexParties
comment: Social gatherings or events, typically held in private residences or at sex clubs, in which participants engage in or observe group sexual activities.
broader: https://homosaurus.org/v3/homoit0000974
change note: Version 3.7.0
has top concept: Sex locations
in scheme: v3
narrower: https://homosaurus.org/v3/homoit0001252
related: https://homosaurus.org/v3/homoit0000087
related: https://homosaurus.org/v3/homoit0000242
related: https://homosaurus.org/v3/homoit0000603
related: https://homosaurus.org/v3/homoit0001270
related: https://homosaurus.org/v3/homoit0001306
related: https://homosaurus.org/v3/homoit0003080

Sex therapy
type: Concept
issued: 2019-05-14
modified: 2025-02-23
replaces: sexTherapy
comment: A form of counseling intended to address sexual dysfunction and other sex-related issues.
broader: https://homosaurus.org/v3/homoit0001366
change note: Version 3.7.0
has top concept: Medical care
in scheme: v3
related: https://homosaurus.org/v3/homoit0001291

Sex tourism
type: Concept
issued: 2019-05-14
modified: 2025-02-23
replaces: sexTourism
comment: The practice of traveling with the intention of soliciting sex work, typically to countries where sex work is legal, decriminalized, or less stigmatized. Sex tourism often presents ethical concerns, such as the economic gap between tourists and residents, differences in age of consent laws globally, and the selective enforcement of anti-sex work laws by police.
broader: https://homosaurus.org/v3/homoit0000011
change note: Version 3.7.0
has top concept: Sex industry
in scheme: v3
narrower: https://homosaurus.org/v3/homoit0003262
related: https://homosaurus.org/v3/homoit0001276

Sex work
type: Concept
issued: 2019-05-14
modified: 2025-02-23
replaces: sexWork
comment: The exchange of sexual services, performances, or companionship for money or goods. Use to describe the broad spectrum of sex work, and use more specific terms if possible. For individuals who perform sex work, use "Sex workers" or narrower terms. For sex work undertaken by individuals who cannot or have not consented, use "Sex trafficking."
alternative label: Prostitution
broader: https://homosaurus.org/v3/homoit0000011
change note: Version 3.7.0
has top concept: Sex industry
in scheme: v3
narrower: https://homosaurus.org/v3/homoit0000405
narrower: https://homosaurus.org/v3/homoit0003763
narrower: https://homosaurus.org/v3/homoit0003764
narrower: https://homosaurus.org/v3/homoit0003768
narrower: https://homosaurus.org/v3/homoit0003780
narrower: https://homosaurus.org/v3/homoit0003781
narrower: https://homosaurus.org/v3/homoit0003792
narrower: https://homosaurus.org/v3/homoit0000494
related: https://homosaurus.org/v3/homoit0001275
related: https://homosaurus.org/v3/homoit0003743
related: https://homosaurus.org/v3/homoit0003758

LGBTQ+ sex workers
type: Concept
issued: 2019-05-14
modified: 2025-02-23
replaces: sexWorkersLGBTQ
comment: LGBTQ+ people who receive money or goods in exchange for sexual services, performances, or companionship. Use to describe LGBTQ+ people working across the broad spectrum of sex work.
alternative label: LGBTQ+ prostitutes
alternative label: LGBTQ+ prostitution
alternative label: LGBTQ+ sex work
alternative label: Prostitutes (LGBTQ)
alternative label: Prostitution (LGBTQ)
alternative label: Sex work (LGBTQ)
broader: https://homosaurus.org/v3/homoit0003758
broader: https://homosaurus.org/v3/homoit0000915
change note: Version 3.7.0
has top concept: Sex workers
in scheme: v3
narrower: https://homosaurus.org/v3/homoit0000178
narrower: https://homosaurus.org/v3/homoit0000525
narrower: https://homosaurus.org/v3/homoit0000768
narrower: https://homosaurus.org/v3/homoit0001201
narrower: https://homosaurus.org/v3/homoit0001437
narrower: https://homosaurus.org/v3/homoit0003759
narrower: https://homosaurus.org/v3/homoit0003760
narrower: https://homosaurus.org/v3/homoit0003797
narrower: https://homosaurus.org/v3/homoit0003798
related: https://homosaurus.org/v3/homoit0003262
related: https://homosaurus.org/v3/homoit0003761
related: https://homosaurus.org/v3/homoit0003762

Sexting
type: Concept
issued: 2019-05-14
modified: 2025-02-23
replaces: sexting
comment: Act of sending sexually explicit messages or photographs, primarily between mobile phones.
broader: https://homosaurus.org/v3/homoit0001267
change note: Version 3.7.0
has top concept: Sex (Act)
in scheme: v3
related: https://homosaurus.org/v3/homoit0001128
related: https://homosaurus.org/v3/homoit0001306

Sexual abstinence
type: Concept
issued: 2019-05-14
modified: 2025-02-23
replaces: sexualAbstinence
comment: Practice of abstaining or not participating in some or all forms of sexual activity, whether for medical, psychological, social, moral, or religious reasons. Sexual abstinence may be voluntary or involuntary.
broader: https://homosaurus.org/v3/homoit0001267
change note: Version 3.7.0
has top concept: Sex (Act)
in scheme: v3
narrower: https://homosaurus.org/v3/homoit0001493
related: https://homosaurus.org/v3/homoit0000004
related: https://homosaurus.org/v3/homoit0000244
related: https://homosaurus.org/v3/homoit0001306

LGBTQ+ people with sexual addictions
type: Concept
issued: 2019-05-14
modified: 2025-02-23
replaces: sexualAddiction
comment: LGBTQ+ people experiencing addiction to or dependency upon sexual activities. Only use to refer to individuals who describe themselves as having sexual addictions, not individuals whose sexual practices are perceived as promiscuous or unsafe by others.
alternative label: LGBTQ+ people with sex addictions
broader: https://homosaurus.org/v3/homoit0001550
change note: Version 3.7.0
has top concept: LGBTQ+ people
in scheme: v3
narrower: https://homosaurus.org/v3/homoit0001539
related: https://homosaurus.org/v3/homoit0000412
related: https://homosaurus.org/v3/homoit0000656
related: https://homosaurus.org/v3/homoit0001538

Sexual excitement
type: Concept
issued: 2019-05-14
modified: 2025-02-23
replaces: sexualExcitement
comment: Term describing the physiological and psychological response to sexual stimulation.
alternative label: Sexual arousal
broader: https://homosaurus.org/v3/homoit0000656
change note: Version 3.7.0
has top concept: Hypersexuality
in scheme: v3
narrower: https://homosaurus.org/v3/homoit0001062
related: https://homosaurus.org/v3/homoit0000323
related: https://homosaurus.org/v3/homoit0000404
related: https://homosaurus.org/v3/homoit0000589
related: https://homosaurus.org/v3/homoit0000610
related: https://homosaurus.org/v3/homoit0000683
related: https://homosaurus.org/v3/homoit0000967
related: https://homosaurus.org/v3/homoit0001267
related: https://homosaurus.org/v3/homoit0001288
related: https://homosaurus.org/v3/homoit0001291
related: https://homosaurus.org/v3/homoit0001292
related: https://homosaurus.org/v3/homoit0001306
related: https://homosaurus.org/v3/homoit0001806

Sexual assault
type: Concept
issued: 2019-05-14
modified: 2025-02-23
replaces: sexualAssault
comment: Sexual behavior or contact targeting an individual who has not consented; includes nonconsensual sex acts that may not be illegal or punishable by law in the given location or time period.
broader: https://homosaurus.org/v3/homoit0001305
change note: Version 3.7.0
has top concept: Sexual violence
in scheme: v3
related: https://homosaurus.org/v3/homoit0000855
related: https://homosaurus.org/v3/homoit0003444

Sexual offenses laws
type: Concept
issued: 2019-05-14
modified: 2025-02-23
replaces: sexualOffencesLaws
comment: Legislation determining the kinds of sexual behaviors and activities that are legally permissible. Laws vary by jurisdiction but typically address crimes like sexual coercion, sexual assault, incest, and sex trafficking. Historically and in the present day, sexual offenses laws have also served to criminalize consensual but non-normative sexual practices, such as anal sex and homosexuality.
alternative label: Sexual criminal codes
broader: https://homosaurus.org/v3/homoit0000313
change note: Version 3.7.0
has top concept: Law
in scheme: v3
narrower: https://homosaurus.org/v3/homoit0001326
related: https://homosaurus.org/v3/homoit0000020
related: https://homosaurus.org/v3/homoit0002373

Sexual diversity
type: Concept
issued: 2019-05-14
modified: 2025-02-23
replaces: sexualDiversity
comment: Diversity of sexual orientation or sexuality among members of a group or within a given society.
broader: https://homosaurus.org/v3/homoit0000358
change note: Version 3.7.0
has top concept: Diversity
in scheme: v3
narrower: https://homosaurus.org/v3/homoit0001558
related: https://homosaurus.org/v3/homoit0000807
related: https://homosaurus.org/v3/homoit0001292
related: https://homosaurus.org/v3/homoit0001295
related: https://homosaurus.org/v3/homoit0001298
related: https://homosaurus.org/v3/homoit0001300
related: https://homosaurus.org/v3/homoit0001556

Sexual function
type: Concept
issued: 2019-05-14
modified: 2025-02-23
replaces: sexualFunction
comment: The process by which an individual's body experiences and reacts to sexual stimuli.
broader: https://homosaurus.org/v3/homoit0001298
change note: Version 3.7.0
has top concept: Sexual orientation
in scheme: v3
related: https://homosaurus.org/v3/homoit0000967
related: https://homosaurus.org/v3/homoit0001267
related: https://homosaurus.org/v3/homoit0001284
related: https://homosaurus.org/v3/homoit0001290
related: https://homosaurus.org/v3/homoit0001291
related: https://homosaurus.org/v3/homoit0001294
related: https://homosaurus.org/v3/homoit0001306

Sexual harassment
type: Concept
issued: 2019-05-14
modified: 2025-02-23
replaces: sexualHarassment
comment: Unwelcome behavior of a sexual nature, including unwanted advances or requests for sexual favors.
broader: https://homosaurus.org/v3/homoit0000611
change note: Version 3.7.0
has top concept: Harassment
in scheme: v3
related: https://homosaurus.org/v3/homoit0000059
related: https://homosaurus.org/v3/homoit0000675
related: https://homosaurus.org/v3/homoit0001278

Sexual inversion
type: Concept
issued: 2019-05-14
modified: 2025-02-23
replaces: sexualInversion
comment: Historical term for homosexuality used by sexologists to refer to an inborn reversal of gender traits or roles. Only use in historical contexts.
broader: https://homosaurus.org/v3/homoit0000878
broader: https://homosaurus.org/v3/homoit0001006
change note: Version 3.7.0
has top concept: LGBTQ+ historical terms
in scheme: v3
related: https://homosaurus.org/v3/homoit0000395
related: https://homosaurus.org/v3/homoit0000677
related: https://homosaurus.org/v3/homoit0001300
related: https://homosaurus.org/v3/homoit0001564

Sexual relationships
type: Concept
issued: 2019-05-14
modified: 2025-02-23
replaces: sexualRelationships
comment: Ongoing connections between two or more individuals involving sexual behaviors or activities.
broader: https://homosaurus.org/v3/homoit0001237
change note: Version 3.7.0
has top concept: LGBTQ+ relationships
in scheme: v3
narrower: https://homosaurus.org/v3/homoit0000242
narrower: https://homosaurus.org/v3/homoit0000976
narrower: https://homosaurus.org/v3/homoit0001019
narrower: https://homosaurus.org/v3/homoit0001124
related: https://homosaurus.org/v3/homoit0000050
related: https://homosaurus.org/v3/homoit0000344
related: https://homosaurus.org/v3/homoit0000458
related: https://homosaurus.org/v3/homoit0000895
related: https://homosaurus.org/v3/homoit0001080
related: https://homosaurus.org/v3/homoit0001081
related: https://homosaurus.org/v3/homoit0001300
related: https://homosaurus.org/v3/homoit0001632
related: https://homosaurus.org/v3/homoit0001633
related: https://homosaurus.org/v3/homoit0001636
related: https://homosaurus.org/v3/homoit0001916
related: https://homosaurus.org/v3/homoit0001917

Sexual roles
type: Concept
issued: 2019-05-14
modified: 2025-02-23
replaces: sexualRoles
comment: An erotic identity an individual assumes during sexual play with one or more people; this identity can either be restricted to the bedroom or extended into day-to-day life.
broader: https://homosaurus.org/v3/homoit0001241
broader: https://homosaurus.org/v3/homoit0001300
change note: Version 3.7.0
has top concept: Role behavior
in scheme: v3
narrower: https://homosaurus.org/v3/homoit0000219
narrower: https://homosaurus.org/v3/homoit0000231
narrower: https://homosaurus.org/v3/homoit0000440
narrower: https://homosaurus.org/v3/homoit0000999
narrower: https://homosaurus.org/v3/homoit0001018
narrower: https://homosaurus.org/v3/homoit0001353
narrower: https://homosaurus.org/v3/homoit0001376
narrower: https://homosaurus.org/v3/homoit0001779
narrower: https://homosaurus.org/v3/homoit0001898
narrower: https://homosaurus.org/v3/homoit0003052
narrower: https://homosaurus.org/v3/homoit0003506
related: https://homosaurus.org/v3/homoit0000609
related: https://homosaurus.org/v3/homoit0001242
related: https://homosaurus.org/v3/homoit0001295
related: https://homosaurus.org/v3/homoit0001306

Sexually abused LGBTQ+ children
type: Concept
issued: 2019-05-14
modified: 2025-02-23
replaces: sexuallyAbusedLGBTQChildren
comment: LGBTQ+ children younger than 18 years of age who are currently experiencing or have experienced sexual abuse.
alternative label: Sexually abused LGBTQ children
broader: https://homosaurus.org/v3/homoit0000256
broader: https://homosaurus.org/v3/homoit0000959
change note: Version 3.7.0
has top concept: Family members
in scheme: v3
related: https://homosaurus.org/v3/homoit0000958

Shiv-Shakthis
type: Concept
issued: 2019-05-14
modified: 2025-02-23
replaces: shivShakthis
comment: Term used in the Andhra Pradesh region of India to describe transgender people who are considered to be married to the gods (particularly Shiva). They often serve as astrologers and spiritual healers and their community is guarded by gurus who induct disciples and train them.
broader: https://homosaurus.org/v3/homoit0000322
change note: Version 3.7.0
has top concept: Gender
in scheme: v3

Siblings
type: Concept
issued: 2019-05-14
modified: 2025-02-23
replaces: siblings
comment: Individuals who share the same parent or parents.
broader: https://homosaurus.org/v3/homoit0000421
change note: Version 3.7.0
has top concept: Family members
in scheme: v3
narrower: https://homosaurus.org/v3/homoit0002349
narrower: https://homosaurus.org/v3/homoit0002350
narrower: https://homosaurus.org/v3/homoit0002621
narrower: https://homosaurus.org/v3/homoit0002623
related: https://homosaurus.org/v3/homoit0000420

Single people
type: Concept
issued: 2019-05-14
modified: 2025-02-23
replaces: singlePeople
comment: People who are not involved in any committed sexual or romantic relationships, including marriages, civil unions, or other established partnerships.
alternative label: Singles
broader: https://homosaurus.org/v3/homoit0000989
change note: Version 3.7.0
has top concept: Living arrangements
in scheme: v3
narrower: https://homosaurus.org/v3/homoit0000944
related: https://homosaurus.org/v3/homoit0000359

Sissies
type: Concept
issued: 2019-05-14
modified: 2025-02-23
replaces: sissies
comment: Pejorative term applied to boys or men who are perceived to be effeminate or do not conform to traditional masculine roles.
alternative label: Sissy boys
broader: https://homosaurus.org/v3/homoit0000220
broader: https://homosaurus.org/v3/homoit0000577
change note: Version 3.7.0
has top concept: Family members
in scheme: v3
related: https://homosaurus.org/v3/homoit0001148

Sistergirls
type: Concept
issued: 2019-05-14
modified: 2025-02-23
replaces: sistergirls
comment: Indigenous Australian term for people who transition from male to female.
alternative label: Sistagirls
broader: https://homosaurus.org/v3/homoit0000322
change note: Version 3.7.0
has top concept: Gender
in scheme: v3
related: https://homosaurus.org/v3/homoit0000002
related: https://homosaurus.org/v3/homoit0000224

Skoptsy
type: Concept
issued: 2019-05-14
modified: 2025-02-23
replaces: skoptsy
comment: A sect within the larger Spiritual Christianity movement in the Russian Empire that emerged in the 18th century. This sect is most commonly known for conducting castrations and mastectomies in order to suppress sexual desire.
broader: https://homosaurus.org/v3/homoit0000322
change note: Version 3.7.0
has top concept: Gender
in scheme: v3

LGBTQ+ submissives
type: Concept
issued: 2019-05-14
modified: 2025-02-23
replaces: slaves
comment: The person who takes on the position of submission or service in a power exchange relationship or during kink activities.
alternative label: LGBTQ+ S-type
alternative label: LGBTQ+ Slaves
alternative label: LGBTQ+ Subs
broader: https://homosaurus.org/v3/homoit0001295
broader: https://homosaurus.org/v3/homoit0001637
broader: https://homosaurus.org/v3/homoit0003084
change note: Version 3.7.0
has top concept: Sexual identity
in scheme: v3
related: https://homosaurus.org/v3/homoit0000036
related: https://homosaurus.org/v3/homoit0000219
related: https://homosaurus.org/v3/homoit0000363
related: https://homosaurus.org/v3/homoit0000705
related: https://homosaurus.org/v3/homoit0000999
related: https://homosaurus.org/v3/homoit0001018
related: https://homosaurus.org/v3/homoit0001376
related: https://homosaurus.org/v3/homoit0003052

Leather and kink activism
type: Concept
issued: 2019-05-14
modified: 2025-02-23
replaces: SMMovement
comment: Organizing and activism focused on increasing awareness and acceptance of kinks, fetishes, sadomasochism, leather and related subcultures, closely associated with LGBTQ+ activism and the sex-positive feminist movement.
broader: https://homosaurus.org/v3/homoit0001322
change note: Version 3.7.0
has top concept: Social movements
in scheme: v3
related: https://homosaurus.org/v3/homoit0000006
related: https://homosaurus.org/v3/homoit0000036
related: https://homosaurus.org/v3/homoit0003101

Social constructionism
type: Concept
issued: 2019-05-14
modified: 2025-02-23
replaces: socialConstructionism
comment: Belief or theory that categories of gender, sexual orientation, and ethnicity are cultural constructs rather than intrinsic categories of nature.
broader: https://homosaurus.org/v3/homoit0001365
change note: Version 3.7.0
has top concept: Theories
in scheme: v3
related: https://homosaurus.org/v3/homoit0000115
related: https://homosaurus.org/v3/homoit0001006
related: https://homosaurus.org/v3/homoit0001219

Social security cards
type: Concept
issued: 2019-05-14
modified: 2025-02-23
replaces: socialSecurityCards
comment: Official documents issued by governments that ascribe unique numeral identifiers to citizens to track their income and determine retirement benefits.
broader: https://homosaurus.org/v3/homoit0001053
change note: Version 3.7.0
has top concept: Legal status
in scheme: v3
related: https://homosaurus.org/v3/homoit0000119
related: https://homosaurus.org/v3/homoit0000247
related: https://homosaurus.org/v3/homoit0000377
related: https://homosaurus.org/v3/homoit0000573
related: https://homosaurus.org/v3/homoit0001465

Sodomy
type: Concept
issued: 2019-05-14
modified: 2025-02-23
replaces: sodomy
comment: Historical term for "unnatural" sexual acts unrelated to procreation, including oral sex and anal sex.
broader: https://homosaurus.org/v3/homoit0000878
change note: Version 3.7.0
has top concept: LGBTQ+ historical terms
in scheme: v3
related: https://homosaurus.org/v3/homoit0000227
related: https://homosaurus.org/v3/homoit0001095
related: https://homosaurus.org/v3/homoit0001267
related: https://homosaurus.org/v3/homoit0001299
related: https://homosaurus.org/v3/homoit0001326

Sodomy laws
type: Concept
issued: 2019-05-14
modified: 2025-02-23
replaces: sodomyLaws
comment: Laws and regulations regarding the legality of sodomy, particularly in the United States, Great Britain, and/or former British colonies.
broader: https://homosaurus.org/v3/homoit0001289
change note: Version 3.7.0
has top concept: Law
in scheme: v3
related: https://homosaurus.org/v3/homoit0001325
related: https://homosaurus.org/v3/homoit0002373
related: https://homosaurus.org/v3/homoit0002380

Soft butches
type: Concept
issued: 2019-05-14
modified: 2025-02-23
replaces: softButches
comment: People who are somewhat or slightly masculine in their appearance; commonly used in lesbian communities.
broader: https://homosaurus.org/v3/homoit0001295
change note: Version 3.7.0
has top concept: Sexual identity
in scheme: v3
related: https://homosaurus.org/v3/homoit0000231
related: https://homosaurus.org/v3/homoit0000440
related: https://homosaurus.org/v3/homoit0000556
related: https://homosaurus.org/v3/homoit0002061

LGBTQ+ sons
type: Concept
issued: 2019-05-14
modified: 2025-02-23
replaces: sonsLGBTQ
comment: Sons who identify as LGBTQ+.
alternative label: Sons (LGBTQ)
broader: https://homosaurus.org/v3/homoit0000915
broader: https://homosaurus.org/v3/homoit0002353
change note: Version 3.7.0
has top concept: LGBTQ+ people
in scheme: v3
narrower: https://homosaurus.org/v3/homoit0000186
narrower: https://homosaurus.org/v3/homoit0000536
narrower: https://homosaurus.org/v3/homoit0001209
narrower: https://homosaurus.org/v3/homoit0001446
narrower: https://homosaurus.org/v3/homoit0002790
narrower: https://homosaurus.org/v3/homoit0002941

Sons of bisexual people
type: Concept
issued: 2019-05-14
modified: 2025-02-23
replaces: sonsOfBisexualPeople
comment: Sons who have one or more bisexual parent. For sons who are themselves bisexual, use the term "Bisexual sons."
broader: https://homosaurus.org/v3/homoit0000257
broader: https://homosaurus.org/v3/homoit0002355
change note: Version 3.7.0
has top concept: Family members
in scheme: v3

Sons of gay men
type: Concept
issued: 2019-05-14
modified: 2025-02-23
replaces: sonsOfGayMen
comment: Sons who have one or more gay parent. For sons who are themselves gay, use the term "Gay sons."
broader: https://homosaurus.org/v3/homoit0000258
broader: https://homosaurus.org/v3/homoit0002355
change note: Version 3.7.0
has top concept: Family members
in scheme: v3

Sons of lesbians
type: Concept
issued: 2019-05-14
modified: 2025-02-23
replaces: sonsOfLesbians
comment: Sons who have one or more lesbian parent.
broader: https://homosaurus.org/v3/homoit0000259
broader: https://homosaurus.org/v3/homoit0002355
change note: Version 3.7.0
has top concept: Family members
in scheme: v3

Sons of transgender people
type: Concept
issued: 2019-05-14
modified: 2025-02-23
replaces: sonsOfTransgenderPeople
comment: Sons who have one or more transgender parent. For sons who are themselves transgender, use the term "Transgender sons."
broader: https://homosaurus.org/v3/homoit0000261
broader: https://homosaurus.org/v3/homoit0002355
change note: Version 3.7.0
has top concept: Family members
in scheme: v3

Sons of queer people
type: Concept
issued: 2019-05-14
modified: 2025-02-23
replaces: sonsOfQueerPeople
comment: Sons who have one or more queer parent. For sons who are themselves queer, use the term "Queer sons."
broader: https://homosaurus.org/v3/homoit0000262
broader: https://homosaurus.org/v3/homoit0002355
change note: Version 3.7.0
has top concept: Family members
in scheme: v3

Spanking
type: Concept
issued: 2019-05-14
modified: 2025-02-23
replaces: spanking
comment: Striking the buttocks, usually with the hand or paddle, as a form of impact play.
broader: https://homosaurus.org/v3/homoit0003053
change note: Version 3.7.0
has top concept: Eroticism
in scheme: v3
related: https://homosaurus.org/v3/homoit0000081
related: https://homosaurus.org/v3/homoit0000232
related: https://homosaurus.org/v3/homoit0001068

Sperm donors
type: Concept
issued: 2019-05-14
modified: 2025-02-23
replaces: spermDonors
comment: Individuals of any gender who donate their own sperm for the purpose of inducing pregnancy.
broader: https://homosaurus.org/v3/homoit0000364
broader: https://homosaurus.org/v3/homoit0002620
change note: Version 3.7.0
has top concept: Donors
in scheme: v3
related: https://homosaurus.org/v3/homoit0000069
related: https://homosaurus.org/v3/homoit0000864
related: https://homosaurus.org/v3/homoit0002617
related: https://homosaurus.org/v3/homoit0002626

Spreader bar
type: Concept
issued: 2019-05-14
modified: 2025-02-23
replaces: spreaderBars
comment: A type of bondage device consisting of a wooden or metal bar with cuffs at either end that are used to keep an individual's arms or legs apart.
broader: https://homosaurus.org/v3/homoit0001238
broader: https://homosaurus.org/v3/homoit0001266
broader: https://homosaurus.org/v3/homoit0003059
change note: Version 3.7.0
has top concept: Sex accessories
in scheme: v3
related: https://homosaurus.org/v3/homoit0003117

Srey sros
type: Concept
issued: 2019-05-14
modified: 2025-02-23
replaces: sreySros
comment: Term used in Cambodia for people assigned male at birth who identify as women; translates to "charming girls."
broader: https://homosaurus.org/v3/homoit0000322
change note: Version 3.7.0
has top concept: Gender
in scheme: v3
related: https://homosaurus.org/v3/homoit0000695
related: https://homosaurus.org/v3/homoit0001253

Stature
type: Concept
issued: 2019-05-14
modified: 2025-02-23
replaces: stature
comment: A person’s natural height in an upright position.
broader: https://homosaurus.org/v3/homoit0001259
change note: Version 3.7.0
has top concept: Sex (Body)
in scheme: v3

Stone butches
type: Concept
issued: 2019-05-14
modified: 2025-02-23
replaces: stoneButches
comment: Individuals whose gender expression and/or identity is masculine-presenting and who usually do not like to be sexually touched, though they will still provide their partners with sexual pleasure; commonly used in lesbian communities.
broader: https://homosaurus.org/v3/homoit0001295
change note: Version 3.7.0
has top concept: Sexual identity
in scheme: v3
related: https://homosaurus.org/v3/homoit0000230
related: https://homosaurus.org/v3/homoit0000231
related: https://homosaurus.org/v3/homoit0000440
related: https://homosaurus.org/v3/homoit0000556

Stonewall riots
type: Concept
issued: 2019-05-14
modified: 2025-02-23
replaces: stonewallRiots
comment: The series of spontaneous demonstrations and protests against the police raid that took place on June 28, 1969 at the Stonewall Inn in the Greenwich Village neighborhood of New York City.
alternative label: Stonewall uprising
broader: https://homosaurus.org/v3/homoit0000932
change note: Version 3.7.0
has top concept: LGBTQ+ riots
in scheme: v3
related: https://homosaurus.org/v3/homoit0000500

Strap-on sex
type: Concept
issued: 2019-05-14
modified: 2025-02-23
replaces: strapOnSex
comment: Sexual intercourse in which a dildo attached to a harness is used for either vaginal or anal penetration.
broader: https://homosaurus.org/v3/homoit0001267
change note: Version 3.7.0
has top concept: Sex (Act)
in scheme: v3
related: https://homosaurus.org/v3/homoit0000354
related: https://homosaurus.org/v3/homoit0000355
related: https://homosaurus.org/v3/homoit0000662
related: https://homosaurus.org/v3/homoit0001099
related: https://homosaurus.org/v3/homoit0001510

Strippers
type: Concept
issued: 2019-05-14
modified: 2025-02-23
replaces: strippers
comment: Sex workers who undress to music while using a pole to perform dance moves, whether in a venue like a strip club or by hire at private parties. For stripping performed by amateurs in private settings, use "Stripping."
alternative label: Stripteasers
alternative label: Peelers
alternative label: Pole-dancers
alternative label: Pole dancers
alternative label: Exotic dancers
broader: https://homosaurus.org/v3/homoit0003758
change note: Version 3.7.0
has top concept: Sex workers
in scheme: v3
related: https://homosaurus.org/v3/homoit0003764

Striptease
type: Concept
issued: 2019-05-14
modified: 2025-02-23
replaces: striptease
comment: A form of erotic dance during which the performer gradually undresses in a seductive and sexually suggestive manner.
broader: https://homosaurus.org/v3/homoit0001299
broader: https://homosaurus.org/v3/homoit0001363
change note: Version 3.7.0
has top concept: Sexual practices
in scheme: v3

Suffragettes
type: Concept
issued: 2019-05-14
modified: 2025-02-23
replaces: suffragettes
comment: Women who seek the right to vote, often through organized protest; typically used to describe members of political movements in the late 1800s and early 1900s focusing on women’s right to vote in the U.S. and Britain.
broader: https://homosaurus.org/v3/homoit0000439
change note: Version 3.7.0
has top concept: Feminists
in scheme: v3

Surrogacy
type: Concept
issued: 2019-05-14
modified: 2025-02-23
replaces: surrogacy
comment: A method or agreement whereby a person consents to carry a pregnancy for another person or people who will become the child's parent(s) after birth.
broader: https://homosaurus.org/v3/homoit0000587
broader: https://homosaurus.org/v3/homoit0000843
broader: https://homosaurus.org/v3/homoit0002618
change note: Version 3.7.0
has top concept: LGBTQ+ families
in scheme: v3
narrower: https://homosaurus.org/v3/homoit0002627
related: https://homosaurus.org/v3/homoit0000390

LGBTQ+ survivors of hate crimes
type: Concept
issued: 2019-05-14
modified: 2025-02-23
replaces: survivorsOfHateCrimesLGBTQ
comment: LGBTQ+ people who have experienced and survived hate crimes; follow the individual's preference for "victims" or "survivors" whenever possible.
alternative label: Survivors of hate crimes (LGBTQ)
broader: https://homosaurus.org/v3/homoit0000613
change note: Version 3.7.0
has top concept: LGBTQ+ people
in scheme: v3
narrower: https://homosaurus.org/v3/homoit0000188
narrower: https://homosaurus.org/v3/homoit0000540
narrower: https://homosaurus.org/v3/homoit0000782
narrower: https://homosaurus.org/v3/homoit0001211
narrower: https://homosaurus.org/v3/homoit0001448
narrower: https://homosaurus.org/v3/homoit0002850
narrower: https://homosaurus.org/v3/homoit0002942
related: https://homosaurus.org/v3/homoit0002373
related: https://homosaurus.org/v3/homoit0002726

LGBTQ+ survivors of rape
type: Concept
issued: 2019-05-14
modified: 2025-02-23
replaces: survivorsOfRapeLGBTQ
comment: LGBTQ+ people who have experienced and survived rape; follow the individual's preference for "victims" or "survivors" whenever possible.
alternative label: Survivors of rape (LGBTQ)
broader: https://homosaurus.org/v3/homoit0000958
change note: Version 3.7.0
has top concept: LGBTQ+ people
in scheme: v3
narrower: https://homosaurus.org/v3/homoit0000189
narrower: https://homosaurus.org/v3/homoit0000541
narrower: https://homosaurus.org/v3/homoit0000783
narrower: https://homosaurus.org/v3/homoit0001212
narrower: https://homosaurus.org/v3/homoit0001449
narrower: https://homosaurus.org/v3/homoit0002851
narrower: https://homosaurus.org/v3/homoit0002943
related: https://homosaurus.org/v3/homoit0002195
related: https://homosaurus.org/v3/homoit0002727

LGBTQ+ survivors of sexual abuse
type: Concept
issued: 2019-05-14
modified: 2025-02-23
replaces: survivorsOfSexualAbuseLGBTQ
comment: LGBTQ+ people who have experienced and survived sexual abuse; follow the individual's preference for "victims" or "survivors" whenever possible.
alternative label: Survivors of sexual abuse (LGBTQ)
broader: https://homosaurus.org/v3/homoit0000959
change note: Version 3.7.0
has top concept: LGBTQ+ people
in scheme: v3
narrower: https://homosaurus.org/v3/homoit0000190
narrower: https://homosaurus.org/v3/homoit0000542
narrower: https://homosaurus.org/v3/homoit0000784
narrower: https://homosaurus.org/v3/homoit0001213
narrower: https://homosaurus.org/v3/homoit0001450
narrower: https://homosaurus.org/v3/homoit0002852
narrower: https://homosaurus.org/v3/homoit0002944
related: https://homosaurus.org/v3/homoit0000855
related: https://homosaurus.org/v3/homoit0000938
related: https://homosaurus.org/v3/homoit0002195
related: https://homosaurus.org/v3/homoit0002728

LGBTQ+ survivors of war
type: Concept
issued: 2019-05-14
modified: 2025-02-23
replaces: survivorsOfWarLGBTQ
comment: LGBTQ+ people who have experienced and survived war; follow the individual's preference for "victims" or "survivors" whenever possible.
alternative label: Survivors of war (LGBTQ)
broader: https://homosaurus.org/v3/homoit0000915
change note: Version 3.7.0
has top concept: LGBTQ+ people
in scheme: v3
narrower: https://homosaurus.org/v3/homoit0000191
narrower: https://homosaurus.org/v3/homoit0000543
narrower: https://homosaurus.org/v3/homoit0000785
narrower: https://homosaurus.org/v3/homoit0001214
narrower: https://homosaurus.org/v3/homoit0001451
narrower: https://homosaurus.org/v3/homoit0002853
narrower: https://homosaurus.org/v3/homoit0002945
related: https://homosaurus.org/v3/homoit0000961
related: https://homosaurus.org/v3/homoit0002729

Switches (Sex)
type: Concept
issued: 2019-05-14
modified: 2025-02-23
replaces: switches
comment: Slang term for individuals who alternate between being the giving partner and the receiving partner in sexual encounters; typically used as a noun (e.g., "They're a switch").
alternative label: Switches
broader: https://homosaurus.org/v3/homoit0001295
broader: https://homosaurus.org/v3/homoit0001304
change note: Version 3.7.0
has top concept: Sexual identity
in scheme: v3
related: https://homosaurus.org/v3/homoit0000103
related: https://homosaurus.org/v3/homoit0000219
related: https://homosaurus.org/v3/homoit0001376
related: https://homosaurus.org/v3/homoit0001779

Swyer syndrome
type: Concept
issued: 2019-05-14
modified: 2025-02-23
replaces: swyerSyndrome
comment: Swyer syndrome occurs when a person is born with XY chromosomes, but their gonads have not developed into testes. It is a form of gonadal dysgenesis, meaning that a person with this variation will have streak gonads that do not produce hormones. Since they do not produce testosterone, their body does not develop a penis and usually develops a vulva and vagina instead. Since they do not produce another hormone known as anti-Müllerian hormone (AMH), people with Swyer syndrome often develop a uterus and fallopian tubes as well. They will not usually start puberty or begin menstruating, but some people with Swyer syndrome do menstruate (without ovulating) if they receive estrogen therapy.
alternative label: XY Gonadal dysgenesis
broader: https://homosaurus.org/v3/homoit0000669
change note: Version 3.7.0
has top concept: Sex (Body)
in scheme: v3

Tattoos
type: Concept
issued: 2019-05-14
modified: 2025-02-23
replaces: tattoos
comment: Body modifications in which permanent ink is inserted into the skin to form a design.
broader: https://homosaurus.org/v3/homoit0000214
broader: https://homosaurus.org/v3/homoit0003076
change note: Version 3.7.0
has top concept: Body adornment
in scheme: v3

Tearoom sex
type: Concept
issued: 2019-05-14
modified: 2025-02-23
replaces: tearoomSex
comment: U.S. slang term that refers to anonymous sex in a public bathroom or the practice of cruising for sexual partners in public bathrooms.
broader: https://homosaurus.org/v3/homoit0001299
change note: Version 3.7.0
has top concept: Sexual practices
in scheme: v3
related: https://homosaurus.org/v3/homoit0000050
related: https://homosaurus.org/v3/homoit0000309
related: https://homosaurus.org/v3/homoit0000319
related: https://homosaurus.org/v3/homoit0001142
related: https://homosaurus.org/v3/homoit0001358

Tearooms (Gay culture)
type: Concept
issued: 2019-05-14
modified: 2025-02-23
replaces: tearooms
comment: U.S. slang term for public bathrooms that are used as locations for sexual encounters.
alternative label: Tearooms
broader: https://homosaurus.org/v3/homoit0000974
change note: Version 3.7.0
has top concept: Sex locations
in scheme: v3
narrower: https://homosaurus.org/v3/homoit0000595
related: https://homosaurus.org/v3/homoit0000308
related: https://homosaurus.org/v3/homoit0001140
related: https://homosaurus.org/v3/homoit0001357

Terminal care (AIDS)
type: Concept
issued: 2019-05-14
modified: 2025-02-23
replaces: terminalCareAIDS
comment: End-of-life care for those with AIDS and their families; aimed at optimizing quality of life and mitigating suffering.
broader: https://homosaurus.org/v3/homoit0000614
change note: Version 3.7.0
has top concept: Health care for LGBTQ+ people
in scheme: v3
related: https://homosaurus.org/v3/homoit0000848
related: https://homosaurus.org/v3/homoit0002258

Testicle
type: Concept
issued: 2019-05-14
modified: 2025-02-23
replaces: testes
comment: Reproductive gland or gonad that produces sperm and androgens, primarily testosterone.
alternative label: Testicles
alternative label: Balls
alternative label: Nuts
alternative label: Testes
alternative label: Testis
broader: https://homosaurus.org/v3/homoit0000401
broader: https://homosaurus.org/v3/homoit0000585
broader: https://homosaurus.org/v3/homoit0000600
change note: Version 3.7.0
has top concept: Erogenous body parts
in scheme: v3
related: https://homosaurus.org/v3/homoit0001846
related: https://homosaurus.org/v3/homoit0001847

Testosterone
type: Concept
issued: 2019-05-14
modified: 2025-02-23
replaces: testosterone
comment: A steroid hormone that is produced in the testes, ovaries, and adrenal cortex. Testosterone is commonly utilized in masculinizing hormone therapy regimens for certain secondary sexual characteristics, such as increased muscle mass and growth of body hair.
broader: https://homosaurus.org/v3/homoit0000317
broader: https://homosaurus.org/v3/homoit0000651
change note: Version 3.7.0
has top concept: Medical care
in scheme: v3
related: https://homosaurus.org/v3/homoit0000436
related: https://homosaurus.org/v3/homoit0001643

Therapies
type: Concept
issued: 2019-05-14
modified: 2025-02-23
replaces: therapies
comment: Treatments addressing impairments, illnesses, diseases, or disorders through counseling and rehabilitation.
broader: https://homosaurus.org/v3/homoit0001004
change note: Version 3.7.0
has top concept: Medical care
in scheme: v3
narrower: https://homosaurus.org/v3/homoit0000106
narrower: https://homosaurus.org/v3/homoit0000303
narrower: https://homosaurus.org/v3/homoit0000317
narrower: https://homosaurus.org/v3/homoit0000394
narrower: https://homosaurus.org/v3/homoit0000617
narrower: https://homosaurus.org/v3/homoit0001007
narrower: https://homosaurus.org/v3/homoit0001274
narrower: https://homosaurus.org/v3/homoit0001496
related: https://homosaurus.org/v3/homoit0001012

Thigh harnesses
type: Concept
issued: 2019-05-14
modified: 2025-02-23
replaces: thighHarnesses
comment: Devices worn to attach a dildo to a person's thigh, typically so they can penetrate a partner's vagina or anus.
broader: https://homosaurus.org/v3/homoit0000612
change note: Version 3.7.0
has top concept: Sex accessories
in scheme: v3
related: https://homosaurus.org/v3/homoit0000354

Third gender
type: Concept
issued: 2019-05-14
modified: 2025-02-23
replaces: thirdGender
comment: Social category present in societies that recognize three or more genders.
broader: https://homosaurus.org/v3/homoit0000322
change note: Version 3.7.0
has top concept: Gender
in scheme: v3
related: https://homosaurus.org/v3/homoit0001369

Third gender people
type: Concept
issued: 2019-05-14
modified: 2025-02-23
replaces: thirdGenderPeople
comment: Individuals who are categorized (by their will or by social consensus) as neither man nor woman.
broader: https://homosaurus.org/v3/homoit0001378
change note: Version 3.7.0
has top concept: LGBTQ+ people
in scheme: v3
related: https://homosaurus.org/v3/homoit0001368

Thirunangai
type: Concept
issued: 2019-05-14
modified: 2025-02-23
replaces: thirunangai
comment: Regional term in Tamil Nadu, India for people assigned male at birth who identify as women.
broader: https://homosaurus.org/v3/homoit0000322
change note: Version 3.7.0
has top concept: Gender
in scheme: v3
related: https://homosaurus.org/v3/homoit0000065

Thirunambi
type: Concept
issued: 2019-05-14
modified: 2025-02-23
replaces: thirunambi
comment: Regional term in Tamil Nadu, India for people assigned female at birth who identify as men.
broader: https://homosaurus.org/v3/homoit0000322
change note: Version 3.7.0
has top concept: Gender
in scheme: v3

Tida wena
type: Concept
issued: 2019-05-14
modified: 2025-02-23
replaces: tidaWena
comment: In Venezuela's indigenous Warao culture, this term refers to people assigned male at birth who are thought to possess two spirits and often assume a spiritual role; translates to "twisted women."
broader: https://homosaurus.org/v3/homoit0000322
change note: Version 3.7.0
has top concept: Gender
in scheme: v3
related: https://homosaurus.org/v3/homoit0001480

Tom
type: Concept
issued: 2019-05-14
modified: 2025-02-23
replaces: tom
comment: In Thailand, this term is used to describe people assigned female at birth who exhibit masculine traits, often partnering with feminine dees; similar to a butch in U.S. lesbian culture.
broader: https://homosaurus.org/v3/homoit0000322
change note: Version 3.7.0
has top concept: Gender
in scheme: v3
related: https://homosaurus.org/v3/homoit0000340
related: https://homosaurus.org/v3/homoit0000687

Tomboys
type: Concept
issued: 2019-05-14
modified: 2025-02-23
replaces: tomboys
comment: Girls who exhibit some characteristics associated with gender expectations for boys.
broader: https://homosaurus.org/v3/homoit0000577
broader: https://homosaurus.org/v3/homoit0000590
change note: Version 3.7.0
has top concept: Role behavior
in scheme: v3
related: https://homosaurus.org/v3/homoit0000231
related: https://homosaurus.org/v3/homoit0002061

Tongzhi
type: Concept
issued: 2019-05-14
modified: 2025-02-23
replaces: tongzhi
comment: Contemporary term for LGBTQ+ people in China and Taiwan.
alternative label: Tongzhis
broader: https://homosaurus.org/v3/homoit0001297
change note: Version 3.7.0
has top concept: Sexual minorities
in scheme: v3

Tops (Sex)
type: Concept
issued: 2019-05-14
modified: 2025-02-23
replaces: tops
comment: Slang term for individuals who act as the giving partner in sexual encounters.
alternative label: Pitchers (Sex)
alternative label: Pitchers
alternative label: Tops
broader: https://homosaurus.org/v3/homoit0001295
broader: https://homosaurus.org/v3/homoit0001304
change note: Version 3.7.0
has top concept: Sexual identity
in scheme: v3
narrower: https://homosaurus.org/v3/homoit0001018
related: https://homosaurus.org/v3/homoit0000103
related: https://homosaurus.org/v3/homoit0000219
related: https://homosaurus.org/v3/homoit0000999
related: https://homosaurus.org/v3/homoit0001133
related: https://homosaurus.org/v3/homoit0001318
related: https://homosaurus.org/v3/homoit0001353
related: https://homosaurus.org/v3/homoit0001779
related: https://homosaurus.org/v3/homoit0002197
related: https://homosaurus.org/v3/homoit0003052
related: https://homosaurus.org/v3/homoit0003084

Toxic masculinity
type: Concept
issued: 2019-05-14
modified: 2025-02-23
replaces: toxicMasculinity
comment: Set of attitudes, behaviors, and cultural norms stereotypically associated with or expected of men and which are regarded as having a negative impact on men and society at large.
broader: https://homosaurus.org/v3/homoit0000995
change note: Version 3.7.0
has top concept: Gender
in scheme: v3
related: https://homosaurus.org/v3/homoit0000655
related: https://homosaurus.org/v3/homoit0001133

Transgender people
type: Concept
issued: 2019-05-14
modified: 2025-02-23
replaces: transgenderPeople
comment: Broad term for people who do not conform to their gender assigned at birth. Add more specific terms when possible.
alternative label: Trans people
alternative label: Transgendered people
alternative label: Transpeople
alternative label: Trans-people
alternative label: Transgender-identified people
alternative label: Trans-identified people
alternative label: Trans* people
broader: https://homosaurus.org/v3/homoit0000915
broader: https://homosaurus.org/v3/homoit0001817
change note: Version 3.7.0
has top concept: LGBTQ+ people
in scheme: v3
narrower: https://homosaurus.org/v3/homoit0000021
narrower: https://homosaurus.org/v3/homoit0000045
narrower: https://homosaurus.org/v3/homoit0000111
narrower: https://homosaurus.org/v3/homoit0000342
narrower: https://homosaurus.org/v3/homoit0000457
narrower: https://homosaurus.org/v3/homoit0000570
narrower: https://homosaurus.org/v3/homoit0001027
narrower: https://homosaurus.org/v3/homoit0001048
narrower: https://homosaurus.org/v3/homoit0001058
narrower: https://homosaurus.org/v3/homoit0001072
narrower: https://homosaurus.org/v3/homoit0001369
narrower: https://homosaurus.org/v3/homoit0001381
narrower: https://homosaurus.org/v3/homoit0001382
narrower: https://homosaurus.org/v3/homoit0001400
narrower: https://homosaurus.org/v3/homoit0001407
narrower: https://homosaurus.org/v3/homoit0001413
narrower: https://homosaurus.org/v3/homoit0001422
narrower: https://homosaurus.org/v3/homoit0001430
narrower: https://homosaurus.org/v3/homoit0001446
narrower: https://homosaurus.org/v3/homoit0001452
narrower: https://homosaurus.org/v3/homoit0001466
narrower: https://homosaurus.org/v3/homoit0001474
narrower: https://homosaurus.org/v3/homoit0001642
narrower: https://homosaurus.org/v3/homoit0001643
narrower: https://homosaurus.org/v3/homoit0001668
narrower: https://homosaurus.org/v3/homoit0001784
narrower: https://homosaurus.org/v3/homoit0003045
narrower: https://homosaurus.org/v3/homoit0003226
related: https://homosaurus.org/v3/homoit0000120
related: https://homosaurus.org/v3/homoit0000271
related: https://homosaurus.org/v3/homoit0000288
related: https://homosaurus.org/v3/homoit0000316
related: https://homosaurus.org/v3/homoit0000317
related: https://homosaurus.org/v3/homoit0000322
related: https://homosaurus.org/v3/homoit0000396
related: https://homosaurus.org/v3/homoit0000561
related: https://homosaurus.org/v3/homoit0000566
related: https://homosaurus.org/v3/homoit0000571
related: https://homosaurus.org/v3/homoit0000572
related: https://homosaurus.org/v3/homoit0000573
related: https://homosaurus.org/v3/homoit0000574
related: https://homosaurus.org/v3/homoit0000582
related: https://homosaurus.org/v3/homoit0001008
related: https://homosaurus.org/v3/homoit0001047
related: https://homosaurus.org/v3/homoit0001049
related: https://homosaurus.org/v3/homoit0001078
related: https://homosaurus.org/v3/homoit0001089
related: https://homosaurus.org/v3/homoit0001090
related: https://homosaurus.org/v3/homoit0001107
related: https://homosaurus.org/v3/homoit0001129
related: https://homosaurus.org/v3/homoit0001131
related: https://homosaurus.org/v3/homoit0001233
related: https://homosaurus.org/v3/homoit0001399
related: https://homosaurus.org/v3/homoit0001403
related: https://homosaurus.org/v3/homoit0001404
related: https://homosaurus.org/v3/homoit0001415
related: https://homosaurus.org/v3/homoit0001431
related: https://homosaurus.org/v3/homoit0001463
related: https://homosaurus.org/v3/homoit0001464
related: https://homosaurus.org/v3/homoit0001465
related: https://homosaurus.org/v3/homoit0001467
related: https://homosaurus.org/v3/homoit0001470

Trans marches
type: Concept
issued: 2019-05-14
modified: 2025-02-23
replaces: transMarches
comment: Marches and gatherings focused on trans issues and rights.
alternative label: Transgender marches
broader: https://homosaurus.org/v3/homoit0003651
change note: Version 3.7.0
has top concept: LGBTQ+ events
in scheme: v3
related: https://homosaurus.org/v3/homoit0003655

Transsexual people
type: Concept
issued: 2019-05-14
modified: 2025-02-23
replaces: transsexualPeople
comment: Individuals who transition from female to male or male to female. Generally refers to individuals who transition their physical bodies to align with their gender identities. Though this term was popular in the 20th century and is still in use today, it has been largely replaced by "transgender people" and "trans people." Some but not all people regard this term as outdated and offensive. Only use to describe people who self-identify as transsexual.
alternative label: Transexuals
alternative label: Transsexuals
broader: https://homosaurus.org/v3/homoit0001378
change note: Version 3.7.0
has top concept: LGBTQ+ people
in scheme: v3
narrower: https://homosaurus.org/v3/homoit0000436
narrower: https://homosaurus.org/v3/homoit0000986
related: https://homosaurus.org/v3/homoit0000273
related: https://homosaurus.org/v3/homoit0000561
related: https://homosaurus.org/v3/homoit0000572
related: https://homosaurus.org/v3/homoit0001047
related: https://homosaurus.org/v3/homoit0001049
related: https://homosaurus.org/v3/homoit0001073
related: https://homosaurus.org/v3/homoit0001129
related: https://homosaurus.org/v3/homoit0001131
related: https://homosaurus.org/v3/homoit0001380
related: https://homosaurus.org/v3/homoit0001464
related: https://homosaurus.org/v3/homoit0001465
related: https://homosaurus.org/v3/homoit0001468
related: https://homosaurus.org/v3/homoit0001781

Transfeminine people
type: Concept
issued: 2019-05-14
modified: 2025-02-23
replaces: transfemininePeople
comment: People who identify partially or fully with a feminine gender identity and who were typically (but not always) assigned male at birth.
broader: https://homosaurus.org/v3/homoit0001378
change note: Version 3.7.0
has top concept: LGBTQ+ people
in scheme: v3
related: https://homosaurus.org/v3/homoit0000389
related: https://homosaurus.org/v3/homoit0001652
related: https://homosaurus.org/v3/homoit0001821
related: https://homosaurus.org/v3/homoit0002043

Transgender activism
type: Concept
issued: 2019-05-14
modified: 2025-02-23
replaces: transgenderActivism
comment: Direct action and organizing to achieve political or social change and acceptance for transgender people.
broader: https://homosaurus.org/v3/homoit0000006
change note: Version 3.7.0
has top concept: LGBTQ+ activism
in scheme: v3
related: https://homosaurus.org/v3/homoit0001434

African American transgender people
type: Concept
issued: 2019-05-14
modified: 2025-02-23
replaces: transgenderAfricanAmericans
comment: Transgender people of African descent born in the United States or transgender people born in African countries who live in or have a strong connection to the United States. Use for individuals who self-identity as African American. Follow the individual’s preference for African American or Black whenever possible.
alternative label: Transgender African American people
alternative label: Transgender African Americans
broader: https://homosaurus.org/v3/homoit0000015
broader: https://homosaurus.org/v3/homoit0001396
change note: Version 3.7.0
has top concept: LGBTQ+ people
in scheme: v3

Afro-Canadian transgender people
type: Concept
issued: 2019-05-14
modified: 2025-02-23
replaces: transgenderAfroCanadians
comment: Transgender people of African descent born in Canada or transgender people born in African countries who live in or have a strong connection to Canada. Use for individuals who self-identify as Afro-Canadian.
alternative label: Transgender Afro-Canadian people
alternative label: Transgender Afro-Canadians
broader: https://homosaurus.org/v3/homoit0000016
broader: https://homosaurus.org/v3/homoit0001396
change note: Version 3.7.0
has top concept: LGBTQ+ people
in scheme: v3

Afro-Caribbean transgender people
type: Concept
issued: 2019-05-14
modified: 2025-02-23
replaces: transgenderAfroCaribbeans
comment: Transgender people of African descent born in the Caribbean or transgender people born in African countries who live in or have a strong connection to the Caribbean. Only use for individuals who self-identify as Afro-Caribbean.
alternative label: Transgender Afro-Caribbean people
alternative label: Transgender Afro-Caribbeans
broader: https://homosaurus.org/v3/homoit0000017
broader: https://homosaurus.org/v3/homoit0001396
change note: Version 3.7.0
has top concept: LGBTQ+ people
in scheme: v3

Afro-European transgender people
type: Concept
issued: 2019-05-14
modified: 2025-02-23
replaces: transgenderAfroEuropeans
comment: Transgender people of African descent born in European countries or transgender people born in African countries who live in or have a strong connection to Europe. Only use for individuals who self-identify as Afro-European.
alternative label: Transgender Afro-European people
alternative label: Transgender Afro-Europeans
broader: https://homosaurus.org/v3/homoit0000018
broader: https://homosaurus.org/v3/homoit0001396
change note: Version 3.7.0
has top concept: LGBTQ+ people
in scheme: v3

Afro-Latin American transgender people
type: Concept
issued: 2019-05-14
modified: 2025-02-23
replaces: transgenderAfroLatinAmericans
comment: Transgender people of African descent born in Latin American countries or transgender people born in African countries who live in or have a strong connection to Latin America. Only use for individuals who self-identify as Afro-Latin American.
alternative label: Transgender Afro-Latin American people
alternative label: Transgender Afro-Latin Americans
broader: https://homosaurus.org/v3/homoit0000019
broader: https://homosaurus.org/v3/homoit0001396
change note: Version 3.7.0
has top concept: LGBTQ+ people
in scheme: v3

Transgender archives
type: Concept
issued: 2019-05-14
modified: 2025-02-23
replaces: transgenderArchives
comment: Collections of records and materials relating to transgender people or transgender communities; can include a variety of organizations and institutions from community to government archives.
broader: https://homosaurus.org/v3/homoit0000066
change note: Version 3.7.0
has top concept: LGBTQ+ cultural heritage institutions
in scheme: v3

Transgender artists
type: Concept
issued: 2019-05-14
modified: 2025-02-23
replaces: transgenderArtists
comment: Trans people who practice any of various creative arts.
broader: https://homosaurus.org/v3/homoit0000070
change note: Version 3.7.0
has top concept: LGBTQ+ people
in scheme: v3

Asian American transgender people
type: Concept
issued: 2019-05-14
modified: 2025-02-23
replaces: transgenderAsianAmericans
comment: Transgender people of Asian heritage or descent born in the United States or born in Asian countries who live in or have a strong connection to the United States. Only use for individuals who self-identify as Asian American.
alternative label: Transgender Asian American people
alternative label: Transgender Asian Americans
broader: https://homosaurus.org/v3/homoit0000073
broader: https://homosaurus.org/v3/homoit0001392
change note: Version 3.7.0
has top concept: LGBTQ+ people
in scheme: v3

Asian transgender people
type: Concept
issued: 2019-05-14
modified: 2025-02-23
replaces: transgenderAsians
comment: Transgender people of Asian heritage or descent, living in Asia or part of the Asian diaspora. Only use for people who self-identify as Asian.
alternative label: Transgender Asian people
alternative label: Transgender Asians
broader: https://homosaurus.org/v3/homoit0000074
change note: Version 3.7.0
has top concept: LGBTQ+ people
in scheme: v3
narrower: https://homosaurus.org/v3/homoit0001391

Transgender atheists
type: Concept
issued: 2019-05-14
modified: 2025-02-23
replaces: transgenderAtheists
comment: Transgender people who are atheists.
broader: https://homosaurus.org/v3/homoit0000082
change note: Version 3.7.0
has top concept: LGBTQ+ people
in scheme: v3

Transgender bars
type: Concept
issued: 2019-05-14
modified: 2025-02-23
replaces: transgenderBars
comment: Drinking establishments that primarily cater to transgender people.
broader: https://homosaurus.org/v3/homoit0000100
change note: Version 3.7.0
has top concept: LGBTQ+ meeting places
in scheme: v3

Transgender beaches
type: Concept
issued: 2019-05-14
modified: 2025-02-23
replaces: transgenderBeaches
comment: Beaches set aside for use by transgender people or beaches known to be frequented by transgender people.
broader: https://homosaurus.org/v3/homoit0000104
change note: Version 3.7.0
has top concept: LGBTQ+ meeting places
in scheme: v3

Black transgender people
type: Concept
issued: 2019-05-14
modified: 2025-02-23
replaces: transgenderBlackPeople
comment: Black people who are transgender. Use only for individuals who self-identity as Black. Follow the individual’s preference for African American or Black whenever possible.
alternative label: Transgender Black people
broader: https://homosaurus.org/v3/homoit0000208
change note: Version 3.7.0
has top concept: LGBTQ+ people
in scheme: v3
narrower: https://homosaurus.org/v3/homoit0001384
narrower: https://homosaurus.org/v3/homoit0001385
narrower: https://homosaurus.org/v3/homoit0001386
narrower: https://homosaurus.org/v3/homoit0001387
narrower: https://homosaurus.org/v3/homoit0001388
related: https://homosaurus.org/v3/homoit0002399

Transgender bookshops
type: Concept
issued: 2019-05-14
modified: 2025-02-23
replaces: transgenderBookshops
comment: Bookshops that sell materials intended for use by transgender people or addressing topics related to transgender experiences.
broader: https://homosaurus.org/v3/homoit0000216
change note: Version 3.7.0
has top concept: LGBTQ+ bookshops
in scheme: v3

Transgender Buddhists
type: Concept
issued: 2019-05-14
modified: 2025-02-23
replaces: transgenderBuddhists
comment: Transgender people who are Buddhist.
broader: https://homosaurus.org/v3/homoit0000225
change note: Version 3.7.0
has top concept: LGBTQ+ religious people
in scheme: v3

Transgender characters
type: Concept
issued: 2019-05-14
modified: 2025-02-23
replaces: transgenderCharacters
comment: Characters in creative works who are transgender.
broader: https://homosaurus.org/v3/homoit0000249
change note: Version 3.7.0
has top concept: LGBTQ+ characters
in scheme: v3
related: https://homosaurus.org/v3/homoit0001378
related: https://homosaurus.org/v3/homoit0001400

Transgender children
type: Concept
issued: 2019-05-14
modified: 2025-02-23
replaces: transgenderChildren
comment: Transgender people who have not yet reached the age of adolescence.
broader: https://homosaurus.org/v3/homoit0000256
broader: https://homosaurus.org/v3/homoit0001378
broader: https://homosaurus.org/v3/homoit0001452
change note: Version 3.7.0
has top concept: Family members
in scheme: v3
narrower: https://homosaurus.org/v3/homoit0001407
narrower: https://homosaurus.org/v3/homoit0001446
related: https://homosaurus.org/v3/homoit0001138
related: https://homosaurus.org/v3/homoit0001399
related: https://homosaurus.org/v3/homoit0001415
related: https://homosaurus.org/v3/homoit0003502
related: https://homosaurus.org/v3/homoit0003514

Transgender Christians
type: Concept
issued: 2019-05-14
modified: 2025-02-23
replaces: transgenderChristians
comment: Transgender people who are Christian.
broader: https://homosaurus.org/v3/homoit0000265
change note: Version 3.7.0
has top concept: LGBTQ+ religious people
in scheme: v3

Transgender clergy
type: Concept
issued: 2019-05-14
modified: 2025-02-23
replaces: transgenderClergy
comment: Transgender people who are ordained for religious duties, particularly in the Christian Church.
broader: https://homosaurus.org/v3/homoit0001624
change note: Version 3.7.0
has top concept: LGBTQ+ clergy
in scheme: v3
related: https://homosaurus.org/v3/homoit0000142
related: https://homosaurus.org/v3/homoit0000244
related: https://homosaurus.org/v3/homoit0000484
related: https://homosaurus.org/v3/homoit0000732
related: https://homosaurus.org/v3/homoit0001169

Transgender community
type: Concept
issued: 2019-05-14
modified: 2025-02-23
replaces: transgenderCommunity
comment: Groups of people who share the experience of being transgender.
broader: https://homosaurus.org/v3/homoit0000297
change note: Version 3.7.0
has top concept: LGBTQ+ communities
in scheme: v3
related: https://homosaurus.org/v3/homoit0000594
related: https://homosaurus.org/v3/homoit0000804
related: https://homosaurus.org/v3/homoit0000805
related: https://homosaurus.org/v3/homoit0000806
related: https://homosaurus.org/v3/homoit0000807
related: https://homosaurus.org/v3/homoit0000882
related: https://homosaurus.org/v3/homoit0001378
related: https://homosaurus.org/v3/homoit0001780
related: https://homosaurus.org/v3/homoit0001789
related: https://homosaurus.org/v3/homoit0003708

Transgender community centers
type: Concept
issued: 2019-05-14
modified: 2025-02-23
replaces: transgenderCommunityCentres
comment: Spaces in which people from transgender communities meet for social, education, recreational, or organizing activities.
broader: https://homosaurus.org/v3/homoit0000298
change note: Version 3.7.0
has top concept: LGBTQ+ centers
in scheme: v3
preferred label: Transgender community centres
related: https://homosaurus.org/v3/homoit0001378

Transgender couples
type: Concept
issued: 2019-05-14
modified: 2025-02-23
replaces: transgenderCouples
comment: Partnerships in which both people are transgender.
broader: https://homosaurus.org/v3/homoit0000310
change note: Version 3.7.0
has top concept: LGBTQ+ relationships
in scheme: v3

Transgender culture
type: Concept
issued: 2019-05-14
modified: 2025-02-23
replaces: transgenderCulture
comment: Cultural experiences shared by members of transgender communities or products of transgender culture (e.g., art and media created by and for transgender people, activism focused on transgender issues, slang commonly used in transgender communities, etc.).
broader: https://homosaurus.org/v3/homoit0001831
change note: Version 3.7.0
has top concept: Subcultures
in scheme: v3
narrower: https://homosaurus.org/v3/homoit0001445
related: https://homosaurus.org/v3/homoit0001295
related: https://homosaurus.org/v3/homoit0001832
related: https://homosaurus.org/v3/homoit0001833

Transgender daughters
type: Concept
issued: 2019-05-14
modified: 2025-02-23
replaces: transgenderDaughters
comment: Daughters who identify as transgender.
broader: https://homosaurus.org/v3/homoit0000330
broader: https://homosaurus.org/v3/homoit0001378
broader: https://homosaurus.org/v3/homoit0001400
change note: Version 3.7.0
has top concept: LGBTQ+ people
in scheme: v3

Transgender Day of Remembrance
type: Concept
issued: 2019-05-14
modified: 2025-02-23
replaces: transgenderDayOfRemembrance
comment: International day of observance recognized annually on November 20 to honor the memory and lives of trans people who were murdered in the previous 12 months and to draw attention to the continued violence against trans people. Transgender Day of Remembrance (abbreviated TDoR) was founded in 1999 by a small group of trans people, including Gwendolyn Ann Smith, to memorialize Rita Hester, a trans woman murdered in Allston, Massachusetts.
alternative label: TDOR
alternative label: TDoR
alternative label: Trans Day of Remembrance
broader: https://homosaurus.org/v3/homoit0000901
change note: Version 3.7.0
has top concept: LGBTQ+ memorials
in scheme: v3

Transgender information centers
type: Concept
issued: 2019-05-14
modified: 2025-02-23
replaces: transgenderInformationCentres
comment: Institutions providing education, support, and information about transgender issues and transgender communities to transgender people.
alternative label: Transgender documentation centers
broader: https://homosaurus.org/v3/homoit0000660
change note: Version 3.7.0
has top concept: LGBTQ+ centers
in scheme: v3
preferred label: Transgender information centres
related: https://homosaurus.org/v3/homoit0001423
related: https://homosaurus.org/v3/homoit0001463

Transgender dominatrices
type: Concept
issued: 2019-05-14
modified: 2025-02-23
replaces: transgenderDominatrices
comment: Women who take a dominant role in BDSM activities; use for dominatrices who identify as transgender.
broader: https://homosaurus.org/v3/homoit0000363
change note: Version 3.7.0
has top concept: Relationship minorities
in scheme: v3
related: https://homosaurus.org/v3/homoit0000148
related: https://homosaurus.org/v3/homoit0000738
related: https://homosaurus.org/v3/homoit0001175

Transgender drama
type: Concept
issued: 2019-05-14
modified: 2025-02-23
replaces: transgenderDrama
comment: Works of fiction written to be performed; use in reference to dramatic works focusing on transgender characters or themes.
broader: https://homosaurus.org/v3/homoit0000376
change note: Version 3.7.0
has top concept: Subcultures
in scheme: v3
related: https://homosaurus.org/v3/homoit0001727

Transgender families
type: Concept
issued: 2019-05-14
modified: 2025-02-23
replaces: transgenderFamilies
comment: Families, whether biological, adoptive, or chosen, in which one or more individuals identify as transgender.
broader: https://homosaurus.org/v3/homoit0000420
change note: Version 3.7.0
has top concept: LGBTQ+ families
in scheme: v3
related: https://homosaurus.org/v3/homoit0000261
related: https://homosaurus.org/v3/homoit0001430
related: https://homosaurus.org/v3/homoit0002587

Transgender fathers
type: Concept
issued: 2019-05-14
modified: 2025-02-23
replaces: transgenderFathers
comment: Transgender people who are fathers.
broader: https://homosaurus.org/v3/homoit0001378
broader: https://homosaurus.org/v3/homoit0001430
broader: https://homosaurus.org/v3/homoit0002337
change note: Version 3.7.0
has top concept: LGBTQ+ people
in scheme: v3

Transgender fiction
type: Concept
issued: 2019-05-14
modified: 2025-02-23
replaces: transgenderFiction
comment: Written works describing imagined events or people; use in reference to fictional works focusing on transgender characters or themes.
broader: https://homosaurus.org/v3/homoit0000443
change note: Version 3.7.0
has top concept: Subcultures
in scheme: v3
related: https://homosaurus.org/v3/homoit0001727
related: https://homosaurus.org/v3/homoit0001752
related: https://homosaurus.org/v3/homoit0001753
related: https://homosaurus.org/v3/homoit0001754
related: https://homosaurus.org/v3/homoit0002210
related: https://homosaurus.org/v3/homoit0002211

Transgender identity
type: Concept
issued: 2019-05-14
modified: 2025-02-23
replaces: transgenderIdentity
comment: Identity term used to describe people who cross or transgress the gender they were assigned at birth.
broader: https://homosaurus.org/v3/homoit0000571
change note: Version 3.7.0
has top concept: Gender
in scheme: v3
related: https://homosaurus.org/v3/homoit0001378
related: https://homosaurus.org/v3/homoit0001400
related: https://homosaurus.org/v3/homoit0001563

Jewish transgender people
type: Concept
issued: 2019-05-14
modified: 2025-02-23
replaces: transgenderJews
comment: Transgender people who are Jewish.
alternative label: Transgender Jews
broader: https://homosaurus.org/v3/homoit0000682
change note: Version 3.7.0
has top concept: LGBTQ+ people
in scheme: v3

Latino/a/x transgender people
type: Concept
issued: 2019-05-14
modified: 2025-02-23
replaces: transgenderLatinx
comment: Latin American people who are transgender; only use to describe individuals who self-identify as Latino, Latina, or Latinx. Do not conflate with Chicano/a/x or Hispanic.
alternative label: Latina transgender people
alternative label: Latine transgender people
alternative label: Latino transgender people
alternative label: Latinx transgender people
alternative label: Transgender Latinas
alternative label: Transgender Latine people
alternative label: Transgender Latinos
alternative label: Transgender Latinx people
broader: https://homosaurus.org/v3/homoit0000253
change note: Version 3.7.0
has top concept: LGBTQ+ people
in scheme: v3

Transgender libraries
type: Concept
issued: 2019-05-14
modified: 2025-02-23
replaces: transgenderLibraries
comment: Libraries that hold materials primarily pertaining to transgender people or intended for use by transgender people.
broader: https://homosaurus.org/v3/homoit0000968
change note: Version 3.7.0
has top concept: LGBTQ+ cultural heritage institutions
in scheme: v3

Transgender literature
type: Concept
issued: 2019-05-14
modified: 2025-02-23
replaces: transgenderLiterature
comment: Written literary works about transgender characters or themes.
broader: https://homosaurus.org/v3/homoit0000972
change note: Version 3.7.0
has top concept: Subcultures
in scheme: v3
related: https://homosaurus.org/v3/homoit0001727

Transgender dominants
type: Concept
issued: 2019-05-14
modified: 2025-02-23
replaces: transgenderMasters
comment: Transgender people who are part of the BDSM scene and assume the dominant role in sexual relationships with a dominant/submissive dynamic.
alternative label: Transgender masters
broader: https://homosaurus.org/v3/homoit0000999
change note: Version 3.7.0
has top concept: Sexual identity
in scheme: v3

Transgender mistresses
type: Concept
issued: 2019-05-14
modified: 2025-02-23
replaces: transgenderMistresses
comment: Transgender women who are part of the BDSM scene and assume the mistress role in sexual relationships with a mistress/submissive dynamic.
broader: https://homosaurus.org/v3/homoit0001018
change note: Version 3.7.0
has top concept: Sexual identity
in scheme: v3
related: https://homosaurus.org/v3/homoit0000161
related: https://homosaurus.org/v3/homoit0000751
related: https://homosaurus.org/v3/homoit0001186

Transgender mothers
type: Concept
issued: 2019-05-14
modified: 2025-02-23
replaces: transgenderMothers
comment: Transgender people who are mothers.
broader: https://homosaurus.org/v3/homoit0001378
broader: https://homosaurus.org/v3/homoit0001430
broader: https://homosaurus.org/v3/homoit0002343
change note: Version 3.7.0
has top concept: LGBTQ+ people
in scheme: v3

Transgender movement
type: Concept
issued: 2019-05-14
modified: 2025-02-23
replaces: transgenderMovement
comment: Umbrella term for activism focused on the rights of transgender people and issues faced by transgender communities.
broader: https://homosaurus.org/v3/homoit0001026
change note: Version 3.7.0
has top concept: Social movements
in scheme: v3
related: https://homosaurus.org/v3/homoit0001409
related: https://homosaurus.org/v3/homoit0001436
related: https://homosaurus.org/v3/homoit0001453
related: https://homosaurus.org/v3/homoit0001463

Transgender museums
type: Concept
issued: 2019-05-14
modified: 2025-02-23
replaces: transgenderMuseums
comment: Institutions dedicated to the storage, exhibition, conservation, and preservation of materials relating to transgender people and transgender history.
broader: https://homosaurus.org/v3/homoit0001030
change note: Version 3.7.0
has top concept: LGBTQ+ cultural heritage institutions
in scheme: v3

Transgender Muslims
type: Concept
issued: 2019-05-14
modified: 2025-02-23
replaces: transgenderMuslims
comment: Transgender people who are Muslim.
broader: https://homosaurus.org/v3/homoit0001032
change note: Version 3.7.0
has top concept: LGBTQ+ religious people
in scheme: v3

Native American transgender people
type: Concept
issued: 2019-05-14
modified: 2025-02-23
replaces: transgenderNativeAmericans
comment: People who are part of the Native peoples of the continental United States and Canada (excluding Inuit people) and self-identity as transgender. Use more specific terms when available.
alternative label: American Indian transgender people
alternative label: Transgender American Indians
alternative label: Transgender Native Americans
broader: https://homosaurus.org/v3/homoit0001037
change note: Version 3.7.0
has top concept: LGBTQ+ people
in scheme: v3

Transgender newsletters
type: Concept
issued: 2019-05-14
modified: 2025-02-23
replaces: transgenderNewsletters
comment: Serialized print or digital periodicals created by or for transgender people, often with the purpose of sharing news and information related to transgender communities and transgender issues.
broader: https://homosaurus.org/v3/homoit0001041
broader: https://homosaurus.org/v3/homoit0001436
change note: Version 3.7.0
has top concept: LGBTQ+ press
in scheme: v3
related: https://homosaurus.org/v3/homoit0001428

Transgender newspapers
type: Concept
issued: 2019-05-14
modified: 2025-02-23
replaces: transgenderNewspapers
comment: Serialized print or digital publications about transgender people or transgender issues (and typically produced by transgender people or transgender organizations) that contain news, articles, columns, correspondence, and advertisements.
broader: https://homosaurus.org/v3/homoit0001042
broader: https://homosaurus.org/v3/homoit0001436
change note: Version 3.7.0
has top concept: LGBTQ+ press
in scheme: v3
related: https://homosaurus.org/v3/homoit0001427

Transgender Pagans
type: Concept
issued: 2019-05-14
modified: 2025-02-23
replaces: transgenderPagans
comment: Transgender people who are members of polytheistic religions or other religions outside of the dominant culture that typically incorporate nature worship and/or the sacred feminine, such as Wicca, Druidry, Heathenry, etc. Use to describe transgender people who self-identify as Pagan.
broader: https://homosaurus.org/v3/homoit0001069
change note: Version 3.7.0
has top concept: LGBTQ+ religious people
in scheme: v3
related: https://homosaurus.org/v3/homoit0001911

Transgender parents
type: Concept
issued: 2019-05-14
modified: 2025-02-23
replaces: transgenderParents
comment: Transgender people who are parents.
broader: https://homosaurus.org/v3/homoit0001075
broader: https://homosaurus.org/v3/homoit0001378
change note: Version 3.7.0
has top concept: LGBTQ+ families
in scheme: v3
narrower: https://homosaurus.org/v3/homoit0001413
narrower: https://homosaurus.org/v3/homoit0001422
related: https://homosaurus.org/v3/homoit0000261
related: https://homosaurus.org/v3/homoit0001412
related: https://homosaurus.org/v3/homoit0002586
related: https://homosaurus.org/v3/homoit0002587

Transgender people in the military
type: Concept
issued: 2019-05-14
modified: 2025-02-23
replaces: transgenderPeopleInTheMilitary
comment: Transgender people serving in state and national armed forces.
broader: https://homosaurus.org/v3/homoit0001100
change note: Version 3.7.0
has top concept: Legal status
in scheme: v3
related: https://homosaurus.org/v3/homoit0001378

Transgender people of color
type: Concept
issued: 2019-05-14
modified: 2025-02-23
replaces: transgenderPeopleOfColour
comment: Primarily used in the United States, this term refers to transgender people who are not white and who identify as people of color.
alternative label: Trans people of color
broader: https://homosaurus.org/v3/homoit0001101
change note: Version 3.7.0
has top concept: LGBTQ+ people
in scheme: v3
preferred label: Transgender people of colour

Transgender poetry
type: Concept
issued: 2019-05-14
modified: 2025-02-23
replaces: transgenderPoetry
comment: Literary works, typically written in verse, that focus on transgender characters, transgender themes, or transgender identity.
broader: https://homosaurus.org/v3/homoit0001118
change note: Version 3.7.0
has top concept: Subcultures
in scheme: v3
related: https://homosaurus.org/v3/homoit0001727

Transgender political activists
type: Concept
issued: 2019-05-14
modified: 2025-02-23
replaces: transgenderPoliticalActivists
comment: Transgender people working to bring about political or social change through public organizing.
broader: https://homosaurus.org/v3/homoit0000007
change note: Version 3.7.0
has top concept: LGBTQ+ people
in scheme: v3
related: https://homosaurus.org/v3/homoit0001383

Transgender porn films
type: Concept
issued: 2019-05-14
modified: 2025-02-23
replaces: transgenderPornFilms
comment: Erotic or sexually explicit films featuring transgender people.
broader: https://homosaurus.org/v3/homoit0000013
broader: https://homosaurus.org/v3/homoit0002610
change note: Version 3.7.0
has top concept: Subcultures
in scheme: v3
related: https://homosaurus.org/v3/homoit0002549

Transgender press
type: Concept
issued: 2019-05-14
modified: 2025-02-23
replaces: transgenderPress
comment: Newspapers, magazines, or other publishing outlets aimed at transgender audiences and/or operated by transgender people.
broader: https://homosaurus.org/v3/homoit0001132
change note: Version 3.7.0
has top concept: LGBTQ+ press
in scheme: v3
narrower: https://homosaurus.org/v3/homoit0001427
narrower: https://homosaurus.org/v3/homoit0001428
narrower: https://homosaurus.org/v3/homoit0003149
related: https://homosaurus.org/v3/homoit0000896
related: https://homosaurus.org/v3/homoit0001423

Transgender sex workers
type: Concept
issued: 2019-05-14
modified: 2025-02-23
replaces: transgenderProstitutes
comment: Transgender people who receive money or goods in exchange for sexual services, performances, or companionship. Use to describe transgender people working across the broad spectrum of sex work.
alternative label: Trans sex workers
alternative label: Transgender prostitutes
alternative label: Trans prostitutes
alternative label: Transgender prostitution
alternative label: Transgender sex work
alternative label: Trans sex work
broader: https://homosaurus.org/v3/homoit0001277
change note: Version 3.7.0
has top concept: Sex workers
in scheme: v3

Transgender Protestants
type: Concept
issued: 2019-05-14
modified: 2025-02-23
replaces: transgenderProtestants
comment: Transgender people who are members of the Protestant Church.
broader: https://homosaurus.org/v3/homoit0001137
change note: Version 3.7.0
has top concept: LGBTQ+ religious people
in scheme: v3

Transgender publishers
type: Concept
issued: 2019-05-14
modified: 2025-02-23
replaces: transgenderPublishers
comment: Companies and organizations that publish materials for transgender communities or addressing transgender issues.
broader: https://homosaurus.org/v3/homoit0001144
change note: Version 3.7.0
has top concept: LGBTQ+ publishers
in scheme: v3

Transgender radio
type: Concept
issued: 2019-05-14
modified: 2025-02-23
replaces: transgenderRadio
comment: Auditory content broadcast on the radio (analog or digital) about transgender people and transgender issues.
broader: https://homosaurus.org/v3/homoit0001231
change note: Version 3.7.0
has top concept: LGBTQ+ radio
in scheme: v3

Transgender relationships
type: Concept
issued: 2019-05-14
modified: 2025-02-23
replaces: transgenderRelationships
comment: Ongoing connections (romantic, sexual, or platonic) between two or more transgender people.
broader: https://homosaurus.org/v3/homoit0001237
change note: Version 3.7.0
has top concept: LGBTQ+ relationships
in scheme: v3
related: https://homosaurus.org/v3/homoit0000182
related: https://homosaurus.org/v3/homoit0000529
related: https://homosaurus.org/v3/homoit0000773
related: https://homosaurus.org/v3/homoit0001205

Transgender rights
type: Concept
issued: 2019-05-14
modified: 2025-02-23
replaces: transgenderRights
comment: Legal, social, or ethical principles of freedom or entitlement held by transgender people.
broader: https://homosaurus.org/v3/homoit0000276
change note: Version 3.7.0
has top concept: Human rights
in scheme: v3

Transgender Roman Catholics
type: Concept
issued: 2019-05-14
modified: 2025-02-23
replaces: transgenderRomanCatholics
comment: Transgender people who are members of the Roman Catholic Church.
broader: https://homosaurus.org/v3/homoit0001244
change note: Version 3.7.0
has top concept: LGBTQ+ religious people
in scheme: v3

Transgender slang
type: Concept
issued: 2019-05-14
modified: 2025-02-23
replaces: transgenderSlang
comment: Colloquial or informal language related to transgender identity or used by transgender people.
broader: https://homosaurus.org/v3/homoit0001317
broader: https://homosaurus.org/v3/homoit0001406
change note: Version 3.7.0
has top concept: LGBTQ+ slang
in scheme: v3

Transgender sons
type: Concept
issued: 2019-05-14
modified: 2025-02-23
replaces: transgenderSons
comment: Transgender people who are sons.
broader: https://homosaurus.org/v3/homoit0001329
broader: https://homosaurus.org/v3/homoit0001378
broader: https://homosaurus.org/v3/homoit0001400
change note: Version 3.7.0
has top concept: LGBTQ+ people
in scheme: v3

Transgender studies
type: Concept
issued: 2019-05-14
modified: 2025-02-23
replaces: transgenderStudies
comment: Academic field of research and study about transgender people, transgender identity, and transgender communities.
broader: https://homosaurus.org/v3/homoit0000579
change note: Version 3.7.0
has top concept: Gender studies
in scheme: v3
related: https://homosaurus.org/v3/homoit0000187
related: https://homosaurus.org/v3/homoit0000539
related: https://homosaurus.org/v3/homoit0000781
related: https://homosaurus.org/v3/homoit0001210
related: https://homosaurus.org/v3/homoit0001463

Transgender survivors of hate crimes
type: Concept
issued: 2019-05-14
modified: 2025-02-23
replaces: transgenderSurvivorsOfHateCrimes
comment: Transgender people who have experienced and survived hate crimes; follow the individual's preference for "victims" or "survivors" whenever possible.
broader: https://homosaurus.org/v3/homoit0001349
broader: https://homosaurus.org/v3/homoit0001456
change note: Version 3.7.0
has top concept: LGBTQ+ people
in scheme: v3

Transgender survivors of rape
type: Concept
issued: 2019-05-14
modified: 2025-02-23
replaces: transgenderSurvivorsOfRape
comment: Transgender people who have experienced and survived rape; follow the individual's preference for "victims" or "survivors" whenever possible.
broader: https://homosaurus.org/v3/homoit0001350
broader: https://homosaurus.org/v3/homoit0001457
change note: Version 3.7.0
has top concept: LGBTQ+ people
in scheme: v3

Transgender survivors of sexual abuse
type: Concept
issued: 2019-05-14
modified: 2025-02-23
replaces: transgenderSurvivorsOfSexualAbuse
comment: Transgender people who have experienced and survived sexual abuse; follow the individual's preference for "victims" or "survivors" whenever possible.
broader: https://homosaurus.org/v3/homoit0001351
broader: https://homosaurus.org/v3/homoit0001458
change note: Version 3.7.0
has top concept: LGBTQ+ people
in scheme: v3

Transgender survivors of war
type: Concept
issued: 2019-05-14
modified: 2025-02-23
replaces: transgenderSurvivorsOfWar
comment: Transgender people who have experienced and survived war; follow the individual's preference for "victims" or "survivors" whenever possible.
broader: https://homosaurus.org/v3/homoit0001352
broader: https://homosaurus.org/v3/homoit0001459
change note: Version 3.7.0
has top concept: LGBTQ+ people
in scheme: v3

Transgender youth
type: Concept
issued: 2019-05-14
modified: 2025-02-23
replaces: transgenderYouth
comment: Transgender people who are between the ages of childhood and adulthood.
alternative label: Transgender teenagers
alternative label: Transgender adolescents
alternative label: Transgender teens
broader: https://homosaurus.org/v3/homoit0001378
broader: https://homosaurus.org/v3/homoit0001521
change note: Version 3.7.0
has top concept: LGBTQ+ people
in scheme: v3
narrower: https://homosaurus.org/v3/homoit0001400
related: https://homosaurus.org/v3/homoit0001462
related: https://homosaurus.org/v3/homoit0003502
related: https://homosaurus.org/v3/homoit0003514

Transgender television
type: Concept
issued: 2019-05-14
modified: 2025-02-23
replaces: transgenderTelevision
comment: Television shows featuring transgender characters or themes.
broader: https://homosaurus.org/v3/homoit0001359
change note: Version 3.7.0
has top concept: LGBTQ+ television
in scheme: v3
related: https://homosaurus.org/v3/homoit0001423

Transgender theater
type: Concept
issued: 2019-05-14
modified: 2025-02-23
replaces: transgenderTheatre
comment: Works in the performance arts that focus on transgender characters or themes.
broader: https://homosaurus.org/v3/homoit0001363
change note: Version 3.7.0
has top concept: LGBTQ+ theater
in scheme: v3
preferred label: Transgender theatre

Transgender victims of hate crimes
type: Concept
issued: 2019-05-14
modified: 2025-02-23
replaces: transgenderVictimsOfHateCrimes
comment: Transgender people who have experienced hate crimes and may or may not have survived; follow the individual's preference for "victims" or "survivors" whenever possible.
broader: https://homosaurus.org/v3/homoit0000613
change note: Version 3.7.0
has top concept: LGBTQ+ people
in scheme: v3
narrower: https://homosaurus.org/v3/homoit0001448

Transgender victims of rape
type: Concept
issued: 2019-05-14
modified: 2025-02-23
replaces: transgenderVictimsOfRape
comment: Transgender people who have experienced rape and may or may not have survived; follow the individual's preference for "victims" or "survivors" whenever possible.
broader: https://homosaurus.org/v3/homoit0000958
change note: Version 3.7.0
has top concept: LGBTQ+ people
in scheme: v3
narrower: https://homosaurus.org/v3/homoit0001449

Transgender victims of sexual abuse
type: Concept
issued: 2019-05-14
modified: 2025-02-23
replaces: transgenderVictimsOfSexualAbuse
comment: Transgender people who have experienced sexual abuse and may or may not have survived; follow the individual's preference for "victims" or "survivors" whenever possible.
broader: https://homosaurus.org/v3/homoit0000959
change note: Version 3.7.0
has top concept: LGBTQ+ people
in scheme: v3
narrower: https://homosaurus.org/v3/homoit0001450

Transgender victims of war
type: Concept
issued: 2019-05-14
modified: 2025-02-23
replaces: transgenderVictimsOfWar
comment: Transgender people who have experienced war and may or may not have survived; follow the individual's preference for "victims" or "survivors" whenever possible.
broader: https://homosaurus.org/v3/homoit0000961
change note: Version 3.7.0
has top concept: LGBTQ+ people
in scheme: v3
narrower: https://homosaurus.org/v3/homoit0001451

Transgender victims' rights
type: Concept
issued: 2019-05-14
modified: 2025-02-23
replaces: transgenderVictimsRights
comment: Transgender people’s legal rights to be informed, present, and heard within the criminal justice system after having been harmed or injured as the result of of a crime, accident, or other event.
broader: https://homosaurus.org/v3/homoit0001492
change note: Version 3.7.0
has top concept: Law
in scheme: v3

White transgender people
type: Concept
issued: 2019-05-14
modified: 2025-02-23
replaces: transgenderWhitePeople
comment: Transgender people who are white.
alternative label: Caucasian transgender people
alternative label: Transgender Caucasian people
alternative label: Transgender white people
broader: https://homosaurus.org/v3/homoit0000243
change note: Version 3.7.0
has top concept: White LGBTQ+ people
in scheme: v3

Transgender youth literature
type: Concept
issued: 2019-05-14
modified: 2025-02-23
replaces: transgenderYouthLiterature
comment: Written literary works for an audience of readers from 12-18 years of age, also known as young adult literature or YA; use in reference to youth literature focusing on transgender characters or themes.
broader: https://homosaurus.org/v3/homoit0001522
change note: Version 3.7.0
has top concept: Subcultures
in scheme: v3
related: https://homosaurus.org/v3/homoit0001452

Transgenderism
type: Concept
issued: 2019-05-14
modified: 2025-02-23
replaces: transgenderism
comment: Pathologizing term often used in the medicalization of transgender people; use only in historical contexts.
broader: https://homosaurus.org/v3/homoit0001006
change note: Version 3.7.0
has top concept: Medical care
in scheme: v3
narrower: https://homosaurus.org/v3/homoit0001468
related: https://homosaurus.org/v3/homoit0000395
related: https://homosaurus.org/v3/homoit0000560
related: https://homosaurus.org/v3/homoit0000571
related: https://homosaurus.org/v3/homoit0000805
related: https://homosaurus.org/v3/homoit0001378
related: https://homosaurus.org/v3/homoit0001409
related: https://homosaurus.org/v3/homoit0001423
related: https://homosaurus.org/v3/homoit0001447
related: https://homosaurus.org/v3/homoit0001563

Transitioning status
type: Concept
issued: 2019-05-14
modified: 2025-02-23
replaces: transitioningStatus
comment: Term used to describe a person’s current status in their gender transition.
broader: https://homosaurus.org/v3/homoit0001465
change note: Version 3.7.0
has top concept: Transitioning (Gender)
in scheme: v3
narrower: https://homosaurus.org/v3/homoit0001047
narrower: https://homosaurus.org/v3/homoit0001049
narrower: https://homosaurus.org/v3/homoit0001129
narrower: https://homosaurus.org/v3/homoit0001131
related: https://homosaurus.org/v3/homoit0000561
related: https://homosaurus.org/v3/homoit0001378
related: https://homosaurus.org/v3/homoit0001381
related: https://homosaurus.org/v3/homoit0001834
related: https://homosaurus.org/v3/homoit0001835
related: https://homosaurus.org/v3/homoit0001836
related: https://homosaurus.org/v3/homoit0001837
related: https://homosaurus.org/v3/homoit0001838
related: https://homosaurus.org/v3/homoit0001839

Transmasculine people
type: Concept
issued: 2019-05-14
modified: 2025-02-23
replaces: transmasculinePeople
comment: Trans people assigned female at birth who identify partially or fully with a masculine gender.
broader: https://homosaurus.org/v3/homoit0001378
change note: Version 3.7.0
has top concept: LGBTQ+ people
in scheme: v3
related: https://homosaurus.org/v3/homoit0000215
related: https://homosaurus.org/v3/homoit0000995
related: https://homosaurus.org/v3/homoit0001653
related: https://homosaurus.org/v3/homoit0001820
related: https://homosaurus.org/v3/homoit0002061

Transphobia
type: Concept
issued: 2019-05-14
modified: 2025-02-23
replaces: transphobia
comment: Antagonism or disgust directed toward trans individuals (or others perceived to be transgressing gender norms) due to their gender identity and/or expression. Transphobia can include denial of the existence of trans identities, stereotypes, verbal harassment, and physical violence.
broader: https://homosaurus.org/v3/homoit0000920
change note: Version 3.7.0
has top concept: LGBTQ+ phobia
in scheme: v3
narrower: https://homosaurus.org/v3/homoit0002212
narrower: https://homosaurus.org/v3/homoit0002593
narrower: https://homosaurus.org/v3/homoit0003158
related: https://homosaurus.org/v3/homoit0000062
related: https://homosaurus.org/v3/homoit0000063
related: https://homosaurus.org/v3/homoit0000619
related: https://homosaurus.org/v3/homoit0001378
related: https://homosaurus.org/v3/homoit0001819
related: https://homosaurus.org/v3/homoit0001892
related: https://homosaurus.org/v3/homoit0001903
related: https://homosaurus.org/v3/homoit0003499
related: https://homosaurus.org/v3/homoit0003737

Transsexualism
type: Concept
issued: 2019-05-14
modified: 2025-02-23
replaces: transsexualism
comment: An individual's identification with a gender inconsistent with or not culturally associated with their assigned sex.
broader: https://homosaurus.org/v3/homoit0001006
broader: https://homosaurus.org/v3/homoit0001463
change note: Version 3.7.0
has top concept: Medical care
in scheme: v3
related: https://homosaurus.org/v3/homoit0000395
related: https://homosaurus.org/v3/homoit0001380
related: https://homosaurus.org/v3/homoit0001381
related: https://homosaurus.org/v3/homoit0001465
related: https://homosaurus.org/v3/homoit0001496
related: https://homosaurus.org/v3/homoit0001563

Transvestism
type: Concept
issued: 2019-05-14
modified: 2025-02-23
replaces: transvestism
comment: U.S. historical term used to describe the practices of individuals who wear clothes associated with a gender other than their gender assigned at birth; generally considered to be a derogatory term; use only in historical contexts.
broader: https://homosaurus.org/v3/homoit0000568
broader: https://homosaurus.org/v3/homoit0001006
change note: Version 3.7.0
has top concept: Gender
in scheme: v3
related: https://homosaurus.org/v3/homoit0000318
related: https://homosaurus.org/v3/homoit0000395
related: https://homosaurus.org/v3/homoit0001563
related: https://homosaurus.org/v3/homoit0001895

Transvestites
type: Concept
issued: 2019-05-14
modified: 2025-02-23
replaces: transvestites
comment: U.S. historical term used to describe individuals who wear clothes associated with a gender other than their gender assigned at birth; generally considered to be a derogatory term; use only in historical contexts.
broader: https://homosaurus.org/v3/homoit0000878
broader: https://homosaurus.org/v3/homoit0001817
change note: Version 3.7.0
has top concept: LGBTQ+ historical terms
in scheme: v3
related: https://homosaurus.org/v3/homoit0000316
related: https://homosaurus.org/v3/homoit0001378
related: https://homosaurus.org/v3/homoit0001781

Travestis
type: Concept
issued: 2019-05-14
modified: 2025-02-23
replaces: travesti
comment: Spanish term for people assigned male at birth who have a feminine gender identity; commonly used in South America.
alternative label: Travesti
broader: https://homosaurus.org/v3/homoit0000322
change note: Version 3.7.0
has top concept: Gender
in scheme: v3

Tribades
type: Concept
issued: 2019-05-14
modified: 2025-02-23
replaces: tribades
comment: Historical term for individuals who engage in the sexual practice of tribadism; use only in historical contexts.
broader: https://homosaurus.org/v3/homoit0000878
change note: Version 3.7.0
has top concept: LGBTQ+ historical terms
in scheme: v3
related: https://homosaurus.org/v3/homoit0000556
related: https://homosaurus.org/v3/homoit0001669

Trigender identity
type: Concept
issued: 2019-05-14
modified: 2025-02-23
replaces: trigenderIdentity
comment: Gender identity including three genders, typically male, female, and a third (often non-binary) gender.
broader: https://homosaurus.org/v3/homoit0000571
change note: Version 3.7.0
has top concept: Gender
in scheme: v3
related: https://homosaurus.org/v3/homoit0001474

Trigender people
type: Concept
issued: 2019-05-14
modified: 2025-02-23
replaces: trigenderPeople
comment: People whose gender continually moves between or among three gender identities, typically male, female, and a third gender.
broader: https://homosaurus.org/v3/homoit0000322
broader: https://homosaurus.org/v3/homoit0001378
broader: https://homosaurus.org/v3/homoit0001817
change note: Version 3.7.0
has top concept: Gender
in scheme: v3
related: https://homosaurus.org/v3/homoit0001473

Tritiya-Prakriti
type: Concept
issued: 2019-05-14
modified: 2025-02-23
replaces: tritiyaPrakriti
comment: Ancient Hindu term for a third gender that is typically described as fluid and/or continuously transformative.
broader: https://homosaurus.org/v3/homoit0000322
change note: Version 3.7.0
has top concept: Gender
in scheme: v3

Tucking (Phallus)
type: Concept
issued: 2019-05-14
modified: 2025-02-23
replaces: tucking
comment: Slang term describing various methods used to visually conceal the penis to give a flatter appearance in clothing.
alternative label: Tucking
broader: https://homosaurus.org/v3/homoit0000568
change note: Version 3.7.0
has top concept: Gender
in scheme: v3
related: https://homosaurus.org/v3/homoit0001099

Tumtum
type: Concept
issued: 2019-05-14
modified: 2025-02-23
replaces: tumtum
comment: Term originating in Rabbinic Judaism to refer to someone with an unknown sex; literally translates to "hidden." Used historically to refer to intersex variations where the genitals were covered by skin. Only use for individuals who are Jewish and who self-identify as Tumtum.
broader: https://homosaurus.org/v3/homoit0000322
change note: Version 3.7.0
has top concept: Gender
in scheme: v3

Turner syndrome
type: Concept
issued: 2019-05-14
modified: 2025-02-23
replaces: turnerSyndrome
comment: Turner syndrome is a variation in which a person is born with a 45X chromosome pattern (sometimes called 45XO) rather than the typical 46XX. People with Turner syndrome often share specific physical features such as short stature, a webbed neck and broad chest, and heart issues. They can also develop variations in their other sex characteristics, such as smaller-than-typical ovaries that may stop producing hormones at a younger age than typical, and they might not menstruate or experience pubertal changes.
broader: https://homosaurus.org/v3/homoit0000669
change note: Version 3.7.0
has top concept: Sex (Body)
in scheme: v3

Twinks (Gay culture)
type: Concept
issued: 2019-05-14
modified: 2025-02-23
replaces: twinks
comment: U.S. slang term for young gay men who are typically small in stature, hairless, and considered effeminate.
alternative label: Twinkies
alternative label: Twinks
broader: https://homosaurus.org/v3/homoit0000487
broader: https://homosaurus.org/v3/homoit0000506
broader: https://homosaurus.org/v3/homoit0000577
broader: https://homosaurus.org/v3/homoit0001295
change note: Version 3.7.0
has top concept: Subcultures
in scheme: v3
related: https://homosaurus.org/v3/homoit0000568

Two-Spirit people
type: Concept
issued: 2019-05-14
modified: 2025-02-23
replaces: two-spiritPeople
comment: Indigenous people in North America who self-identify as Two-Spirit to reconnect with the multiple gender and sexual roles in Native cultures.
alternative label: 2S people
alternative label: Two Spirit people
alternative label: Two Spirited people
alternative label: Two-Spirited people
broader: https://homosaurus.org/v3/homoit0000322
broader: https://homosaurus.org/v3/homoit0001297
change note: Version 3.7.0
has top concept: Gender
in scheme: v3
narrower: https://homosaurus.org/v3/homoit0001750
narrower: https://homosaurus.org/v3/homoit0001760
narrower: https://homosaurus.org/v3/homoit0001764
narrower: https://homosaurus.org/v3/homoit0001778
narrower: https://homosaurus.org/v3/homoit0001787
narrower: https://homosaurus.org/v3/homoit0001936
narrower: https://homosaurus.org/v3/homoit0001997
narrower: https://homosaurus.org/v3/homoit0002035
narrower: https://homosaurus.org/v3/homoit0002666
narrower: https://homosaurus.org/v3/homoit0002678
narrower: https://homosaurus.org/v3/homoit0002682
narrower: https://homosaurus.org/v3/homoit0002709
narrower: https://homosaurus.org/v3/homoit0002717
narrower: https://homosaurus.org/v3/homoit0002734
narrower: https://homosaurus.org/v3/homoit0002817
narrower: https://homosaurus.org/v3/homoit0003046
narrower: https://homosaurus.org/v3/homoit0003230
narrower: https://homosaurus.org/v3/homoit0003244
narrower: https://homosaurus.org/v3/homoit0003261
narrower: https://homosaurus.org/v3/homoit0003276
narrower: https://homosaurus.org/v3/homoit0003380
narrower: https://homosaurus.org/v3/homoit0003546
narrower: https://homosaurus.org/v3/homoit0003619
narrower: https://homosaurus.org/v3/homoit0003646
narrower: https://homosaurus.org/v3/homoit0003686
narrower: https://homosaurus.org/v3/homoit0003748
narrower: https://homosaurus.org/v3/homoit0003761
related: https://homosaurus.org/v3/homoit0000039
related: https://homosaurus.org/v3/homoit0000098
related: https://homosaurus.org/v3/homoit0000353
related: https://homosaurus.org/v3/homoit0000654
related: https://homosaurus.org/v3/homoit0000886
related: https://homosaurus.org/v3/homoit0000966
related: https://homosaurus.org/v3/homoit0001035
related: https://homosaurus.org/v3/homoit0001037
related: https://homosaurus.org/v3/homoit0001043
related: https://homosaurus.org/v3/homoit0001044
related: https://homosaurus.org/v3/homoit0001147
related: https://homosaurus.org/v3/homoit0001372
related: https://homosaurus.org/v3/homoit0001506
related: https://homosaurus.org/v3/homoit0001809
related: https://homosaurus.org/v3/homoit0001810
related: https://homosaurus.org/v3/homoit0001811
related: https://homosaurus.org/v3/homoit0002213
related: https://homosaurus.org/v3/homoit0002689

Undocumented LGBTQ+ residents
type: Concept
issued: 2019-05-14
modified: 2025-02-23
replaces: undocumentedLGBTQResidents
comment: LGBTQ+ people who do not have official documentation to remain legal residents of the countries in which they live.
alternative label: Undocumented LGBTQ residents
broader: https://homosaurus.org/v3/homoit0000915
change note: Version 3.7.0
has top concept: LGBTQ+ people
in scheme: v3
related: https://homosaurus.org/v3/homoit0000702
related: https://homosaurus.org/v3/homoit0000712
related: https://homosaurus.org/v3/homoit0000860
related: https://homosaurus.org/v3/homoit0000883
related: https://homosaurus.org/v3/homoit0000902
related: https://homosaurus.org/v3/homoit0000927
related: https://homosaurus.org/v3/homoit0001108
related: https://homosaurus.org/v3/homoit0001815
related: https://homosaurus.org/v3/homoit0001853

Unmarried couples
type: Concept
issued: 2019-05-14
modified: 2025-02-23
replaces: unmarriedCouples
comment: Romantic and/or sexual partnerships of two people who are unmarried.
broader: https://homosaurus.org/v3/homoit0000989
change note: Version 3.7.0
has top concept: Living arrangements
in scheme: v3

Uranians
type: Concept
issued: 2019-05-14
modified: 2025-02-23
replaces: uranians
comment: 19th century term used to refer to gender and sexual minorities; use only in historical contexts.
alternative label: Urnings
broader: https://homosaurus.org/v3/homoit0000878
change note: Version 3.7.0
has top concept: LGBTQ+ historical terms
in scheme: v3
related: https://homosaurus.org/v3/homoit0001297
related: https://homosaurus.org/v3/homoit0001564

Vaginal fisting
type: Concept
issued: 2019-05-14
modified: 2025-02-23
replaces: vaginalFisting
comment: Sexual practice of inserting a fist into a vagina.
broader: https://homosaurus.org/v3/homoit0000445
broader: https://homosaurus.org/v3/homoit0001487
change note: Version 3.7.0
has top concept: Sexual practices
in scheme: v3
related: https://homosaurus.org/v3/homoit0000042

Vaginal sex
type: Concept
issued: 2019-05-14
modified: 2025-02-23
replaces: vaginalSex
comment: Sexual acts involving the vagina.
broader: https://homosaurus.org/v3/homoit0001267
broader: https://homosaurus.org/v3/homoit0001299
change note: Version 3.7.0
has top concept: Sex (Act)
in scheme: v3
narrower: https://homosaurus.org/v3/homoit0000446
narrower: https://homosaurus.org/v3/homoit0000459
narrower: https://homosaurus.org/v3/homoit0001486
related: https://homosaurus.org/v3/homoit0000239
related: https://homosaurus.org/v3/homoit0000280

Vagina
type: Concept
issued: 2019-05-14
modified: 2025-02-23
replaces: vaginas
comment: Internal muscular channel connected to external genital organs.
alternative label: Cunt
alternative label: Pussy
alternative label: Snatch
alternative label: Twat
alternative label: Vag
alternative label: Vaginas
broader: https://homosaurus.org/v3/homoit0000401
broader: https://homosaurus.org/v3/homoit0000585
change note: Version 3.7.0
has top concept: Erogenous body parts
in scheme: v3
narrower: https://homosaurus.org/v3/homoit0000460
narrower: https://homosaurus.org/v3/homoit0001040
related: https://homosaurus.org/v3/homoit0000239
related: https://homosaurus.org/v3/homoit0001268
related: https://homosaurus.org/v3/homoit0001489
related: https://homosaurus.org/v3/homoit0001845
related: https://homosaurus.org/v3/homoit0001848
related: https://homosaurus.org/v3/homoit0001851

Vaginismus
type: Concept
issued: 2019-05-14
modified: 2025-02-23
replaces: vaginismus
comment: A condition characterized by painful, spasmodic contractions of the vagina in response to physical contact, pressure, or insertion.
alternative label: Vaginism
broader: https://homosaurus.org/v3/homoit0001291
change note: Version 3.7.0
has top concept: Sexual dysfunction
in scheme: v3
related: https://homosaurus.org/v3/homoit0001488

Vibrators
type: Concept
issued: 2019-05-14
modified: 2025-02-23
replaces: vibrators
comment: Electric-powered sex toys that produce different levels of vibrations or pulses to aid in sexual stimulation and pleasure.
broader: https://homosaurus.org/v3/homoit0001266
change note: Version 3.7.0
has top concept: Sex accessories
in scheme: v3
related: https://homosaurus.org/v3/homoit0000355

LGBTQ+ victims' rights
type: Concept
issued: 2019-05-14
modified: 2025-02-23
replaces: victimsRightsLGBTQ
comment: LGBTQ+ people’s legal rights to be informed, present, and heard within the criminal justice system after having been harmed or injured as the result of a crime, accident, or other event.
alternative label: Victims' rights (LGBTQ)
broader: https://homosaurus.org/v3/homoit0000702
change note: Version 3.7.0
has top concept: Law
in scheme: v3
narrower: https://homosaurus.org/v3/homoit0000200
narrower: https://homosaurus.org/v3/homoit0000554
narrower: https://homosaurus.org/v3/homoit0000796
narrower: https://homosaurus.org/v3/homoit0001225
narrower: https://homosaurus.org/v3/homoit0001460
narrower: https://homosaurus.org/v3/homoit0002858
narrower: https://homosaurus.org/v3/homoit0002951
related: https://homosaurus.org/v3/homoit0000276
related: https://homosaurus.org/v3/homoit0000312
related: https://homosaurus.org/v3/homoit0002736

Virginity
type: Concept
issued: 2019-05-14
modified: 2025-02-23
replaces: virginity
comment: Term used to describe the sexual status of people who have never engaged in sexual activity.
broader: https://homosaurus.org/v3/homoit0001282
change note: Version 3.7.0
has top concept: Sex (Act)
in scheme: v3
related: https://homosaurus.org/v3/homoit0000004
related: https://homosaurus.org/v3/homoit0001300

Voice
type: Concept
issued: 2019-05-14
modified: 2025-02-23
replaces: voice
comment: Sound produced by the larynx and vocal tract that is used for communication and expression.
broader: https://homosaurus.org/v3/homoit0001259
change note: Version 3.7.0
has top concept: Sex (Body)
in scheme: v3
related: https://homosaurus.org/v3/homoit0001842
related: https://homosaurus.org/v3/homoit0001843

Voice therapy (Gender)
type: Concept
issued: 2019-05-14
modified: 2025-02-23
replaces: voiceTherapyTransgender
comment: Any non-surgical technique used to make the human voice sound either more feminine or masculine.
alternative label: Voice therapy (Transgender)
alternative label: Voice therapy
broader: https://homosaurus.org/v3/homoit0000568
broader: https://homosaurus.org/v3/homoit0001366
change note: Version 3.7.0
has top concept: Gender
in scheme: v3
related: https://homosaurus.org/v3/homoit0001465
related: https://homosaurus.org/v3/homoit0001468
related: https://homosaurus.org/v3/homoit0001842
related: https://homosaurus.org/v3/homoit0001843

Vulva
type: Concept
issued: 2019-05-14
modified: 2025-02-23
replaces: vulva
comment: External genitalia surrounding the vagina.
broader: https://homosaurus.org/v3/homoit0000585
change note: Version 3.7.0
has top concept: Sex (Body)
in scheme: v3
related: https://homosaurus.org/v3/homoit0001845
related: https://homosaurus.org/v3/homoit0001848
related: https://homosaurus.org/v3/homoit0001851

Wacking off
type: Concept
issued: 2019-05-14
modified: 2025-02-23
replaces: wackingOff
comment: Slang term for masturbation that is commonly used in the United States.
broader: https://homosaurus.org/v3/homoit0000988
broader: https://homosaurus.org/v3/homoit0001000
broader: https://homosaurus.org/v3/homoit0001109
change note: Version 3.7.0
has top concept: Sex (Act)
in scheme: v3
narrower: https://homosaurus.org/v3/homoit0001500

Whakatane
type: Concept
issued: 2019-05-14
modified: 2025-02-23
replaces: wakatane
comment: In Māori culture in New Zealand, this term is used to describe people assigned female at birth who pursue traditionally male roles.
alternative label: Wakatane
broader: https://homosaurus.org/v3/homoit0000322
broader: https://homosaurus.org/v3/homoit0002653
change note: Version 3.7.0
has top concept: Gender
in scheme: v3
related: https://homosaurus.org/v3/homoit0000231
related: https://homosaurus.org/v3/homoit0001502

Wanking
type: Concept
issued: 2019-05-14
modified: 2025-02-23
replaces: wanking
comment: Slang term for masturbation commonly used in the United Kingdom and Ireland; typically refers to the manual stimulation of the penis.
broader: https://homosaurus.org/v3/homoit0000988
broader: https://homosaurus.org/v3/homoit0001109
broader: https://homosaurus.org/v3/homoit0001498
change note: Version 3.7.0
has top concept: Sex (Act)
in scheme: v3

Waria
type: Concept
issued: 2019-05-14
modified: 2025-02-23
replaces: waria
comment: Third gender people in Indonesia who are assigned male at birth but who express femininity and may identify as women.
broader: https://homosaurus.org/v3/homoit0000322
change note: Version 3.7.0
has top concept: Gender
in scheme: v3

Whakawāhine
type: Concept
issued: 2019-05-14
modified: 2025-02-23
replaces: whakawahine
comment: In Māori culture in New Zealand, this term is used to describe people assigned male at birth who pursue traditionally female roles.
alternative label: Whakawahine
broader: https://homosaurus.org/v3/homoit0000322
broader: https://homosaurus.org/v3/homoit0002653
change note: Version 3.7.0
has top concept: Gender
in scheme: v3
related: https://homosaurus.org/v3/homoit0001499

Whips
type: Concept
issued: 2019-05-14
modified: 2025-02-23
replaces: whips
comment: Sticks, cords, or straps, usually with stiff handles, that are used for striking individuals. Often used in BDSM circles to enhance sexual arousal.
broader: https://homosaurus.org/v3/homoit0001266
change note: Version 3.7.0
has top concept: Sex accessories
in scheme: v3
related: https://homosaurus.org/v3/homoit0000447
related: https://homosaurus.org/v3/homoit0003048

Widowed people
type: Concept
issued: 2019-05-14
modified: 2025-02-23
replaces: widowedPeople
comment: People whose spouses or partners have died.
alternative label: Widowers
alternative label: Widows
broader: https://homosaurus.org/v3/homoit0000989
change note: Version 3.7.0
has top concept: Living arrangements
in scheme: v3

Winkté
type: Concept
issued: 2019-05-14
modified: 2025-02-23
replaces: winkte
comment: North American Lakota word referring to people assigned male at birth who adopt feminine roles; translates to "to be like a woman."
alternative label: Winkte
broader: https://homosaurus.org/v3/homoit0000322
change note: Version 3.7.0
has top concept: Gender
in scheme: v3
related: https://homosaurus.org/v3/homoit0001480

Wolves (Gay culture)
type: Concept
issued: 2019-05-14
modified: 2025-02-23
replaces: wolves
comment: U.S. slang term for heavy-set, masculine gay men who are often characterized as having hairy bodies and facial hair; typically used for individuals who are more aggressive and overtly masculine than bears.
alternative label: Wolves
broader: https://homosaurus.org/v3/homoit0000487
broader: https://homosaurus.org/v3/homoit0000506
broader: https://homosaurus.org/v3/homoit0000577
broader: https://homosaurus.org/v3/homoit0001295
change note: Version 3.7.0
has top concept: Subcultures
in scheme: v3
narrower: https://homosaurus.org/v3/homoit0000321
related: https://homosaurus.org/v3/homoit0000105
related: https://homosaurus.org/v3/homoit0000568
related: https://homosaurus.org/v3/homoit0000995
related: https://homosaurus.org/v3/homoit0001063

Women
type: Concept
issued: 2019-05-14
modified: 2025-02-23
replaces: women
comment: Adults who self-identify as women and understand their gender in terms of Western conceptions of womanness, femaleness, and/or femininity. The term has typically been defined as adult female humans, though not all women identify with the term "female" depending on the context in which it is used.
broader: https://homosaurus.org/v3/homoit0000571
change note: Version 3.7.0
has top concept: Gender
in scheme: v3
narrower: https://homosaurus.org/v3/homoit0000040
narrower: https://homosaurus.org/v3/homoit0000202
narrower: https://homosaurus.org/v3/homoit0000272
narrower: https://homosaurus.org/v3/homoit0000629
narrower: https://homosaurus.org/v3/homoit0001510
narrower: https://homosaurus.org/v3/homoit0001642
narrower: https://homosaurus.org/v3/homoit0002279
narrower: https://homosaurus.org/v3/homoit0003224
related: https://homosaurus.org/v3/homoit0000271
related: https://homosaurus.org/v3/homoit0000322
related: https://homosaurus.org/v3/homoit0000437
related: https://homosaurus.org/v3/homoit0000556
related: https://homosaurus.org/v3/homoit0000563
related: https://homosaurus.org/v3/homoit0001008
related: https://homosaurus.org/v3/homoit0001378
related: https://homosaurus.org/v3/homoit0001505
related: https://homosaurus.org/v3/homoit0001516
related: https://homosaurus.org/v3/homoit0002216

Women who have sex with women
type: Concept
issued: 2019-05-14
modified: 2025-02-23
replaces: womenWhoHaveSexWithWomen
comment: Women who engage in sexual activity with other women.
alternative label: WSW
broader: https://homosaurus.org/v3/homoit0000915
broader: https://homosaurus.org/v3/homoit0001509
change note: Version 3.7.0
has top concept: LGBTQ+ people
in scheme: v3
narrower: https://homosaurus.org/v3/homoit0001002
related: https://homosaurus.org/v3/homoit0000202
related: https://homosaurus.org/v3/homoit0000556
related: https://homosaurus.org/v3/homoit0001254
related: https://homosaurus.org/v3/homoit0001297
related: https://homosaurus.org/v3/homoit0001342
related: https://homosaurus.org/v3/homoit0003613

Women's bookshops
type: Concept
issued: 2019-05-14
modified: 2025-02-23
replaces: womensBookshops
comment: Bookshops that sell materials intended for use by women or addressing topics related to women.
broader: https://homosaurus.org/v3/homoit0000216
change note: Version 3.7.0
has top concept: LGBTQ+ bookshops
in scheme: v3
related: https://homosaurus.org/v3/homoit0000727

Women's community centers
type: Concept
issued: 2019-05-14
modified: 2025-02-23
replaces: womensCommunityCentres
comment: Spaces in which women meet for social, educational, recreational, and organizing activities.
broader: https://homosaurus.org/v3/homoit0000298
change note: Version 3.7.0
has top concept: LGBTQ+ centers
in scheme: v3
preferred label: Women's community centres

Women's libraries
type: Concept
issued: 2019-05-14
modified: 2025-02-23
replaces: womensLibraries
comment: Libraries that contain materials primarily pertaining to women or for use by women.
broader: https://homosaurus.org/v3/homoit0000968
change note: Version 3.7.0
has top concept: LGBTQ+ cultural heritage institutions
in scheme: v3
narrower: https://homosaurus.org/v3/homoit0000749

Women's marriages
type: Concept
issued: 2019-05-14
modified: 2025-02-23
replaces: womensMarriages
comment: Same-gender marriage tradition between two women in Africa conducted according to African culture and traditions.
broader: https://homosaurus.org/v3/homoit0000990
change note: Version 3.7.0
has top concept: Living arrangements
in scheme: v3
related: https://homosaurus.org/v3/homoit0000504

Women's music festivals
type: Concept
issued: 2019-05-14
modified: 2025-02-23
replaces: womensMusicFestivals
comment: Organized events typically lasting more than one day that feature performances by women’s musical groups and performers. Though centered on music, women’s music festivals may also incorporate aspects of lesbian and feminist culture by offering workshops, arts and crafts, and community resources.
broader: https://homosaurus.org/v3/homoit0003607
change note: Version 3.7.0
has top concept: Women's events
in scheme: v3
related: https://homosaurus.org/v3/homoit0000755
related: https://homosaurus.org/v3/homoit0001516

Khaniths
type: Concept
issued: 2019-05-14
modified: 2025-02-23
replaces: xanith
comment: Arabic word used in Oman for people who assigned male at birth who adopt feminine mannerisms and/or roles.
alternative label: Khanith
alternative label: Xanith
alternative label: Xaniths
broader: https://homosaurus.org/v3/homoit0000322
change note: Version 3.7.0
has top concept: Gender
in scheme: v3

X-jendā
type: Concept
issued: 2019-05-14
modified: 2025-02-23
replaces: XJenda
comment: Japanese term for people who do not fit within the categories of man or woman; includes individuals born intersex, female, or male, and is often abbreviated using FTX, MTX, or XTX to describe individuals' transitions; some definitions equate the term to genderqueer or beyond the binary identities.
broader: https://homosaurus.org/v3/homoit0000322
change note: Version 3.7.0
has top concept: Gender
in scheme: v3
related: https://homosaurus.org/v3/homoit0000457
related: https://homosaurus.org/v3/homoit0001027

Yīnyángrén
type: Concept
issued: 2019-05-14
modified: 2025-02-23
replaces: yinyangRen
comment: Chinese word for individuals who are both female (yin) and male (yang).
alternative label: Jiānxìngrén
alternative label: Yin-yang ren
alternative label: Yinyang ren
alternative label: Yinyangren
broader: https://homosaurus.org/v3/homoit0000322
change note: Version 3.7.0
has top concept: Gender
in scheme: v3

LGBTQ+ youth
type: Concept
issued: 2019-05-14
modified: 2025-02-23
replaces: youthLGBTQ
comment: LGBTQ+ people who are between the ages of childhood and adulthood.
alternative label: Adolescents (LGBTQ)
alternative label: Teenagers (LGBTQ)
alternative label: Teens (LGBTQ)
alternative label: Youth (LGBTQ)
alternative label: LGBTQ+ adolescents
alternative label: LGBTQ+ teenagers
alternative label: LGBTQ+ teens
broader: https://homosaurus.org/v3/homoit0001520
change note: Version 3.7.0
has top concept: Youth
in scheme: v3
narrower: https://homosaurus.org/v3/homoit0000192
narrower: https://homosaurus.org/v3/homoit0000544
narrower: https://homosaurus.org/v3/homoit0000786
narrower: https://homosaurus.org/v3/homoit0000880
narrower: https://homosaurus.org/v3/homoit0001215
narrower: https://homosaurus.org/v3/homoit0001452
narrower: https://homosaurus.org/v3/homoit0002223
narrower: https://homosaurus.org/v3/homoit0002292
narrower: https://homosaurus.org/v3/homoit0002460
narrower: https://homosaurus.org/v3/homoit0002489
narrower: https://homosaurus.org/v3/homoit0002509
narrower: https://homosaurus.org/v3/homoit0002538
narrower: https://homosaurus.org/v3/homoit0003460
narrower: https://homosaurus.org/v3/homoit0003474
related: https://homosaurus.org/v3/homoit0000630
related: https://homosaurus.org/v3/homoit0000674
related: https://homosaurus.org/v3/homoit0000933
related: https://homosaurus.org/v3/homoit0000964
related: https://homosaurus.org/v3/homoit0001522
related: https://homosaurus.org/v3/homoit0001756
related: https://homosaurus.org/v3/homoit0002700
related: https://homosaurus.org/v3/homoit0002711

LGBTQ+ youth literature
type: Concept
issued: 2019-05-14
modified: 2025-02-23
replaces: youthLiteratureLGBTQ
comment: Written literary works for an audience of readers from 12-18 years of age, also known as young adult literature or YA; use in reference to youth literature focusing on LGBTQ+ characters or themes.
alternative label: Young adult literature (LGBTQ)
alternative label: Youth literature (LGBTQ)
broader: https://homosaurus.org/v3/homoit0000972
change note: Version 3.7.0
has top concept: Subcultures
in scheme: v3
narrower: https://homosaurus.org/v3/homoit0000203
narrower: https://homosaurus.org/v3/homoit0000557
narrower: https://homosaurus.org/v3/homoit0000798
narrower: https://homosaurus.org/v3/homoit0001228
narrower: https://homosaurus.org/v3/homoit0001462
narrower: https://homosaurus.org/v3/homoit0002461
narrower: https://homosaurus.org/v3/homoit0002478
narrower: https://homosaurus.org/v3/homoit0002490
narrower: https://homosaurus.org/v3/homoit0002510
narrower: https://homosaurus.org/v3/homoit0002539
narrower: https://homosaurus.org/v3/homoit0002953
related: https://homosaurus.org/v3/homoit0001521
related: https://homosaurus.org/v3/homoit0002179
related: https://homosaurus.org/v3/homoit0002712

Zenanas
type: Concept
issued: 2019-05-14
modified: 2025-02-23
replaces: zenanas
comment: In northern India and Pakistan, this term is used to refer to effeminate people.
broader: https://homosaurus.org/v3/homoit0000322
change note: Version 3.7.0
has top concept: Gender
in scheme: v3

Allosexuality
type: Concept
issued: 2020-06-02
modified: 2025-02-23
replaces: allosexuality
comment: A sexual orientation generally characterized by the occurrence of sexual attraction or the desire for partnered sexual experiences.
broader: https://homosaurus.org/v3/homoit0001298
change note: Version 3.7.0
has top concept: Sexual orientation
in scheme: v3
related: https://homosaurus.org/v3/homoit0000170
related: https://homosaurus.org/v3/homoit0000627
related: https://homosaurus.org/v3/homoit0000648
related: https://homosaurus.org/v3/homoit0001073
related: https://homosaurus.org/v3/homoit0001535
related: https://homosaurus.org/v3/homoit0001917

Amatonormativity
type: Concept
issued: 2020-06-02
modified: 2025-02-23
replaces: amatonormativity
comment: The assumption that all people share a desire for romantic relationships and that this is a preferential life goal.
broader: https://homosaurus.org/v3/homoit0001323
change note: Version 3.7.0
has top concept: Social norms
in scheme: v3
related: https://homosaurus.org/v3/homoit0000067
related: https://homosaurus.org/v3/homoit0000356
related: https://homosaurus.org/v3/homoit0001650

Compulsory sexuality
type: Concept
issued: 2020-06-02
modified: 2025-02-23
replaces: compulsorySexuality
comment: The belief that everyone should be either sexually available or in a sexual relationship.
broader: https://homosaurus.org/v3/homoit0001323
change note: Version 3.7.0
has top concept: Social norms
in scheme: v3
related: https://homosaurus.org/v3/homoit0000004
related: https://homosaurus.org/v3/homoit0000071
related: https://homosaurus.org/v3/homoit0000343
related: https://homosaurus.org/v3/homoit0000344
related: https://homosaurus.org/v3/homoit0000356
related: https://homosaurus.org/v3/homoit0001531
related: https://homosaurus.org/v3/homoit0001650
related: https://homosaurus.org/v3/homoit0001917

LGBTQ+ people with internet sex addictions
type: Concept
issued: 2020-06-03
modified: 2025-02-23
replaces: internetSexAddiction
comment: LGBTQ+ people experiencing addiction to or dependency upon sexual activities involving the internet, including watching pornography, engaging in sexual conversations online, etc. Only use to refer to individuals who describe themselves as having internet sex addictions, not individuals who sexual practices are perceived as promiscuous or excessive by others.
alternative label: LGBTQ+ people with cybersex addictions
alternative label: LGBTQ+ people with internet sexual addictions
alternative label: LGBTQ+ people with porn addictions
alternative label: LGBTQ+ people with pornography addictions
broader: https://homosaurus.org/v3/homoit0001283
change note: Version 3.7.0
has top concept: LGBTQ+ people
in scheme: v3

LGBTQ+ people with alcohol use disorders
type: Concept
issued: 2020-06-03
modified: 2025-02-23
replaces: LGBTQAlcoholics
comment: LGBTQ+ people who have been diagnosed with or regard themselves as having an alcohol use disorder, a medical condition that involves a pattern of alcohol use that is difficult to control, negatively impacts the individual's life, and results in withdrawal symptoms upon cessation. Only use to refer to individuals who describe themselves as having an alcohol use disorder. Follow the individual's preference for "use disorder" or "addiction" whenever possible.
alternative label: Alcoholics (LGBTQ)
alternative label: LGBTQ+ alcoholics
broader: https://homosaurus.org/v3/homoit0000379
broader: https://homosaurus.org/v3/homoit0001550
change note: Version 3.7.0
has top concept: LGBTQ+ people
in scheme: v3
related: https://homosaurus.org/v3/homoit0001549

LGBTQ+ people in recovery
type: Concept
issued: 2020-06-03
modified: 2025-02-23
replaces: LGBTQPeopleInRecovery
comment: LGBTQ+ people currently in recovery from use disorders, conditions, or addictions. Follow the individual's preference for "recovery" or "sobriety" whenever possible.
alternative label: LGBTQ people in recovery
broader: https://homosaurus.org/v3/homoit0000915
change note: Version 3.7.0
has top concept: LGBTQ+ people
in scheme: v3
related: https://homosaurus.org/v3/homoit0000380
related: https://homosaurus.org/v3/homoit0001540

LGBTQ+ people with addictions
type: Concept
issued: 2020-06-03
modified: 2025-02-23
replaces: LGBTQPeopleWithAddictions
comment: Umbrella term for LGBTQ+ people experiencing addictions, dependencies, or use disorders of some kind. Only use to refer to individuals who describe themselves as having addictions. Apply more specific terms if possible.
alternative label: LGBTQ people with addictions
broader: https://homosaurus.org/v3/homoit0000379
broader: https://homosaurus.org/v3/homoit0000380
broader: https://homosaurus.org/v3/homoit0000915
change note: Version 3.7.0
has top concept: LGBTQ+ people
in scheme: v3
narrower: https://homosaurus.org/v3/homoit0001283
narrower: https://homosaurus.org/v3/homoit0001540
narrower: https://homosaurus.org/v3/homoit0002226

LGBTQ+-affirming recovery groups
type: Concept
issued: 2020-06-03
modified: 2025-02-23
replaces: LGBTQRecoveryGroups
comment: Recovery groups, or voluntary associations of people in recovery from use disorders, conditions, or addictions, that are accepting and supportive of LGBTQ+ people and their identities.
alternative label: 12 step programs (LGBTQ)
alternative label: Recovery groups (LGBTQ)
alternative label: Step work (LGBTQ)
alternative label: LGBTQ+-affirming 12 step programs
alternative label: LGBTQ+-affirming step work
broader: https://homosaurus.org/v3/homoit0001012
change note: Version 3.7.0
has top concept: Health care for LGBTQ+ people
in scheme: v3
related: https://homosaurus.org/v3/homoit0000953
related: https://homosaurus.org/v3/homoit0002227
related: https://homosaurus.org/v3/homoit0002228

Leather bars
type: Concept
issued: 2020-06-03
modified: 2025-02-23
replaces: leatherBars
comment: Bars or clubs that cater to or which are known to be especially friendly to the leather community.
broader: https://homosaurus.org/v3/homoit0000100
change note: Version 3.7.0
has top concept: LGBTQ+ meeting places
in scheme: v3
related: https://homosaurus.org/v3/homoit0000087
related: https://homosaurus.org/v3/homoit0000474
related: https://homosaurus.org/v3/homoit0000705

Metamours
type: Concept
issued: 2020-06-03
modified: 2025-02-23
replaces: metamours
comment: In polyamory or open relationships, metamours are the partners of an individual's partner, with whom the individual does not have a direct sexual or romantic relationship.
broader: https://homosaurus.org/v3/homoit0001123
broader: https://homosaurus.org/v3/homoit0001660
change note: Version 3.7.0
has top concept: Relationship orientation
in scheme: v3
related: https://homosaurus.org/v3/homoit0001638
related: https://homosaurus.org/v3/homoit0001651
related: https://homosaurus.org/v3/homoit0001662

Mononormativity
type: Concept
issued: 2020-06-03
modified: 2025-02-23
replaces: mononormativity
comment: The belief that all people share a desire for monogamous relationships and that this is a preferential life goal.
broader: https://homosaurus.org/v3/homoit0001323
change note: Version 3.7.0
has top concept: Social norms
in scheme: v3
related: https://homosaurus.org/v3/homoit0000356
related: https://homosaurus.org/v3/homoit0001019
related: https://homosaurus.org/v3/homoit0001556
related: https://homosaurus.org/v3/homoit0001915
related: https://homosaurus.org/v3/homoit0001916

Monosexuality
type: Concept
issued: 2020-06-03
modified: 2025-02-23
replaces: monosexuality
comment: A sexuality that involves attraction to only one gender; includes homosexuality and heterosexuality.
broader: https://homosaurus.org/v3/homoit0001298
change note: Version 3.7.0
has top concept: Sexual orientation
in scheme: v3
narrower: https://homosaurus.org/v3/homoit0000631
narrower: https://homosaurus.org/v3/homoit0000647
related: https://homosaurus.org/v3/homoit0001290
related: https://homosaurus.org/v3/homoit0001295
related: https://homosaurus.org/v3/homoit0001300
related: https://homosaurus.org/v3/homoit0001555
related: https://homosaurus.org/v3/homoit0001915

Polysexuality
type: Concept
issued: 2020-06-03
modified: 2025-02-23
replaces: polysexuality
comment: Term used to describe the sexual identity of individuals who experience attraction to more than one gender; includes bisexuality and pansexuality.
broader: https://homosaurus.org/v3/homoit0001290
broader: https://homosaurus.org/v3/homoit0001295
broader: https://homosaurus.org/v3/homoit0001298
broader: https://homosaurus.org/v3/homoit0001300
change note: Version 3.7.0
has top concept: Diversity
in scheme: v3
narrower: https://homosaurus.org/v3/homoit0000204
narrower: https://homosaurus.org/v3/homoit0001926
related: https://homosaurus.org/v3/homoit0001123
related: https://homosaurus.org/v3/homoit0001919

Reclaimed terms
type: Concept
issued: 2020-06-03
modified: 2025-02-23
replaces: reclaimedTerms
comment: Terms that have been or are currently used in derogatory ways but have been reclaimed by certain groups or in certain circumstances.
broader: https://homosaurus.org/v3/homoit0001317
change note: Version 3.7.0
has top concept: LGBTQ+ slang
in scheme: v3
narrower: https://homosaurus.org/v3/homoit0000384
narrower: https://homosaurus.org/v3/homoit0000418
narrower: https://homosaurus.org/v3/homoit0001195
narrower: https://homosaurus.org/v3/homoit0001891
narrower: https://homosaurus.org/v3/homoit0002230
narrower: https://homosaurus.org/v3/homoit0002577
related: https://homosaurus.org/v3/homoit0001208
related: https://homosaurus.org/v3/homoit0001560

Uranism
type: Concept
issued: 2020-06-03
modified: 2025-02-23
replaces: uranism
comment: Historical term originating from the German "Uranismus" coined by Karl Heinrich Ulrichs as an umbrella term for what are now referred to as gender and sexual minorities; use only in historical contexts.
alternative label: Uranismus
alternative label: Congenital sexual inversion
alternative label: Urningism
alternative label: Uraniadism
alternative label: Uranianism
broader: https://homosaurus.org/v3/homoit0000878
change note: Version 3.7.0
has top concept: LGBTQ+ historical terms
in scheme: v3
related: https://homosaurus.org/v3/homoit0000677
related: https://homosaurus.org/v3/homoit0001296
related: https://homosaurus.org/v3/homoit0001484

Lesbian fantasy fiction
type: Concept
issued: 2020-06-03
modified: 2025-02-23
replaces: lesbianFantasyFiction
comment: Written works that include magical or fantastical elements; use in reference to fantasy fiction focusing on lesbian characters or themes.
broader: https://homosaurus.org/v3/homoit0000865
change note: Version 3.7.0
has top concept: Subcultures
in scheme: v3

Gay fantasy fiction
type: Concept
issued: 2020-06-03
modified: 2025-02-23
replaces: gayFantasyFiction
comment: Written works that include magical or fantastical elements; use in reference to fantasy fiction focusing on gay characters or themes.
broader: https://homosaurus.org/v3/homoit0000865
change note: Version 3.7.0
has top concept: Subcultures
in scheme: v3

Bisexual fantasy fiction
type: Concept
issued: 2020-06-03
modified: 2025-02-23
replaces: bisexualFantasyFiction
comment: Written works that include magical or fantastical elements; use in reference to fantasy fiction focusing on bisexual characters or themes.
broader: https://homosaurus.org/v3/homoit0000865
change note: Version 3.7.0
has top concept: Subcultures
in scheme: v3

Transgender fantasy fiction
type: Concept
issued: 2020-06-03
modified: 2025-02-23
replaces: transgenderFantasyFiction
comment: Written works that include magical or fantastical elements; use in reference to fantasy fiction focusing on transgender characters or themes.
broader: https://homosaurus.org/v3/homoit0000865
change note: Version 3.7.0
has top concept: Subcultures
in scheme: v3

Queer fantasy fiction
type: Concept
issued: 2020-06-03
modified: 2025-02-23
replaces: queerFantasyFiction
comment: Written works that include magical or fantastical elements; use in reference to fantasy fiction focusing on queer characters or themes.
broader: https://homosaurus.org/v3/homoit0000865
change note: Version 3.7.0
has top concept: Subcultures
in scheme: v3

Lesbian science fiction
type: Concept
issued: 2020-06-03
modified: 2025-02-23
replaces: lesbianScienceFiction
comment: Written literary works about imaginative or futuristic concepts incorporating science, technology, space, time travel, and other speculative elements; use in reference to science fiction focusing on lesbian characters and themes.
broader: https://homosaurus.org/v3/homoit0000934
change note: Version 3.7.0
has top concept: Subcultures
in scheme: v3

Gay science fiction
type: Concept
issued: 2020-06-03
modified: 2025-02-23
replaces: gayScienceFiction
comment: Written literary works about imaginative or futuristic concepts incorporating science, technology, space, time travel, and other speculative elements; use in reference to science fiction focusing on gay characters or themes.
broader: https://homosaurus.org/v3/homoit0000934
change note: Version 3.7.0
has top concept: Subcultures
in scheme: v3

Bisexual science fiction
type: Concept
issued: 2020-06-03
modified: 2025-02-23
replaces: bisexualScienceFiction
comment: Written literary work about imaginative or futuristic concepts incorporating science, technology, space, time travel, and other speculative elements; use in reference to science fiction focusing on bisexual characters or themes.
broader: https://homosaurus.org/v3/homoit0000934
change note: Version 3.7.0
has top concept: Subcultures
in scheme: v3

Transgender science fiction
type: Concept
issued: 2020-06-03
modified: 2025-02-23
replaces: transgenderScienceFiction
comment: Written literary works about imaginative or futuristic concepts incorporating science, technology, space, time travel, and other speculative elements; use in reference to science fiction focusing on transgender characters and themes.
broader: https://homosaurus.org/v3/homoit0000934
change note: Version 3.7.0
has top concept: Subcultures
in scheme: v3

Queer science fiction
type: Concept
issued: 2020-06-03
modified: 2025-02-23
replaces: queerScienceFiction
comment: Written literary works about imaginative or futuristic concepts incorporating science, technology, space, time travel, and other speculative elements; use in reference to science fiction focusing on queer characters or themes.
broader: https://homosaurus.org/v3/homoit0000934
change note: Version 3.7.0
has top concept: Subcultures
in scheme: v3

Lesbian mystery and detective fiction
type: Concept
issued: 2020-06-03
modified: 2025-02-23
replaces: lesbianMysteryAndDectectiveFiction
comment: Written literary works about the investigation of crime or the work of detectives; use in reference to mystery and detective fiction focusing on lesbian characters and themes.
broader: https://homosaurus.org/v3/homoit0000852
change note: Version 3.7.0
has top concept: Subcultures
in scheme: v3

Gay mystery and detective fiction
type: Concept
issued: 2020-06-03
modified: 2025-02-23
replaces: gayMysteryAndDetectiveFiction
comment: Written literary works about the investigation of crime or the work of detectives; use in reference to mystery and detective fiction focusing on gay characters or themes.
broader: https://homosaurus.org/v3/homoit0000852
change note: Version 3.7.0
has top concept: Subcultures
in scheme: v3

Bisexual mystery and detective fiction
type: Concept
issued: 2020-06-03
modified: 2025-02-23
replaces: bisexualMysteryAndDetectiveFiction
comment: Written literary works about the investigation of crime or the work of detectives; use in reference to mystery and detective fiction focusing on bisexual characters or themes.
broader: https://homosaurus.org/v3/homoit0000852
change note: Version 3.7.0
has top concept: Subcultures
in scheme: v3

Transgender mystery and detective fiction
type: Concept
issued: 2020-06-03
modified: 2025-02-23
replaces: transgenderMysteryAndDetectiveFiction
comment: Written literary works about the investigation of crime or the work of detectives; use in reference to mystery and detective fiction focusing on transgender characters and themes.
broader: https://homosaurus.org/v3/homoit0000852
change note: Version 3.7.0
has top concept: Subcultures
in scheme: v3

Queer mystery and detective fiction
type: Concept
issued: 2020-06-03
modified: 2025-02-23
replaces: queerMysteryAndDetectiveFiction
comment: Written literary works about the investigation of crime or the work of detectives; use in reference to mystery and detective fiction focusing on queer characters and themes.
broader: https://homosaurus.org/v3/homoit0000852
change note: Version 3.7.0
has top concept: Subcultures
in scheme: v3

LGBTQ+ horror fiction
type: Concept
issued: 2020-06-03
modified: 2025-02-23
replaces: horrorFictionLGBTQ
comment: Written works of fiction intended to frighten, scare, or disgust; use in reference to horror fiction focusing on LGBTQ+ characters or themes.
alternative label: Horror fiction (LGBTQ)
broader: https://homosaurus.org/v3/homoit0000443
change note: Version 3.7.0
has top concept: Subcultures
in scheme: v3
narrower: https://homosaurus.org/v3/homoit0001581
narrower: https://homosaurus.org/v3/homoit0001582
narrower: https://homosaurus.org/v3/homoit0001583
narrower: https://homosaurus.org/v3/homoit0001584
narrower: https://homosaurus.org/v3/homoit0001585
narrower: https://homosaurus.org/v3/homoit0002426
narrower: https://homosaurus.org/v3/homoit0002427
narrower: https://homosaurus.org/v3/homoit0002428
narrower: https://homosaurus.org/v3/homoit0002473
narrower: https://homosaurus.org/v3/homoit0002496
narrower: https://homosaurus.org/v3/homoit0002517
narrower: https://homosaurus.org/v3/homoit0002568
related: https://homosaurus.org/v3/homoit0002639
related: https://homosaurus.org/v3/homoit0002649

Lesbian horror fiction
type: Concept
issued: 2020-06-03
modified: 2025-02-23
replaces: lesbianHorrorFiction
comment: Written works of fiction intended to frighten, scare, or disgust; use in reference to horror fiction focusing on lesbian characters or themes.
broader: https://homosaurus.org/v3/homoit0001580
change note: Version 3.7.0
has top concept: Subcultures
in scheme: v3

Gay horror fiction
type: Concept
issued: 2020-06-03
modified: 2025-02-23
replaces: gayHorrorFiction
comment: Written works of fiction intended to frighten, scare, or disgust; use in reference to horror fiction focusing on gay characters or themes.
broader: https://homosaurus.org/v3/homoit0001580
change note: Version 3.7.0
has top concept: Subcultures
in scheme: v3

Bisexual horror fiction
type: Concept
issued: 2020-06-03
modified: 2025-02-23
replaces: bisexualHorrorFiction
comment: Written works of fiction intended to frighten, scare, or disgust; use in reference to horror fiction focusing on bisexual characters or themes.
broader: https://homosaurus.org/v3/homoit0001580
change note: Version 3.7.0
has top concept: Subcultures
in scheme: v3

Transgender horror fiction
type: Concept
issued: 2020-06-03
modified: 2025-02-23
replaces: transgenderHorrorFiction
comment: Written works of fiction intended to frighten, scare, or disgust; use in reference to horror fiction focusing on transgender characters or themes.
broader: https://homosaurus.org/v3/homoit0001580
change note: Version 3.7.0
has top concept: Subcultures
in scheme: v3

Queer horror fiction
type: Concept
issued: 2020-06-03
modified: 2025-02-23
replaces: queerHorrorFiction
comment: Written works of fiction intended to frighten, scare, or disgust; use in reference to horror fiction focusing on queer characters or themes.
broader: https://homosaurus.org/v3/homoit0001580
change note: Version 3.7.0
has top concept: Subcultures
in scheme: v3

LGBTQ+ romance fiction
type: Concept
issued: 2020-06-03
modified: 2025-02-23
replaces: romanceFictionLGBTQ
comment: Works of fiction revolving around romantic and/or sexual relationships between the main characters; use in reference to romance fiction focusing on LGBTQ+ characters.
alternative label: Romance fiction (LGBTQ)
broader: https://homosaurus.org/v3/homoit0000443
change note: Version 3.7.0
has top concept: Subcultures
in scheme: v3
narrower: https://homosaurus.org/v3/homoit0001592
narrower: https://homosaurus.org/v3/homoit0001593
narrower: https://homosaurus.org/v3/homoit0001594
narrower: https://homosaurus.org/v3/homoit0001595
narrower: https://homosaurus.org/v3/homoit0001596
narrower: https://homosaurus.org/v3/homoit0002433
narrower: https://homosaurus.org/v3/homoit0002434
narrower: https://homosaurus.org/v3/homoit0002435
narrower: https://homosaurus.org/v3/homoit0002436
narrower: https://homosaurus.org/v3/homoit0002498
narrower: https://homosaurus.org/v3/homoit0002519
narrower: https://homosaurus.org/v3/homoit0002566
related: https://homosaurus.org/v3/homoit0002641
related: https://homosaurus.org/v3/homoit0002651

Lesbian comics
type: Concept
issued: 2020-06-03
modified: 2025-02-23
replaces: lesbianComics
comment: Works consisting of sequential images often accompanied by text; use in reference to comics focusing on lesbian characters or themes.
broader: https://homosaurus.org/v3/homoit0000841
change note: Version 3.7.0
has top concept: Subcultures
in scheme: v3

Gay comics
type: Concept
issued: 2020-06-03
modified: 2025-02-23
replaces: gayComics
comment: Works consisting of sequential images often accompanied by text; use in reference to comics focusing on gay characters or themes.
broader: https://homosaurus.org/v3/homoit0000841
change note: Version 3.7.0
has top concept: Subcultures
in scheme: v3

Bisexual comics
type: Concept
issued: 2020-06-03
modified: 2025-02-23
replaces: bisexualComics
comment: Works consisting of sequential images often accompanied by text; use in reference to comics focusing on bisexual characters or themes.
broader: https://homosaurus.org/v3/homoit0000841
change note: Version 3.7.0
has top concept: Subcultures
in scheme: v3

Transgender comics
type: Concept
issued: 2020-06-03
modified: 2025-02-23
replaces: transgenderComics
comment: Works consisting of sequential images often accompanied by text; use in reference to comics focusing on transgender characters or themes.
broader: https://homosaurus.org/v3/homoit0000841
change note: Version 3.7.0
has top concept: Subcultures
in scheme: v3

Queer comics
type: Concept
issued: 2020-06-03
modified: 2025-02-23
replaces: queerComics
comment: Works consisting of sequential images often accompanied by text; use in reference to comics focusing on queer characters or themes.
broader: https://homosaurus.org/v3/homoit0000841
change note: Version 3.7.0
has top concept: Subcultures
in scheme: v3

Lesbian romance fiction
type: Concept
issued: 2020-06-03
modified: 2025-02-23
replaces: lesbianRomanceFiction
comment: Written literary works focusing on romantic relationships and love between people; use in reference to romance fiction focusing on lesbian characters and themes.
broader: https://homosaurus.org/v3/homoit0001586
change note: Version 3.7.0
has top concept: Subcultures
in scheme: v3

Gay romance fiction
type: Concept
issued: 2020-06-03
modified: 2025-02-23
replaces: gayRomanceFiction
comment: Written literary work focusing on romantic relationships and love between people; use in reference to romance fiction focusing on gay characters or themes.
broader: https://homosaurus.org/v3/homoit0001586
change note: Version 3.7.0
has top concept: Subcultures
in scheme: v3

Bisexual romance fiction
type: Concept
issued: 2020-06-03
modified: 2025-02-23
replaces: bisexualRomanceFiction
comment: Written literary work focusing on romantic relationships and love between people; use in reference to romance fiction focusing on bisexual characters or themes.
broader: https://homosaurus.org/v3/homoit0001586
change note: Version 3.7.0
has top concept: Subcultures
in scheme: v3

Transgender romance fiction
type: Concept
issued: 2020-06-03
modified: 2025-02-23
replaces: transgenderRomanceFiction
comment: Written literary works focusing on romantic relationships and love between people; use in reference to romance fiction focusing on transgender characters and themes.
broader: https://homosaurus.org/v3/homoit0001586
change note: Version 3.7.0
has top concept: Subcultures
in scheme: v3

Queer romance fiction
type: Concept
issued: 2020-06-03
modified: 2025-02-23
replaces: queerRomanceFiction
comment: Written literary work focusing on romantic relationships and love between people; use in reference to romance fiction focusing on queer characters or themes.
broader: https://homosaurus.org/v3/homoit0001586
change note: Version 3.7.0
has top concept: Subcultures
in scheme: v3

Lesbian erotic literature
type: Concept
issued: 2020-06-03
modified: 2025-02-23
replaces: lesbianEroticLiterature
comment: Literary works that have erotic or sexual elements; use in reference to erotic literature focusing on lesbian characters or themes.
broader: https://homosaurus.org/v3/homoit0000859
broader: https://homosaurus.org/v3/homoit0002162
change note: Version 3.7.0
has top concept: Erotica
in scheme: v3
related: https://homosaurus.org/v3/homoit0002220

Gay erotic literature
type: Concept
issued: 2020-06-03
modified: 2025-02-23
replaces: gayEroticLiterature
comment: Literary works with erotic or sexual elements; use in reference to erotic literature focusing on gay characters or themes.
broader: https://homosaurus.org/v3/homoit0000859
change note: Version 3.7.0
has top concept: Erotica
in scheme: v3
related: https://homosaurus.org/v3/homoit0002217

Bisexual erotic literature
type: Concept
issued: 2020-06-03
modified: 2025-02-23
replaces: bisexualEroticLiterature
comment: Literary works that have erotic or sexual elements; use in reference to erotic literature focusing on bisexual characters or themes.
broader: https://homosaurus.org/v3/homoit0000859
change note: Version 3.7.0
has top concept: Erotica
in scheme: v3

Transgender erotic literature
type: Concept
issued: 2020-06-03
modified: 2025-02-23
replaces: transgenderEroticLiterature
comment: Literary works that have erotic or sexual elements; use in reference to erotic literature focusing on transgender characters or themes.
broader: https://homosaurus.org/v3/homoit0000859
change note: Version 3.7.0
has top concept: Erotica
in scheme: v3

Queer erotic literature
type: Concept
issued: 2020-06-03
modified: 2025-02-23
replaces: queerEroticLiterature
comment: Literary works that have erotic or sexual elements; use in reference to erotic literature focusing on queer characters or themes.
broader: https://homosaurus.org/v3/homoit0000859
change note: Version 3.7.0
has top concept: Erotica
in scheme: v3

Lesbian literary criticism
type: Concept
issued: 2020-06-03
modified: 2025-02-23
replaces: lesbianLiteraryCriticism
comment: The study, evaluation, and interpretation of literary works focusing on lesbian characters or themes; can also include interpretation of literature through the lens and frameworks of lesbian studies.
broader: https://homosaurus.org/v3/homoit0001602
change note: Version 3.7.0
has top concept: LGBTQ+ literary criticism
in scheme: v3
related: https://homosaurus.org/v3/homoit0001724
related: https://homosaurus.org/v3/homoit0002466
related: https://homosaurus.org/v3/homoit0002483
related: https://homosaurus.org/v3/homoit0002542

Gay literary criticism
type: Concept
issued: 2020-06-03
modified: 2025-02-23
replaces: gayLiteraryCriticism
comment: The study, evaluation, and interpretation of literary works focusing on gay characters or themes; can also include interpretation of literature through the lens and frameworks of gay studies.
broader: https://homosaurus.org/v3/homoit0001602
change note: Version 3.7.0
has top concept: LGBTQ+ literary criticism
in scheme: v3
related: https://homosaurus.org/v3/homoit0001725
related: https://homosaurus.org/v3/homoit0002466
related: https://homosaurus.org/v3/homoit0002483
related: https://homosaurus.org/v3/homoit0002542

Bisexual literary criticism
type: Concept
issued: 2020-06-03
modified: 2025-02-23
replaces: bisexualLiteraryCriticism
comment: The study, evaluation, and interpretation of literary works focusing on bisexual characters or themes; can also include interpretation of literature through the lens and frameworks of bisexuality.
broader: https://homosaurus.org/v3/homoit0001602
change note: Version 3.7.0
has top concept: LGBTQ+ literary criticism
in scheme: v3
related: https://homosaurus.org/v3/homoit0001726
related: https://homosaurus.org/v3/homoit0002466
related: https://homosaurus.org/v3/homoit0002483
related: https://homosaurus.org/v3/homoit0002542

Transgender literary criticism
type: Concept
issued: 2020-06-03
modified: 2025-02-23
replaces: transgenderLiteraryCriticism
comment: The study, evaluation, and interpretation of literary works focusing on transgender characters or themes; can also include interpretation of literature through the lens and frameworks of transgender studies.
broader: https://homosaurus.org/v3/homoit0001602
change note: Version 3.7.0
has top concept: LGBTQ+ literary criticism
in scheme: v3
related: https://homosaurus.org/v3/homoit0001727
related: https://homosaurus.org/v3/homoit0002466
related: https://homosaurus.org/v3/homoit0002483
related: https://homosaurus.org/v3/homoit0002542

Queer literary criticism
type: Concept
issued: 2020-06-03
modified: 2025-02-23
replaces: queerLiteraryCriticism
comment: The study, evaluation, and interpretation of literary works focusing on queer characters or themes; can also include interpretation of literature through the lens and frameworks of queer theory.
broader: https://homosaurus.org/v3/homoit0001602
change note: Version 3.7.0
has top concept: LGBTQ+ literary criticism
in scheme: v3
related: https://homosaurus.org/v3/homoit0001728
related: https://homosaurus.org/v3/homoit0002466
related: https://homosaurus.org/v3/homoit0002483
related: https://homosaurus.org/v3/homoit0002542

LGBTQ+ short stories
type: Concept
issued: 2020-06-03
modified: 2025-02-23
replaces: shortStoriesLGBTQ
comment: Written literary works that are short in length and detail a self-contained incident or concept; use in reference to short stories focusing on LGBTQ+ characters or themes.
alternative label: Short stories (LGBTQ)
broader: https://homosaurus.org/v3/homoit0000443
change note: Version 3.7.0
has top concept: Subcultures
in scheme: v3
narrower: https://homosaurus.org/v3/homoit0001609
narrower: https://homosaurus.org/v3/homoit0001610
narrower: https://homosaurus.org/v3/homoit0001611
narrower: https://homosaurus.org/v3/homoit0001612
narrower: https://homosaurus.org/v3/homoit0001613
narrower: https://homosaurus.org/v3/homoit0002441
narrower: https://homosaurus.org/v3/homoit0002442
narrower: https://homosaurus.org/v3/homoit0002443
narrower: https://homosaurus.org/v3/homoit0002444
narrower: https://homosaurus.org/v3/homoit0002500
narrower: https://homosaurus.org/v3/homoit0002521
narrower: https://homosaurus.org/v3/homoit0002574
related: https://homosaurus.org/v3/homoit0002633
related: https://homosaurus.org/v3/homoit0002686

Lesbian short stories
type: Concept
issued: 2020-06-03
modified: 2025-02-23
replaces: lesbianShortStories
comment: Written literary works that are short in length and detail a self-contained incident or concept; use in reference to short stories focusing on lesbian characters or themes.
broader: https://homosaurus.org/v3/homoit0001608
change note: Version 3.7.0
has top concept: Subcultures
in scheme: v3

Gay short stories
type: Concept
issued: 2020-06-03
modified: 2025-02-23
replaces: gayShortStories
comment: Written literary works that are short in length and detail a self-contained incident or concept; use in reference to short stories focusing on gay characters or themes.
broader: https://homosaurus.org/v3/homoit0001608
change note: Version 3.7.0
has top concept: Subcultures
in scheme: v3

Bisexual short stories
type: Concept
issued: 2020-06-03
modified: 2025-02-23
replaces: bisexualShortStories
comment: Written literary works that are short in length and detail a self-contained incident or concept; use in reference to short stories focusing on bisexual characters or themes.
broader: https://homosaurus.org/v3/homoit0001608
change note: Version 3.7.0
has top concept: Subcultures
in scheme: v3

Transgender short stories
type: Concept
issued: 2020-06-03
modified: 2025-02-23
replaces: transgenderShortStories
comment: Written literary works that are short in length and detail a self-contained incident or concept; use in reference to short stories focusing on transgender characters or themes.
broader: https://homosaurus.org/v3/homoit0001608
change note: Version 3.7.0
has top concept: Subcultures
in scheme: v3

Queer short stories
type: Concept
issued: 2020-06-03
modified: 2025-02-23
replaces: queerShortStories
comment: Written literary works that are short in length and detail a self-contained incident or concept; use in reference to short stories focusing on queer characters or themes.
broader: https://homosaurus.org/v3/homoit0001608
change note: Version 3.7.0
has top concept: Subcultures
in scheme: v3

Lesbian biographies
type: Concept
issued: 2020-06-03
modified: 2025-02-23
replaces: lesbianBiographies
comment: Written accounts of the lives of lesbians. For written accounts of lesbians' lives written by the subject, use "Lesbian autobiographies."
broader: https://homosaurus.org/v3/homoit0001614
change note: Version 3.7.0
has top concept: LGBTQ+ biographies
in scheme: v3
related: https://homosaurus.org/v3/homoit0001730
related: https://homosaurus.org/v3/homoit0001724

Gay biographies
type: Concept
issued: 2020-06-03
modified: 2025-02-23
replaces: gayBiographies
comment: Written accounts of the lives of gay men. For written accounts of gay men's lives written by the subject, use "Gay autobiographies."
broader: https://homosaurus.org/v3/homoit0001614
change note: Version 3.7.0
has top concept: LGBTQ+ biographies
in scheme: v3
related: https://homosaurus.org/v3/homoit0001731

Bisexual biographies
type: Concept
issued: 2020-06-03
modified: 2025-02-23
replaces: bisexualBiographies
comment: Written accounts of the lives of bisexual people. For written accounts of bisexual people's lives written by the subject, use "Bisexual autobiographies."
broader: https://homosaurus.org/v3/homoit0001614
change note: Version 3.7.0
has top concept: LGBTQ+ biographies
in scheme: v3
related: https://homosaurus.org/v3/homoit0001732
related: https://homosaurus.org/v3/homoit0001726

Transgender biographies
type: Concept
issued: 2020-06-03
modified: 2025-02-23
replaces: transgenderBiographies
comment: Written accounts of the lives of trans people. For written accounts of trans people's lives written by the subject, use "Transgender autobiographies."
alternative label: Trans biographies
broader: https://homosaurus.org/v3/homoit0001614
change note: Version 3.7.0
has top concept: LGBTQ+ biographies
in scheme: v3
related: https://homosaurus.org/v3/homoit0001733
related: https://homosaurus.org/v3/homoit0001727

Queer biographies
type: Concept
issued: 2020-06-03
modified: 2025-02-23
replaces: queerBiographies
comment: Written accounts of the lives of queer people. For written accounts of queer people's lives written by the subject, use "Queer autobiographies."
broader: https://homosaurus.org/v3/homoit0001614
change note: Version 3.7.0
has top concept: LGBTQ+ biographies
in scheme: v3
related: https://homosaurus.org/v3/homoit0001734
related: https://homosaurus.org/v3/homoit0001728

Breast augmentation
type: Concept
issued: 2020-12-11
modified: 2025-02-23
replaces: breastAugmentation
comment: A surgical procedure aimed at increasing breast size using a prosthetic implant; often undergone by transgender women as a gender affirming surgery.
alternative label: Augmentation mammaplasty
alternative label: Augmentation mammoplasty
alternative label: Boob job
broader: https://homosaurus.org/v3/homoit0001840
change note: Version 3.7.0
has top concept: Medical care
in scheme: v3
related: https://homosaurus.org/v3/homoit0000222

Breast fetish
type: Concept
issued: 2020-12-11
modified: 2025-02-23
replaces: breastFetishism
comment: Eroticization of the breasts.
alternative label: Mazophilia
alternative label: Breast partialism
alternative label: Mastofact
alternative label: Breast fetishism
alternative label: Breast kink
broader: https://homosaurus.org/v3/homoit0001634
change note: Version 3.7.0
has top concept: Eroticism
in scheme: v3
related: https://homosaurus.org/v3/homoit0000222
related: https://homosaurus.org/v3/homoit0001046
related: https://homosaurus.org/v3/homoit0003118
related: https://homosaurus.org/v3/homoit0003130
related: https://homosaurus.org/v3/homoit0003132

DADT relationships
type: Concept
issued: 2020-12-11
modified: 2025-02-23
replaces: DADTRelationships
comment: Abbreviation for "don’t ask don’t tell relationships," where partners agree that they have each have multiple romantic and/or sexual relationships as long as they do not discuss it with their primary partner or let it interfere with their partner’s daily life.
broader: https://homosaurus.org/v3/homoit0001651
change note: Version 3.7.0
has top concept: Relationship orientation
in scheme: v3
related: https://homosaurus.org/v3/homoit0001629

Greysexuality
type: Concept
issued: 2020-12-11
modified: 2025-02-23
replaces: greysexuality
comment: A sexual orientation generally characterized by infrequent, rare, or low-intensity sexual attraction.
alternative label: Graysexuality
alternative label: Grey-sexuality
alternative label: Gray-sexuality
broader: https://homosaurus.org/v3/homoit0001298
change note: Version 3.7.0
has top concept: Sexual orientation
in scheme: v3
related: https://homosaurus.org/v3/homoit0001627
related: https://homosaurus.org/v3/homoit0001988

Greysexual people
type: Concept
issued: 2020-12-11
modified: 2025-02-23
replaces: greysexualPeople
comment: People who experience infrequent, rare, or low-intensity sexual attraction.
alternative label: Graysexual people
alternative label: Grey-sexual people
alternative label: Gray-sexual people
broader: https://homosaurus.org/v3/homoit0001297
change note: Version 3.7.0
has top concept: Sexual minorities
in scheme: v3
related: https://homosaurus.org/v3/homoit0001626
related: https://homosaurus.org/v3/homoit0001987

Hard swap
type: Concept
issued: 2020-12-11
modified: 2025-02-23
replaces: hardSwap
comment: A term used in the swinging community to describe a type of partner swapping in which sexual activities happen in different spaces or rooms where partners may not necessarily be in sight of each other.
broader: https://homosaurus.org/v3/homoit0001299
change note: Version 3.7.0
has top concept: Sexual practices
in scheme: v3
related: https://homosaurus.org/v3/homoit0001640

Hierarchical non-monogamy
type: Concept
issued: 2020-12-11
modified: 2025-02-23
replaces: hierarchicalNonmonogamy
comment: A form of consensual non-monogamy in which a person has multiple partners who are not "equal" to one another in terms of time, emotional intensity, financial, or scheduling matters.
alternative label: Hierarchical polyamory
alternative label: Hierarchical nonmonogamy
broader: https://homosaurus.org/v3/homoit0001123
broader: https://homosaurus.org/v3/homoit0001659
change note: Version 3.7.0
has top concept: Relationship orientation
in scheme: v3
narrower: https://homosaurus.org/v3/homoit0001641
narrower: https://homosaurus.org/v3/homoit0001656
related: https://homosaurus.org/v3/homoit0001625
related: https://homosaurus.org/v3/homoit0001635
related: https://homosaurus.org/v3/homoit0001638
related: https://homosaurus.org/v3/homoit0001645
related: https://homosaurus.org/v3/homoit0001657
related: https://homosaurus.org/v3/homoit0001664
related: https://homosaurus.org/v3/homoit0002255

Large breasts
type: Concept
issued: 2020-12-11
modified: 2025-02-23
replaces: largeBreasts
comment: Breasts considered large within a given cultural context. Note that large breasts have various health issues associated with them and may carry stigmatized medical associations (such as terms like gigantomastia and macromastia). These terms have more specific medical meanings but should not be used outside of those specific contexts.
alternative label: Gigantomastia
alternative label: Macromastia
alternative label: Breast hypertrophy
broader: https://homosaurus.org/v3/homoit0001623
change note: Version 3.7.0
has top concept: Breast size
in scheme: v3
related: https://homosaurus.org/v3/homoit0000222

Mastectomy
type: Concept
issued: 2020-12-11
modified: 2025-02-23
replaces: mastectomy
comment: A surgical procedure aimed at removing the breast or as much breast tissue as possible; often undergone as part of "top surgery" for transgender men or nonbinary people.
alternative label: Breast amputation
broader: https://homosaurus.org/v3/homoit0001840
change note: Version 3.7.0
has top concept: Medical care
in scheme: v3
related: https://homosaurus.org/v3/homoit0000222
related: https://homosaurus.org/v3/homoit0001622
related: https://homosaurus.org/v3/homoit0001841

Megasexuality
type: Concept
issued: 2020-12-11
modified: 2025-02-23
replaces: megasexuality
comment: A sexual orientation generally characterized by a person's lack of emotional connection to other people unless or until they have formed a strong sexual connection with them first.
broader: https://homosaurus.org/v3/homoit0001295
broader: https://homosaurus.org/v3/homoit0001298
change note: Version 3.7.0
has top concept: Sexual identity
in scheme: v3
related: https://homosaurus.org/v3/homoit0001302
related: https://homosaurus.org/v3/homoit0001633

Megasexual people
type: Concept
issued: 2020-12-11
modified: 2025-02-23
replaces: megasexualPeople
comment: People who do not experience strong emotional connections to other people unless they form strong sexual connections with them first.
broader: https://homosaurus.org/v3/homoit0001297
change note: Version 3.7.0
has top concept: Sexual minorities
in scheme: v3
narrower: https://homosaurus.org/v3/homoit0003042
related: https://homosaurus.org/v3/homoit0000071
related: https://homosaurus.org/v3/homoit0001302
related: https://homosaurus.org/v3/homoit0001632

Body part fetishes
type: Concept
issued: 2020-12-11
modified: 2025-02-23
replaces: partialism
comment: Any of various fetishes regarding a specific part of the body.
alternative label: Body part fetish
alternative label: Body part fetishism
alternative label: Partialism
alternative label: Partialisms
broader: https://homosaurus.org/v3/homoit0000442
change note: Version 3.7.0
has top concept: Eroticism
in scheme: v3
narrower: https://homosaurus.org/v3/homoit0001621
narrower: https://homosaurus.org/v3/homoit0003051
narrower: https://homosaurus.org/v3/homoit0003064
related: https://homosaurus.org/v3/homoit0000401

Primary partners
type: Concept
issued: 2020-12-11
modified: 2025-02-23
replaces: primaryPartners
comment: A term used in hierarchical polyamory to refer to the partner whose interests and desires come before those of any secondary partner(s).
broader: https://homosaurus.org/v3/homoit0002365
change note: Version 3.7.0
has top concept: Partners
in scheme: v3
related: https://homosaurus.org/v3/homoit0001629
related: https://homosaurus.org/v3/homoit0001638

Secondary partners
type: Concept
issued: 2020-12-11
modified: 2025-02-23
replaces: secondaryPartners
comment: A term used in hierarchical polyamory to refer to partners whose interests and desires come second to those of the primary partner(s).
broader: https://homosaurus.org/v3/homoit0002365
change note: Version 3.7.0
has top concept: Partners
in scheme: v3
related: https://homosaurus.org/v3/homoit0001554
related: https://homosaurus.org/v3/homoit0001629
related: https://homosaurus.org/v3/homoit0001635
related: https://homosaurus.org/v3/homoit0001662

Small breasts
type: Concept
issued: 2020-12-11
modified: 2025-02-23
replaces: smallBreasts
comment: Breasts considered small within a given cultural context. In certain situations, medical professionals may refer to such breasts as "underdeveloped" or "hypoplastic." These terms can be considered offensive and should not be used outside of specific medical contexts. The alternate labels included here are intended to aid search tools only and should not be used in other contexts.
alternative label: Breast hypoplasia
alternative label: Underdeveloped breasts
broader: https://homosaurus.org/v3/homoit0001623
change note: Version 3.7.0
has top concept: Breast size
in scheme: v3
related: https://homosaurus.org/v3/homoit0000222

Soft swap
type: Concept
issued: 2020-12-11
modified: 2025-02-23
replaces: softSwap
comment: A term used in the swinging community to describe a type of partner swap in which sexual activities happen in the same shared space so that all partners are within sight of one another.
broader: https://homosaurus.org/v3/homoit0001299
change note: Version 3.7.0
has top concept: Sexual practices
in scheme: v3
related: https://homosaurus.org/v3/homoit0001628

Swinging
type: Concept
issued: 2020-12-11
modified: 2025-02-23
replaces: swinging
comment: An agreement, sexual practice, or relationship in which a couple engages in group sex or the swapping of sexual partners within a group, often on a habitual basis.
alternative label: Wife swapping
alternative label: Husband swapping
alternative label: Partner swapping
broader: https://homosaurus.org/v3/homoit0001629
broader: https://homosaurus.org/v3/homoit0001651
change note: Version 3.7.0
has top concept: Relationship orientation
in scheme: v3
related: https://homosaurus.org/v3/homoit0001299
related: https://homosaurus.org/v3/homoit0001656

Trans women
type: Concept
issued: 2020-12-11
modified: 2025-02-23
replaces: transWomen
comment: Women whose gender assigned at birth was not female. Do not use for intersex people unless the intersex person identifies as a trans woman.
alternative label: Transgender women
alternative label: Transwomen
alternative label: Trans-women
broader: https://homosaurus.org/v3/homoit0001378
broader: https://homosaurus.org/v3/homoit0001509
change note: Version 3.7.0
has top concept: LGBTQ+ people
in scheme: v3
narrower: https://homosaurus.org/v3/homoit0000986
related: https://homosaurus.org/v3/homoit0000079
related: https://homosaurus.org/v3/homoit0000407
related: https://homosaurus.org/v3/homoit0001821
related: https://homosaurus.org/v3/homoit0002043
related: https://homosaurus.org/v3/homoit0002274

Trans men
type: Concept
issued: 2020-12-11
modified: 2025-02-23
replaces: transMen
comment: Men whose gender assigned at birth was not male. Do not use for intersex people unless the intersex person identifies as a trans man.
alternative label: Transgender men
alternative label: Transmen
alternative label: Trans-men
broader: https://homosaurus.org/v3/homoit0001008
broader: https://homosaurus.org/v3/homoit0001378
change note: Version 3.7.0
has top concept: Gender
in scheme: v3
narrower: https://homosaurus.org/v3/homoit0000436
related: https://homosaurus.org/v3/homoit0000077
related: https://homosaurus.org/v3/homoit0000114
related: https://homosaurus.org/v3/homoit0001362
related: https://homosaurus.org/v3/homoit0001820
related: https://homosaurus.org/v3/homoit0002061

Aromanticism
type: Concept
issued: 2021-03-04
modified: 2025-02-23
replaces: aromanticism
comment: A romantic orientation generally characterized by a lack of romantic attraction or desire.
alternative label: Aromantic
broader: https://homosaurus.org/v3/homoit0001828
change note: Version 3.7.0
has top concept: Romantic orientation
in scheme: v3
related: https://homosaurus.org/v3/homoit0000004
related: https://homosaurus.org/v3/homoit0000067
related: https://homosaurus.org/v3/homoit0001791

Anchor partners
type: Concept
issued: 2021-06-30
modified: 2025-02-23
replaces: anchorPartners
comment: A term used in non-monogamous communities to refer to a long-term partner with multiple commitments. Often used in place of language that is seen as hierarchical (e.g., primary/secondary partner).
broader: https://homosaurus.org/v3/homoit0001660
broader: https://homosaurus.org/v3/homoit0002365
change note: Version 3.7.0
has top concept: Relationship minorities
in scheme: v3
related: https://homosaurus.org/v3/homoit0001123
related: https://homosaurus.org/v3/homoit0001629
related: https://homosaurus.org/v3/homoit0001657
related: https://homosaurus.org/v3/homoit0001663

Assigned X at birth
type: Concept
issued: 2021-06-30
modified: 2025-02-23
replaces: assignedXAtBirth
comment: The assignment of an "X" gender marker or "X" sex designation shortly after birth. It is uncommon for intersex people to be assigned intersex or X at birth.
alternative label: AXAB
alternative label: Designated X at birth
alternative label: DXAB
alternative label: X assigned at birth
alternative label: XAAB
broader: https://homosaurus.org/v3/homoit0001268
change note: Version 3.7.0
has top concept: Sex (Body)
in scheme: v3
related: https://homosaurus.org/v3/homoit0000669
related: https://homosaurus.org/v3/homoit0001646
related: https://homosaurus.org/v3/homoit0002884

Assigned sex
type: Concept
issued: 2021-06-30
modified: 2025-02-23
replaces: assignedSex
comment: An individual's sex as determined by a medical practitioner or provider. Determination is usually based on the appearance of external genitalia but may use other methodologies. In practice, sex assigned at birth is often culturally variable; the term "assigned gender" is often more applicable or accurate.
broader: https://homosaurus.org/v3/homoit0001269
change note: Version 3.7.0
has top concept: Sex (Body)
in scheme: v3
narrower: https://homosaurus.org/v3/homoit0001268
related: https://homosaurus.org/v3/homoit0000078
related: https://homosaurus.org/v3/homoit0000266
related: https://homosaurus.org/v3/homoit0001896
related: https://homosaurus.org/v3/homoit0001897

Consensual non-monogamy
type: Concept
issued: 2021-06-30
modified: 2025-02-23
replaces: consensualNonMonogamy
comment: Practice of romantic or sexual relationships with more than one person simultaneously and with all the consent of all partners involved.
alternative label: Ethical Non-monogamy
broader: https://homosaurus.org/v3/homoit0001659
change note: Version 3.7.0
has top concept: Relationship orientation
in scheme: v3
narrower: https://homosaurus.org/v3/homoit0001123
narrower: https://homosaurus.org/v3/homoit0001625
narrower: https://homosaurus.org/v3/homoit0001641
narrower: https://homosaurus.org/v3/homoit0001665
narrower: https://homosaurus.org/v3/homoit0001666
narrower: https://homosaurus.org/v3/homoit0003278
related: https://homosaurus.org/v3/homoit0001554
related: https://homosaurus.org/v3/homoit0001649
related: https://homosaurus.org/v3/homoit0001662

Demigirls
type: Concept
issued: 2021-06-30
modified: 2025-02-23
replaces: demigirls
comment: People who partially, but not fully, identify women or girls irrespective of their assigned genders. Used by cisgender, transgender, transfeminine, or nonbinary people who feel more strongly aligned with women physically or socially, but not strongly enough to identify solely as one.
alternative label: Demiwomen
alternative label: Demiwoman
alternative label: Demigirl
alternative label: Demilady
alternative label: Demiladies
alternative label: Demifemale people
broader: https://homosaurus.org/v3/homoit0000342
change note: Version 3.7.0
has top concept: LGBTQ+ people
in scheme: v3
related: https://homosaurus.org/v3/homoit0000271
related: https://homosaurus.org/v3/homoit0001048
related: https://homosaurus.org/v3/homoit0001382
related: https://homosaurus.org/v3/homoit0001653
related: https://homosaurus.org/v3/homoit0001821
related: https://homosaurus.org/v3/homoit0001923
related: https://homosaurus.org/v3/homoit0002043

Demiboys
type: Concept
issued: 2021-06-30
modified: 2025-02-23
replaces: demiboys
comment: People who partially, but not fully, identify as men or boys irrespective of their assigned genders. Used by cisgender, transgender, transmasculine, or nonbinary people who feel more aligned with men physically or socially, but not strongly enough to identify solely as one.
alternative label: Demiguy
alternative label: Demiguys
alternative label: Demimen
alternative label: Demimales
alternative label: Demimale people
alternative label: Demiboy
broader: https://homosaurus.org/v3/homoit0000342
change note: Version 3.7.0
has top concept: LGBTQ+ people
in scheme: v3
related: https://homosaurus.org/v3/homoit0000271
related: https://homosaurus.org/v3/homoit0001048
related: https://homosaurus.org/v3/homoit0001466
related: https://homosaurus.org/v3/homoit0001652
related: https://homosaurus.org/v3/homoit0001820
related: https://homosaurus.org/v3/homoit0001923
related: https://homosaurus.org/v3/homoit0002061

Gym subculture
type: Concept
issued: 2021-06-30
modified: 2025-02-23
replaces: gymSubculture
comment: Gay subculture popularized in the 1970s via homoerotic bodybuilder magazines. Often includes aesthetics modeled after ancient Greek gymnasiums. Especially popular in San Francisco, West Hollywood, and New York City.
broader: https://homosaurus.org/v3/homoit0001345
change note: Version 3.7.0
has top concept: Subcultures
in scheme: v3
related: https://homosaurus.org/v3/homoit0000487
related: https://homosaurus.org/v3/homoit0002148
related: https://homosaurus.org/v3/homoit0002149
related: https://homosaurus.org/v3/homoit0003051
related: https://homosaurus.org/v3/homoit0003072

Monogamish
type: Concept
issued: 2021-06-30
modified: 2025-02-23
replaces: monogamish
comment: Term used to describe relationships that are mostly monogamous with occasional exceptions made for sexual play.
broader: https://homosaurus.org/v3/homoit0001629
change note: Version 3.7.0
has top concept: Relationship orientation
in scheme: v3
related: https://homosaurus.org/v3/homoit0001641
related: https://homosaurus.org/v3/homoit0001916

Nesting partners
type: Concept
issued: 2021-06-30
modified: 2025-02-23
replaces: nestingPartners
comment: A term used in non-monogamous communities to refer to partners an individual lives with. Often used in place of language that is seen as hierarchical (e.g., primary partner, secondary partner).
broader: https://homosaurus.org/v3/homoit0001660
broader: https://homosaurus.org/v3/homoit0002365
change note: Version 3.7.0
has top concept: Relationship minorities
in scheme: v3
related: https://homosaurus.org/v3/homoit0001123
related: https://homosaurus.org/v3/homoit0001629
related: https://homosaurus.org/v3/homoit0001645
related: https://homosaurus.org/v3/homoit0001663

Non-consensual non-monogamy
type: Concept
issued: 2021-06-30
modified: 2025-02-23
replaces: nonConsensualNonMonogamy
comment: Practice of engaging in romantic or sexual relationships with more than one person simultaneously without each partner's consent.
broader: https://homosaurus.org/v3/homoit0001659
change note: Version 3.7.0
has top concept: Relationship orientation
in scheme: v3

Non-monogamy
type: Concept
issued: 2021-06-30
modified: 2025-02-23
replaces: nonMonogamy
comment: Practice of engaging in romantic or sexual relationships with more than one person simultaneously.
alternative label: Nonmono
alternative label: Nonmonogamy
broader: https://homosaurus.org/v3/homoit0001636
change note: Version 3.7.0
has top concept: Relationship orientation
in scheme: v3
narrower: https://homosaurus.org/v3/homoit0001629
narrower: https://homosaurus.org/v3/homoit0001651
narrower: https://homosaurus.org/v3/homoit0001658
related: https://homosaurus.org/v3/homoit0002255

Non-monogamous people
type: Concept
issued: 2021-06-30
modified: 2025-02-23
replaces: nonMonogamousPeople
comment: People who practice romantic or sexual relationships with more than one person simultaneously.
broader: https://homosaurus.org/v3/homoit0001637
change note: Version 3.7.0
has top concept: Relationship minorities
in scheme: v3
narrower: https://homosaurus.org/v3/homoit0001554
narrower: https://homosaurus.org/v3/homoit0001645
narrower: https://homosaurus.org/v3/homoit0001657
narrower: https://homosaurus.org/v3/homoit0001662
narrower: https://homosaurus.org/v3/homoit0001663
narrower: https://homosaurus.org/v3/homoit0001665
related: https://homosaurus.org/v3/homoit0003229

Paramours
type: Concept
issued: 2021-06-30
modified: 2025-02-23
replaces: paramours
comment: In polyamory contexts, paramours are the partners of an individual's partner, typically as part of a relationship the primary partner is unaware of. In other contexts, this term is used broadly as a synonym for lovers.
broader: https://homosaurus.org/v3/homoit0001123
broader: https://homosaurus.org/v3/homoit0001660
change note: Version 3.7.0
has top concept: Relationship orientation
in scheme: v3
related: https://homosaurus.org/v3/homoit0001554
related: https://homosaurus.org/v3/homoit0001638
related: https://homosaurus.org/v3/homoit0001651

Polyamorous people
type: Concept
issued: 2021-06-30
modified: 2025-02-23
replaces: polyamorousPeople
comment: People who engage in romantic, sexual, or play relationships with more than one person simultaneously, with the knowledge and consent of all parties involved.
broader: https://homosaurus.org/v3/homoit0001637
broader: https://homosaurus.org/v3/homoit0001660
change note: Version 3.7.0
has top concept: Relationship minorities
in scheme: v3
related: https://homosaurus.org/v3/homoit0001123
related: https://homosaurus.org/v3/homoit0001645
related: https://homosaurus.org/v3/homoit0001657
related: https://homosaurus.org/v3/homoit0001661
related: https://homosaurus.org/v3/homoit0003229

Relationship anarchists
type: Concept
issued: 2021-06-30
modified: 2025-02-23
replaces: relationshipAnarchists
comment: People who practice a type of non-monogamy characterized by application of anarchist principles (such as autonomy, anti-normativity, anti-hierarchical practices, refusal of state governance) to relationships. Often contrasted with hierarchical polyamory.
broader: https://homosaurus.org/v3/homoit0001637
broader: https://homosaurus.org/v3/homoit0001651
broader: https://homosaurus.org/v3/homoit0001660
change note: Version 3.7.0
has top concept: Relationship minorities
in scheme: v3
related: https://homosaurus.org/v3/homoit0001666

Relationship anarchy
type: Concept
issued: 2021-06-30
modified: 2025-02-23
replaces: relationshipAnarchy
comment: A type of non-monogamy characterized by application of anarchist principles (such as autonomy, anti-normativity, anti-hierarchical practices, refusal of state governance) to relationships. Often contrasted with hierarchical polyamory.
broader: https://homosaurus.org/v3/homoit0001651
change note: Version 3.7.0
has top concept: Relationship orientation
in scheme: v3
related: https://homosaurus.org/v3/homoit0001665

Scissoring
type: Concept
issued: 2021-06-30
modified: 2025-02-23
replaces: scissoring
comment: Typically, a sexual activity in which two women rub their genitalia against one another while intertwining their legs.
broader: https://homosaurus.org/v3/homoit0000456
broader: https://homosaurus.org/v3/homoit0001267
change note: Version 3.7.0
has top concept: Sex (Act)
in scheme: v3
related: https://homosaurus.org/v3/homoit0001669

Transgenderqueer people
type: Concept
issued: 2021-06-30
modified: 2025-02-23
replaces: transgenderqueerPeople
comment: Someone who is both trans and genderqueer and who identifies as transgenderqueer.
broader: https://homosaurus.org/v3/homoit0000582
broader: https://homosaurus.org/v3/homoit0001378
broader: https://homosaurus.org/v3/homoit0001817
change note: Version 3.7.0
has top concept: LGBTQ+ people
in scheme: v3
related: https://homosaurus.org/v3/homoit0001918
related: https://homosaurus.org/v3/homoit0001921

Tribadism
type: Concept
issued: 2021-06-30
modified: 2025-02-23
replaces: tribadism
comment: A mostly antiquated term used either to refer to scissoring, to any sexual activity between women, or to the general concept of being a lesbian ("lesbianism").
alternative label: Tribbing
broader: https://homosaurus.org/v3/homoit0000878
broader: https://homosaurus.org/v3/homoit0001267
change note: Version 3.7.0
has top concept: LGBTQ+ historical terms
in scheme: v3
related: https://homosaurus.org/v3/homoit0000799
related: https://homosaurus.org/v3/homoit0001472
related: https://homosaurus.org/v3/homoit0001667

Xenogender identity
type: Concept
issued: 2021-06-30
modified: 2025-02-23
replaces: xenogender
comment: Non-binary gender identity that is not defined in relation to human understandings of gender (i.e., female or male, woman or man), but instead in relation to animals, plants, or other things
broader: https://homosaurus.org/v3/homoit0000571
change note: Version 3.7.0
has top concept: Gender
in scheme: v3
related: https://homosaurus.org/v3/homoit0001048
related: https://homosaurus.org/v3/homoit0001671

Ae/Aer/Aerself (Pronouns)
type: Concept
issued: 2021-07-01
modified: 2025-02-23
replaces: aePronouns
comment: A set of pronouns. Used in this manner: Ae went to the Homosaurus website. I watched aer browse the Homosaurus. Ae uses the Homosaurus aerself.
alternative label: Ae (Pronouns)
alternative label: Ae/Aer/Aerself
broader: https://homosaurus.org/v3/homoit0001135
broader: https://homosaurus.org/v3/homoit0001672
change note: Version 3.7.0
has top concept: Pronouns
in scheme: v3

Co/Co/Coself (Pronouns)
type: Concept
issued: 2021-07-01
modified: 2025-02-23
replaces: coPronouns
comment: A set of pronouns. Used in this manner: Co went to the Homosaurus website. I watched co browse the Homosaurus. Co uses the Homosaurus coself.
alternative label: Co (Pronouns)
broader: https://homosaurus.org/v3/homoit0001135
broader: https://homosaurus.org/v3/homoit0001672
change note: Version 3.7.0
has top concept: Pronouns
in scheme: v3

Cy/Cyb/Cyberself (Pronouns)
type: Concept
issued: 2021-07-01
modified: 2025-02-23
replaces: cyPronouns
comment: A set of pronouns. Used in this manner: Cy went to the Homosaurus website. I watched cyb browse the Homosaurus. Cy uses the Homosaurus cyberself.
alternative label: Cy (Pronouns)
alternative label: Cy/Cyb/Cyberself
broader: https://homosaurus.org/v3/homoit0001135
broader: https://homosaurus.org/v3/homoit0001672
change note: Version 3.7.0
has top concept: Pronouns
in scheme: v3

E/Em/Emself (Pronouns)
type: Concept
issued: 2021-07-01
modified: 2025-02-23
replaces: ePronouns
comment: A set of pronouns. Used in this manner: E went to the Homosaurus website. I watched em browse the Homosaurus. E uses the Homosaurus emself.
alternative label: E (Pronouns)
alternative label: E/Em/Emself
broader: https://homosaurus.org/v3/homoit0001135
broader: https://homosaurus.org/v3/homoit0001672
change note: Version 3.7.0
has top concept: Pronouns
in scheme: v3

Ey/Em/Eirself (Pronouns)
type: Concept
issued: 2021-07-01
modified: 2025-02-23
replaces: eyPronouns
comment: A set of pronouns. Used in this manner: Ey went to the Homosaurus website. I watched em browse the Homosaurus. Ey uses the Homosaurus eirself.
alternative label: Ey (Pronouns)
alternative label: Ey/Em/Eirself
broader: https://homosaurus.org/v3/homoit0001135
broader: https://homosaurus.org/v3/homoit0001672
change note: Version 3.7.0
has top concept: Pronouns
in scheme: v3

Fe/Fem/Femself (Pronouns)
type: Concept
issued: 2021-07-01
modified: 2025-02-23
replaces: fePronouns
comment: A set of pronouns. Used in this manner: Fe went to the Homosaurus website. I watched fem browse the Homosaurus. Fe uses the Homosaurus femself.
alternative label: Fe (Pronouns)
alternative label: Fe/Fem/Femself
broader: https://homosaurus.org/v3/homoit0001135
broader: https://homosaurus.org/v3/homoit0001672
change note: Version 3.7.0
has top concept: Pronouns
in scheme: v3

Fae/Faer/Faerself (Pronouns)
type: Concept
issued: 2021-07-01
modified: 2025-02-23
replaces: faePronouns
comment: A set of pronouns. Used in this manner: Fae went to the Homosaurus website. I watched faer browse the Homosaurus. Fae uses the Homosaurus faerself.
alternative label: Fae (Pronouns)
alternative label: Fae/Faer/Faerself
broader: https://homosaurus.org/v3/homoit0001135
broader: https://homosaurus.org/v3/homoit0001672
change note: Version 3.7.0
has top concept: Pronouns
in scheme: v3

Fey/Fem/Femself (Pronouns)
type: Concept
issued: 2021-07-01
modified: 2025-02-23
replaces: feyPronouns
comment: A set of pronouns. Used in this manner: Fey went to the Homosaurus website. I watched fem browse the Homosaurus. Fey uses the Homosaurus femself.
alternative label: Fey (Pronouns)
alternative label: Fey/Fem/Femself
broader: https://homosaurus.org/v3/homoit0001135
broader: https://homosaurus.org/v3/homoit0001672
change note: Version 3.7.0
has top concept: Pronouns
in scheme: v3

He/Him/Himself (Pronouns)
type: Concept
issued: 2021-07-01
modified: 2025-02-23
replaces: hePronouns
comment: A set of pronouns. Used in this manner: He went to the Homosaurus website. I watched him browse the Homosaurus. He uses the Homosaurus himself.
alternative label: He (Pronouns)
alternative label: He/Him (Pronouns)
broader: https://homosaurus.org/v3/homoit0001135
change note: Version 3.7.0
has top concept: Pronouns
in scheme: v3

Hu/Hum/Humself (Pronouns)
type: Concept
issued: 2021-07-01
modified: 2025-02-23
replaces: huPronouns
comment: A set of pronouns. Used in this manner: Hu went to the Homosaurus website. I watched hum browse the Homosaurus. Hu uses the Homosaurus humself.
alternative label: Hu (Pronouns)
alternative label: Hu/Hum/Humself
broader: https://homosaurus.org/v3/homoit0001135
broader: https://homosaurus.org/v3/homoit0001672
change note: Version 3.7.0
has top concept: Pronouns
in scheme: v3

It/It/Itself (Pronouns)
type: Concept
issued: 2021-07-01
modified: 2025-02-23
replaces: itPronouns
comment: A set of pronouns. Used in this manner: It went to the Homosaurus website. I watched it browse the Homosaurus. It uses the Homosaurus itself.
alternative label: It (Pronouns)
broader: https://homosaurus.org/v3/homoit0001135
broader: https://homosaurus.org/v3/homoit0001672
change note: Version 3.7.0
has top concept: Pronouns
in scheme: v3

Jee/Jem/Jemself (Pronouns)
type: Concept
issued: 2021-07-01
modified: 2025-02-23
replaces: jeePronouns
comment: A set of pronouns. Used in this manner: Jee went to the Homosaurus website. I watched jem browse the Homosaurus. Jee uses the Homosaurus jemself.
alternative label: Jee (Pronouns)
broader: https://homosaurus.org/v3/homoit0001135
broader: https://homosaurus.org/v3/homoit0001672
change note: Version 3.7.0
has top concept: Pronouns
in scheme: v3

Kit/Kit/Kitself (Pronouns)
type: Concept
issued: 2021-07-01
modified: 2025-02-23
replaces: kitPronouns
comment: A set of pronouns. Used in this manner: Kit went to the Homosaurus website. I watched kit browse the Homosaurus. Kit uses the Homosaurus kitself.
alternative label: Kit (Pronouns)
broader: https://homosaurus.org/v3/homoit0001135
broader: https://homosaurus.org/v3/homoit0001672
change note: Version 3.7.0
has top concept: Pronouns
in scheme: v3

Ne/Nir/Nemself (Pronouns)
type: Concept
issued: 2021-07-01
modified: 2025-02-23
replaces: neNirPronouns
comment: A set of pronouns. Used in this manner: Ne went to the Homosaurus website. I watched nir browse the Homosaurus. Ne uses the Homosaurus nemself.
alternative label: Ne/Nir (Pronouns)
alternative label: Ne/Nir/Nemself
broader: https://homosaurus.org/v3/homoit0001135
broader: https://homosaurus.org/v3/homoit0001672
change note: Version 3.7.0
has top concept: Pronouns
in scheme: v3

Ne/Nem/Nis (Pronouns)
type: Concept
issued: 2021-07-01
modified: 2025-02-23
replaces: neNemPronouns
comment: A set of pronouns. Used in this manner: Ne went to the Homosaurus website. I watched nem browse the Homosaurus. Ne uses the Homosaurus nis.
alternative label: Ne/Nem (Pronouns)
alternative label: Ne/Nem/Nis
broader: https://homosaurus.org/v3/homoit0001135
broader: https://homosaurus.org/v3/homoit0001672
change note: Version 3.7.0
has top concept: Pronouns
in scheme: v3

Peh/Pehm/Pehself (Pronouns)
type: Concept
issued: 2021-07-01
modified: 2025-02-23
replaces: pehPronouns
comment: A set of pronouns. Used in this manner: Peh went to the Homosaurus website. I watched pehm browse the Homosaurus. Peh uses the Homosaurus pehself.
alternative label: Peh (Pronouns)
alternative label: Peh/Pehm/Pehself
broader: https://homosaurus.org/v3/homoit0001135
broader: https://homosaurus.org/v3/homoit0001672
change note: Version 3.7.0
has top concept: Pronouns
in scheme: v3

Per/Per/Perself (Pronouns)
type: Concept
issued: 2021-07-01
modified: 2025-02-23
replaces: perPronouns
comment: A set of pronouns. Used in this manner: Per went to the Homosaurus website. I watched per browse the Homosaurus. Per uses the Homosaurus perself.
alternative label: Per (Pronouns)
alternative label: Per/Pers/Perself
broader: https://homosaurus.org/v3/homoit0001135
broader: https://homosaurus.org/v3/homoit0001672
change note: Version 3.7.0
has top concept: Pronouns
in scheme: v3

Sie/Hir/Hirself (Pronouns)
type: Concept
issued: 2021-07-01
modified: 2025-02-23
replaces: siePronouns
comment: A set of pronouns. Used in this manner: Sie went to the Homosaurus website. I watched hir browse the Homosaurus. Sie uses the Homosaurus hirself.
alternative label: Sie (Pronouns)
broader: https://homosaurus.org/v3/homoit0001135
broader: https://homosaurus.org/v3/homoit0001672
change note: Version 3.7.0
has top concept: Pronouns
in scheme: v3

Se/Ser/Serself (Pronouns)
type: Concept
issued: 2021-07-01
modified: 2025-02-23
replaces: sePronouns
comment: A set of pronouns. Used in this manner: Se went to the Homosaurus website. I watched ser browse the Homosaurus. Se uses the Homosaurus serself.
alternative label: Se (Pronouns)
alternative label: Se/Ser/Serself
broader: https://homosaurus.org/v3/homoit0001135
broader: https://homosaurus.org/v3/homoit0001672
change note: Version 3.7.0
has top concept: Pronouns
in scheme: v3

She/Her/Herself (Pronouns)
type: Concept
issued: 2021-07-01
modified: 2025-02-23
replaces: shePronouns
comment: A set of pronouns. Used in this manner: She went to the Homosaurus website. I watched her browse the Homosaurus. She uses the Homosaurus herself.
alternative label: She (Pronouns)
alternative label: She/Her (Pronouns)
broader: https://homosaurus.org/v3/homoit0001135
change note: Version 3.7.0
has top concept: Pronouns
in scheme: v3

Shi/Hir/Hirself (Pronouns)
type: Concept
issued: 2021-07-01
modified: 2025-02-23
replaces: shiPronouns
comment: A set of pronouns. Used in this manner: Shi went to the Homosaurus website. I watched hir browse the Homosaurus. Shi uses the Homosaurus hirself.
alternative label: Shi (Pronouns)
alternative label: Shi/Hir/Hirself
broader: https://homosaurus.org/v3/homoit0001135
broader: https://homosaurus.org/v3/homoit0001672
change note: Version 3.7.0
has top concept: Pronouns
in scheme: v3

Si/Hyr/Hyrself (Pronouns)
type: Concept
issued: 2021-07-01
modified: 2025-02-23
replaces: siPronouns
comment: A set of pronouns. Used in this manner: Si went to the Homosaurus website. I watched hyr browse the Homosaurus. Si uses the Homosaurus hyrself.
alternative label: Si (Pronouns)
alternative label: Si/Hyr/Hyrself
broader: https://homosaurus.org/v3/homoit0001135
broader: https://homosaurus.org/v3/homoit0001672
change note: Version 3.7.0
has top concept: Pronouns
in scheme: v3

They/Them/Themselves (Pronouns)
type: Concept
issued: 2021-07-01
modified: 2025-02-23
replaces: theyThemThemselvesPronouns
comment: A set of pronouns. Used in this manner: They went to the Homosaurus website. I watched them browse the Homosaurus. They use the Homosaurus themselves.
alternative label: They/Them/Themselves
broader: https://homosaurus.org/v3/homoit0001135
change note: Version 3.7.0
has top concept: Pronouns
in scheme: v3

They/Them/Themself (Pronouns)
type: Concept
issued: 2021-07-01
modified: 2025-02-23
replaces: theyThemThemselfPronouns
comment: A set of pronouns. Used in this manner: They went to the Homosaurus website. I watched them browse the Homosaurus. They use the Homosaurus themself.
alternative label: They/Them/Themself
broader: https://homosaurus.org/v3/homoit0001135
change note: Version 3.7.0
has top concept: Pronouns
in scheme: v3

Thon/Thon/Thonself (Pronouns)
type: Concept
issued: 2021-07-01
modified: 2025-02-23
replaces: thonPronouns
comment: A set of pronouns. Used in this manner: Thon went to the Homosaurus website. I watched thon browse the Homosaurus. Thon uses the Homosaurus thonself.
alternative label: Thon (Pronouns)
alternative label: Thon/Thons/Thonself
broader: https://homosaurus.org/v3/homoit0001135
broader: https://homosaurus.org/v3/homoit0001672
change note: Version 3.7.0
has top concept: Pronouns
in scheme: v3

Ve/Ver/Verself (Pronouns)
type: Concept
issued: 2021-07-01
modified: 2025-02-23
replaces: veVerPronouns
comment: A set of pronouns. Used in this manner: Ve went to the Homosaurus website. I watched ver browse the Homosaurus. Ve uses the Homosaurus verself.
alternative label: Ve/Ver (Pronouns)
alternative label: Ve/Ver/Verself
broader: https://homosaurus.org/v3/homoit0001135
broader: https://homosaurus.org/v3/homoit0001672
change note: Version 3.7.0
has top concept: Pronouns
in scheme: v3

Ve/Vem/Verself (Pronouns)
type: Concept
issued: 2021-07-01
modified: 2025-02-23
replaces: veVemPronouns
comment: A set of pronouns. Used in this manner: Ve went to the Homosaurus website. I watched vem browse the Homosaurus. Ve uses the Homosaurus verself.
alternative label: Ve/Vem (Pronouns)
alternative label: Ve/Vem/Verself
broader: https://homosaurus.org/v3/homoit0001135
broader: https://homosaurus.org/v3/homoit0001672
change note: Version 3.7.0
has top concept: Pronouns
in scheme: v3

Voi/Void/Voidself (Pronouns)
type: Concept
issued: 2021-07-01
modified: 2025-02-23
replaces: voiPronouns
comment: A set of pronouns. Used in this manner: Voi went to the Homosaurus website. I watched void browse the Homosaurus. Voi uses the Homosaurus voidself.
alternative label: Voi (Pronouns)
alternative label: Voi/Void/Voidself
broader: https://homosaurus.org/v3/homoit0001135
broader: https://homosaurus.org/v3/homoit0001672
change note: Version 3.7.0
has top concept: Pronouns
in scheme: v3

Vi/Ver/Virself (Pronouns)
type: Concept
issued: 2021-07-01
modified: 2025-02-23
replaces: viVerPronouns
comment: A set of pronouns. Used in this manner: Vi went to the Homosaurus website. I watched ver browse the Homosaurus. Vi uses the Homosaurus virself.
alternative label: Vi/Ver (Pronouns)
alternative label: Vi/Ver/Virself
broader: https://homosaurus.org/v3/homoit0001135
broader: https://homosaurus.org/v3/homoit0001672
change note: Version 3.7.0
has top concept: Pronouns
in scheme: v3

Vi/Vim/Virself (Pronouns)
type: Concept
issued: 2021-07-01
modified: 2025-02-23
replaces: viVimPronouns
comment: A set of pronouns. Used in this manner: Vi went to the Homosaurus website. I watched vim browse the Homosaurus. Vi uses the Homosaurus virself.
alternative label: Vi/Vim (Pronouns)
alternative label: Vi/Vim/Virself
broader: https://homosaurus.org/v3/homoit0001135
broader: https://homosaurus.org/v3/homoit0001672
change note: Version 3.7.0
has top concept: Pronouns
in scheme: v3

Xie/Xer/Xerself (Pronouns)
type: Concept
issued: 2021-07-01
modified: 2025-02-23
replaces: xiePronouns
comment: A set of pronouns. Used in this manner: Xie went to the Homosaurus website. I watched xer browse the Homosaurus. Xie uses the Homosaurus xerself.
alternative label: Xie (Pronouns)
alternative label: Xie/Xer/Xerself
broader: https://homosaurus.org/v3/homoit0001135
broader: https://homosaurus.org/v3/homoit0001672
change note: Version 3.7.0
has top concept: Pronouns
in scheme: v3

Xe/Xyr/Xemself (Pronouns)
type: Concept
issued: 2021-07-01
modified: 2025-02-23
replaces: xePronouns
comment: A set of pronouns. Used in this manner: Xe went to the Homosaurus website. I watched xyr browse the Homosaurus. Xe uses the Homosaurus xemself.
alternative label: Xe (Pronouns)
alternative label: Xe/Xyr/Xemself
broader: https://homosaurus.org/v3/homoit0001135
broader: https://homosaurus.org/v3/homoit0001672
change note: Version 3.7.0
has top concept: Pronouns
in scheme: v3

Xey/Xem/Xyr (Pronouns)
type: Concept
issued: 2021-07-01
modified: 2025-02-23
replaces: xeyXemXyrPronouns
comment: A set of pronouns. Used in this manner: Xey went to the Homosaurus website. I watched xem browse the Homosaurus. Xey uses the Homosaurus xyr.
alternative label: Xey/Xem/Xyr
broader: https://homosaurus.org/v3/homoit0001135
broader: https://homosaurus.org/v3/homoit0001672
change note: Version 3.7.0
has top concept: Pronouns
in scheme: v3

Xey/Xem/Xeir (Pronouns)
type: Concept
issued: 2021-07-01
modified: 2025-02-23
replaces: xeyXemXeirPronouns
comment: A set of pronouns. Used in this manner: Xey went to the Homosaurus website. I watched xem browse the Homosaurus. Xey uses the Homosaurus xeir.
alternative label: Xey/Xem/Xeir
broader: https://homosaurus.org/v3/homoit0001135
broader: https://homosaurus.org/v3/homoit0001672
change note: Version 3.7.0
has top concept: Pronouns
in scheme: v3

Yo/Yo/Yosself (Pronouns)
type: Concept
issued: 2021-07-01
modified: 2025-02-23
replaces: yoPronouns
comment: A set of pronouns. Used in this manner: Yo went to the Homosaurus website. I watched yo browse the Homosaurus. Yo uses the Homosaurus yosself.
alternative label: Yo (Pronouns)
alternative label: Yo/Yos/Yosself
broader: https://homosaurus.org/v3/homoit0001135
broader: https://homosaurus.org/v3/homoit0001672
change note: Version 3.7.0
has top concept: Pronouns
in scheme: v3

Ze/Zir/Zirself (Pronouns)
type: Concept
issued: 2021-07-01
modified: 2025-02-23
replaces: zePronouns
comment: A set of pronouns. Used in this manner: Ze went to the Homosaurus website. I watched zir browse the Homosaurus. Ze uses the Homosaurus zirself.
alternative label: Ze (Pronouns)
alternative label: Ze/Zir/Zirself
broader: https://homosaurus.org/v3/homoit0001135
broader: https://homosaurus.org/v3/homoit0001672
change note: Version 3.7.0
has top concept: Pronouns
in scheme: v3

Ze/Hir/Hirself (Pronouns)
type: Concept
issued: 2021-07-01
modified: 2025-02-23
replaces: zeHirPronouns
comment: A set of pronouns. Used in this manner: Ze went to the Homosaurus website. I watched hir browse the Homosaurus. Ze uses the Homosaurus hirself.
alternative label: Ze/Hir (Pronouns)
alternative label: Ze/Hir/Hirself
broader: https://homosaurus.org/v3/homoit0001135
broader: https://homosaurus.org/v3/homoit0001672
change note: Version 3.7.0
has top concept: Pronouns
in scheme: v3

Ze/Zem/Zirself (Pronouns)
type: Concept
issued: 2021-07-01
modified: 2025-02-23
replaces: zeZemPronouns
comment: A set of pronouns. Used in this manner: Ze went to the Homosaurus website. I watched zem browse the Homosaurus. Ze uses the Homosaurus zirself.
alternative label: Ze/Zem (Pronouns)
alternative label: Ze/Zem/Zirself
broader: https://homosaurus.org/v3/homoit0001135
broader: https://homosaurus.org/v3/homoit0001672
change note: Version 3.7.0
has top concept: Pronouns
in scheme: v3

Ze/Mer/Zemself (Pronouns)
type: Concept
issued: 2021-07-01
modified: 2025-02-23
replaces: zeMerPronouns
comment: A set of pronouns. Used in this manner: Ze went to the Homosaurus website. I watched mer browse the Homosaurus. Ze uses the Homosaurus zemself.
alternative label: Ze/Mer (Pronouns)
alternative label: Ze/Mer/Zemself
broader: https://homosaurus.org/v3/homoit0001135
broader: https://homosaurus.org/v3/homoit0001672
change note: Version 3.7.0
has top concept: Pronouns
in scheme: v3

Zee/Zed/Zedself (Pronouns)
type: Concept
issued: 2021-07-01
modified: 2025-02-23
replaces: zeeZedPronouns
comment: A set of pronouns. Used in this manner: Zee went to the Homosaurus website. I watched zed browse the Homosaurus. Zee uses the Homosaurus zedself.
alternative label: Zee/Zed (Pronouns)
alternative label: Zee/Zed/Zedself
broader: https://homosaurus.org/v3/homoit0001135
broader: https://homosaurus.org/v3/homoit0001672
change note: Version 3.7.0
has top concept: Pronouns
in scheme: v3

Zie/Zir/Zirself (Pronouns)
type: Concept
issued: 2021-07-01
modified: 2025-02-23
replaces: zeeZirPronouns
comment: A set of pronouns. Used in this manner: Zie went to the Homosaurus website. I watched zir browse the Homosaurus. Zie uses the Homosaurus zirself.
alternative label: Zee/Zir (Pronouns)
alternative label: Zie/Zir/Zirself
broader: https://homosaurus.org/v3/homoit0001135
broader: https://homosaurus.org/v3/homoit0001672
change note: Version 3.7.0
has top concept: Pronouns
in scheme: v3

Zie/Zem/Zirself (Pronouns)
type: Concept
issued: 2021-07-01
modified: 2025-02-23
replaces: zieZemPronouns
comment: A set of pronouns. Used in this manner: Zie went to the Homosaurus website. I watched zem browse the Homosaurus. Zie uses the Homosaurus zirself.
alternative label: Zie/Zem (Pronouns)
alternative label: Zie/Zem/Zirself
broader: https://homosaurus.org/v3/homoit0001135
broader: https://homosaurus.org/v3/homoit0001672
change note: Version 3.7.0
has top concept: Pronouns
in scheme: v3

Zie/Hir/Hirself (Pronouns)
type: Concept
issued: 2021-07-01
modified: 2025-02-23
replaces: zieHirPronouns
comment: A set of pronouns. Used in this manner: Zie went to the Homosaurus website. I watched hir browse the Homosaurus. Zie uses the Homosaurus hirself.
alternative label: Zie/Hir (Pronouns)
alternative label: Zie/Hir/Hirself
broader: https://homosaurus.org/v3/homoit0001135
broader: https://homosaurus.org/v3/homoit0001672
change note: Version 3.7.0
has top concept: Pronouns
in scheme: v3

Zme/Zmyr/Zmyrself (Pronouns)
type: Concept
issued: 2021-07-01
modified: 2025-02-23
replaces: zmePronouns
comment: A set of pronouns. Used in this manner: Zme went to the Homosaurus website. I watched zmyr browse the Homosaurus. Zme uses the Homosaurus zmyrself.
alternative label: Zme (Pronouns)
alternative label: Zme/Zmyr/Zmyrself
broader: https://homosaurus.org/v3/homoit0001135
broader: https://homosaurus.org/v3/homoit0001672
change note: Version 3.7.0
has top concept: Pronouns
in scheme: v3

Lesbian employment
type: Concept
issued: 2021-11-02
modified: 2025-02-23
comment: Employment of lesbians.
broader: https://homosaurus.org/v3/homoit0001717
change note: Version 3.7.0
has top concept: LGBTQ+ employment
in scheme: v3
related: https://homosaurus.org/v3/homoit0001719
related: https://homosaurus.org/v3/homoit0001720
related: https://homosaurus.org/v3/homoit0001721
related: https://homosaurus.org/v3/homoit0001722
related: https://homosaurus.org/v3/homoit0001772

Gay employment
type: Concept
issued: 2021-11-02
modified: 2025-02-23
comment: Employment of gay men.
broader: https://homosaurus.org/v3/homoit0001717
change note: Version 3.7.0
has top concept: LGBTQ+ employment
in scheme: v3
related: https://homosaurus.org/v3/homoit0001718
related: https://homosaurus.org/v3/homoit0001720
related: https://homosaurus.org/v3/homoit0001721
related: https://homosaurus.org/v3/homoit0001722
related: https://homosaurus.org/v3/homoit0001773

Bisexual employment
type: Concept
issued: 2021-11-02
modified: 2025-02-23
comment: Employment of bisexual people.
broader: https://homosaurus.org/v3/homoit0001717
change note: Version 3.7.0
has top concept: LGBTQ+ employment
in scheme: v3
related: https://homosaurus.org/v3/homoit0001718
related: https://homosaurus.org/v3/homoit0001719
related: https://homosaurus.org/v3/homoit0001721
related: https://homosaurus.org/v3/homoit0001722
related: https://homosaurus.org/v3/homoit0001774

Transgender employment
type: Concept
issued: 2021-11-02
modified: 2025-02-23
comment: Employment of transgender people.
broader: https://homosaurus.org/v3/homoit0001717
change note: Version 3.7.0
has top concept: LGBTQ+ employment
in scheme: v3
related: https://homosaurus.org/v3/homoit0001718
related: https://homosaurus.org/v3/homoit0001719
related: https://homosaurus.org/v3/homoit0001720
related: https://homosaurus.org/v3/homoit0001722
related: https://homosaurus.org/v3/homoit0001775

Queer employment
type: Concept
issued: 2021-11-02
modified: 2025-02-23
comment: Employment of queer people.
broader: https://homosaurus.org/v3/homoit0001717
change note: Version 3.7.0
has top concept: LGBTQ+ employment
in scheme: v3
related: https://homosaurus.org/v3/homoit0001718
related: https://homosaurus.org/v3/homoit0001719
related: https://homosaurus.org/v3/homoit0001720
related: https://homosaurus.org/v3/homoit0001721
related: https://homosaurus.org/v3/homoit0001776

LGBTQ+ authors
type: Concept
issued: 2021-11-02
modified: 2025-02-23
comment: LGBTQ+ creators of written works.
alternative label: Authors (LGBTQ)
broader: https://homosaurus.org/v3/homoit0000915
change note: Version 3.7.0
has top concept: LGBTQ+ people
in scheme: v3
narrower: https://homosaurus.org/v3/homoit0001724
narrower: https://homosaurus.org/v3/homoit0001725
narrower: https://homosaurus.org/v3/homoit0001726
narrower: https://homosaurus.org/v3/homoit0001727
narrower: https://homosaurus.org/v3/homoit0001728
narrower: https://homosaurus.org/v3/homoit0001747
narrower: https://homosaurus.org/v3/homoit0001748
narrower: https://homosaurus.org/v3/homoit0001749
narrower: https://homosaurus.org/v3/homoit0002487
narrower: https://homosaurus.org/v3/homoit0002505
narrower: https://homosaurus.org/v3/homoit0002534
narrower: https://homosaurus.org/v3/homoit0003663
related: https://homosaurus.org/v3/homoit0000376
related: https://homosaurus.org/v3/homoit0000443
related: https://homosaurus.org/v3/homoit0000827
related: https://homosaurus.org/v3/homoit0000972
related: https://homosaurus.org/v3/homoit0001118
related: https://homosaurus.org/v3/homoit0001602
related: https://homosaurus.org/v3/homoit0001729
related: https://homosaurus.org/v3/homoit0001750
related: https://homosaurus.org/v3/homoit0002179

Lesbian authors
type: Concept
issued: 2021-11-02
modified: 2025-02-23
comment: Lesbian creators of written works.
broader: https://homosaurus.org/v3/homoit0001723
change note: Version 3.7.0
has top concept: LGBTQ+ people
in scheme: v3
related: https://homosaurus.org/v3/homoit0000739
related: https://homosaurus.org/v3/homoit0000742
related: https://homosaurus.org/v3/homoit0000750
related: https://homosaurus.org/v3/homoit0000762
related: https://homosaurus.org/v3/homoit0001603
related: https://homosaurus.org/v3/homoit0001730
related: https://homosaurus.org/v3/homoit0002178
related: https://homosaurus.org/v3/homoit0001615

Gay authors
type: Concept
issued: 2021-11-02
modified: 2025-02-23
comment: Gay creators of written works.
broader: https://homosaurus.org/v3/homoit0001723
change note: Version 3.7.0
has top concept: LGBTQ+ people
in scheme: v3
related: https://homosaurus.org/v3/homoit0000489
related: https://homosaurus.org/v3/homoit0000493
related: https://homosaurus.org/v3/homoit0000502
related: https://homosaurus.org/v3/homoit0000517
related: https://homosaurus.org/v3/homoit0001604
related: https://homosaurus.org/v3/homoit0001731
related: https://homosaurus.org/v3/homoit0002170

Bisexual authors
type: Concept
issued: 2021-11-02
modified: 2025-02-23
comment: Bisexual creators of written works.
broader: https://homosaurus.org/v3/homoit0001723
change note: Version 3.7.0
has top concept: LGBTQ+ people
in scheme: v3
related: https://homosaurus.org/v3/homoit0000149
related: https://homosaurus.org/v3/homoit0000151
related: https://homosaurus.org/v3/homoit0000157
related: https://homosaurus.org/v3/homoit0000174
related: https://homosaurus.org/v3/homoit0001605
related: https://homosaurus.org/v3/homoit0001732
related: https://homosaurus.org/v3/homoit0002150
related: https://homosaurus.org/v3/homoit0001617

Transgender authors
type: Concept
issued: 2021-11-02
modified: 2025-02-23
comment: Transgender creators of written works.
broader: https://homosaurus.org/v3/homoit0001723
change note: Version 3.7.0
has top concept: LGBTQ+ people
in scheme: v3
related: https://homosaurus.org/v3/homoit0001411
related: https://homosaurus.org/v3/homoit0001414
related: https://homosaurus.org/v3/homoit0001419
related: https://homosaurus.org/v3/homoit0001433
related: https://homosaurus.org/v3/homoit0001606
related: https://homosaurus.org/v3/homoit0001733
related: https://homosaurus.org/v3/homoit0002211
related: https://homosaurus.org/v3/homoit0001618

Queer authors
type: Concept
issued: 2021-11-02
modified: 2025-02-23
comment: Queer creators of written works.
broader: https://homosaurus.org/v3/homoit0001723
change note: Version 3.7.0
has top concept: LGBTQ+ people
in scheme: v3
related: https://homosaurus.org/v3/homoit0001174
related: https://homosaurus.org/v3/homoit0001177
related: https://homosaurus.org/v3/homoit0001183
related: https://homosaurus.org/v3/homoit0001197
related: https://homosaurus.org/v3/homoit0001607
related: https://homosaurus.org/v3/homoit0001734
related: https://homosaurus.org/v3/homoit0002193
related: https://homosaurus.org/v3/homoit0001619

Lesbian autobiographies
type: Concept
issued: 2021-11-02
modified: 2025-02-23
comment: Accounts of lesbians' lives written by those people. For written accounts of lesbians' lives that were not written by the subject, use "Lesbian biographies."
alternative label: Lesbian autobios
alternative label: Lesbian memoirs
broader: https://homosaurus.org/v3/homoit0001729
change note: Version 3.7.0
has top concept: LGBTQ+ autobiographies
in scheme: v3
related: https://homosaurus.org/v3/homoit0001615
related: https://homosaurus.org/v3/homoit0001724
related: https://homosaurus.org/v3/homoit0001731
related: https://homosaurus.org/v3/homoit0001732
related: https://homosaurus.org/v3/homoit0002463
related: https://homosaurus.org/v3/homoit0002480
related: https://homosaurus.org/v3/homoit0002540

Gay autobiographies
type: Concept
issued: 2021-11-02
modified: 2025-02-23
comment: Accounts of gay men's lives written by those people. For written accounts of gay men's lives that were not written by the subject, use "Gay biographies."
alternative label: Gay autobios
alternative label: Gay memoirs
broader: https://homosaurus.org/v3/homoit0001729
change note: Version 3.7.0
has top concept: LGBTQ+ autobiographies
in scheme: v3
related: https://homosaurus.org/v3/homoit0001616
related: https://homosaurus.org/v3/homoit0001725
related: https://homosaurus.org/v3/homoit0001730
related: https://homosaurus.org/v3/homoit0001732
related: https://homosaurus.org/v3/homoit0002463
related: https://homosaurus.org/v3/homoit0002480
related: https://homosaurus.org/v3/homoit0002540

Bisexual autobiographies
type: Concept
issued: 2021-11-02
modified: 2025-02-23
comment: Accounts of bisexual peoples' lives written by those people. For written accounts of bisexual people's lives that were not written by the subject, use "Bisexual biographies."
alternative label: Bisexual autobios
alternative label: Bisexual memoirs
broader: https://homosaurus.org/v3/homoit0001729
change note: Version 3.7.0
has top concept: LGBTQ+ autobiographies
in scheme: v3
related: https://homosaurus.org/v3/homoit0001617
related: https://homosaurus.org/v3/homoit0001726
related: https://homosaurus.org/v3/homoit0001730
related: https://homosaurus.org/v3/homoit0001731

Transgender autobiographies
type: Concept
issued: 2021-11-02
modified: 2025-02-23
comment: Accounts of trans peoples' lives written by those people. For written accounts of trans people's lives that were not written by the subject, use "Transgender biographies."
alternative label: Transgender autobios
alternative label: Transgender memoirs
alternative label: Trans autobiographies
alternative label: Trans autobios
alternative label: Trans memoirs
broader: https://homosaurus.org/v3/homoit0001729
change note: Version 3.7.0
has top concept: LGBTQ+ autobiographies
in scheme: v3
related: https://homosaurus.org/v3/homoit0001618
related: https://homosaurus.org/v3/homoit0001727

Queer autobiographies
type: Concept
issued: 2021-11-02
modified: 2025-02-23
comment: Accounts of queer peoples' lives written by those people. For written accounts of queer people's lives that were not written by the subject, use "Queer biographies."
alternative label: Queer autobios
alternative label: Queer memoirs
broader: https://homosaurus.org/v3/homoit0001729
change note: Version 3.7.0
has top concept: LGBTQ+ autobiographies
in scheme: v3
related: https://homosaurus.org/v3/homoit0001619
related: https://homosaurus.org/v3/homoit0001728

Lesbian-owned businesses
type: Concept
issued: 2021-11-02
modified: 2025-02-23
comment: Businesses owned by lesbians.
broader: https://homosaurus.org/v3/homoit0001735
change note: Version 3.7.0
has top concept: LGBTQ+-owned businesses
in scheme: v3
related: https://homosaurus.org/v3/homoit0001717
related: https://homosaurus.org/v3/homoit0001737
related: https://homosaurus.org/v3/homoit0001738
related: https://homosaurus.org/v3/homoit0001739
related: https://homosaurus.org/v3/homoit0001740
related: https://homosaurus.org/v3/homoit0002030

Gay-owned businesses
type: Concept
issued: 2021-11-02
modified: 2025-02-23
comment: Businesses owned by gay people.
broader: https://homosaurus.org/v3/homoit0001735
change note: Version 3.7.0
has top concept: LGBTQ+-owned businesses
in scheme: v3
related: https://homosaurus.org/v3/homoit0001717
related: https://homosaurus.org/v3/homoit0001736
related: https://homosaurus.org/v3/homoit0001738
related: https://homosaurus.org/v3/homoit0001739
related: https://homosaurus.org/v3/homoit0001740
related: https://homosaurus.org/v3/homoit0002031

Bisexual-owned businesses
type: Concept
issued: 2021-11-02
modified: 2025-02-23
comment: Businesses owned by bisexual people.
broader: https://homosaurus.org/v3/homoit0001735
change note: Version 3.7.0
has top concept: LGBTQ+-owned businesses
in scheme: v3
related: https://homosaurus.org/v3/homoit0001717
related: https://homosaurus.org/v3/homoit0001736
related: https://homosaurus.org/v3/homoit0001737
related: https://homosaurus.org/v3/homoit0001739
related: https://homosaurus.org/v3/homoit0001740
related: https://homosaurus.org/v3/homoit0002032

Transgender-owned businesses
type: Concept
issued: 2021-11-02
modified: 2025-02-23
comment: Businesses owned by transgender people.
broader: https://homosaurus.org/v3/homoit0001735
change note: Version 3.7.0
has top concept: LGBTQ+-owned businesses
in scheme: v3
related: https://homosaurus.org/v3/homoit0001717
related: https://homosaurus.org/v3/homoit0001736
related: https://homosaurus.org/v3/homoit0001737
related: https://homosaurus.org/v3/homoit0001738
related: https://homosaurus.org/v3/homoit0001740
related: https://homosaurus.org/v3/homoit0002033

Queer-owned businesses
type: Concept
issued: 2021-11-02
modified: 2025-02-23
comment: Businesses owned by queer people.
broader: https://homosaurus.org/v3/homoit0001735
change note: Version 3.7.0
has top concept: LGBTQ+-owned businesses
in scheme: v3
related: https://homosaurus.org/v3/homoit0001717
related: https://homosaurus.org/v3/homoit0001736
related: https://homosaurus.org/v3/homoit0001737
related: https://homosaurus.org/v3/homoit0001738
related: https://homosaurus.org/v3/homoit0001739
related: https://homosaurus.org/v3/homoit0002034

Lesbian-focused businesses
type: Concept
issued: 2021-11-02
modified: 2025-02-23
comment: Businesses focusing on lesbian clientele and products related to lesbian communities.
broader: https://homosaurus.org/v3/homoit0001741
change note: Version 3.7.0
has top concept: LGBTQ+-focused businesses
in scheme: v3
related: https://homosaurus.org/v3/homoit0001717
related: https://homosaurus.org/v3/homoit0001735
related: https://homosaurus.org/v3/homoit0001743
related: https://homosaurus.org/v3/homoit0001744
related: https://homosaurus.org/v3/homoit0001745
related: https://homosaurus.org/v3/homoit0001746
related: https://homosaurus.org/v3/homoit0002030

Gay-focused businesses
type: Concept
issued: 2021-11-02
modified: 2025-02-23
comment: Businesses focusing on gay clientele and products related to gay communities.
broader: https://homosaurus.org/v3/homoit0001741
change note: Version 3.7.0
has top concept: LGBTQ+-focused businesses
in scheme: v3
related: https://homosaurus.org/v3/homoit0001717
related: https://homosaurus.org/v3/homoit0001735
related: https://homosaurus.org/v3/homoit0001742
related: https://homosaurus.org/v3/homoit0001744
related: https://homosaurus.org/v3/homoit0001745
related: https://homosaurus.org/v3/homoit0001746
related: https://homosaurus.org/v3/homoit0002031

Bisexual-focused businesses
type: Concept
issued: 2021-11-02
modified: 2025-02-23
comment: Businesses focusing on bisexual clientele and products related to bisexual communities.
broader: https://homosaurus.org/v3/homoit0001741
change note: Version 3.7.0
has top concept: LGBTQ+-focused businesses
in scheme: v3
related: https://homosaurus.org/v3/homoit0001717
related: https://homosaurus.org/v3/homoit0001735
related: https://homosaurus.org/v3/homoit0001742
related: https://homosaurus.org/v3/homoit0001743
related: https://homosaurus.org/v3/homoit0001745
related: https://homosaurus.org/v3/homoit0001746
related: https://homosaurus.org/v3/homoit0002032

Transgender-focused businesses
type: Concept
issued: 2021-11-02
modified: 2025-02-23
comment: Businesses focusing on transgender clientele and products related to transgender communities.
broader: https://homosaurus.org/v3/homoit0001741
change note: Version 3.7.0
has top concept: LGBTQ+-focused businesses
in scheme: v3
related: https://homosaurus.org/v3/homoit0001717
related: https://homosaurus.org/v3/homoit0001735
related: https://homosaurus.org/v3/homoit0001742
related: https://homosaurus.org/v3/homoit0001743
related: https://homosaurus.org/v3/homoit0001744
related: https://homosaurus.org/v3/homoit0001746
related: https://homosaurus.org/v3/homoit0002033

Queer-focused businesses
type: Concept
issued: 2021-11-02
modified: 2025-02-23
comment: Businesses focusing on queer clientele and products related to queer communities.
broader: https://homosaurus.org/v3/homoit0001741
change note: Version 3.7.0
has top concept: LGBTQ+-focused businesses
in scheme: v3
related: https://homosaurus.org/v3/homoit0001717
related: https://homosaurus.org/v3/homoit0001735
related: https://homosaurus.org/v3/homoit0001742
related: https://homosaurus.org/v3/homoit0001743
related: https://homosaurus.org/v3/homoit0001744
related: https://homosaurus.org/v3/homoit0001745
related: https://homosaurus.org/v3/homoit0002034

Asexual authors
type: Concept
issued: 2021-11-09
modified: 2025-02-23
comment: Asexual creators of written works.
alternative label: Ace authors
alternative label: Ace writers
alternative label: Asexual writers
broader: https://homosaurus.org/v3/homoit0001723
change note: Version 3.7.0
has top concept: LGBTQ+ people
in scheme: v3
related: https://homosaurus.org/v3/homoit0001754
related: https://homosaurus.org/v3/homoit0002146
related: https://homosaurus.org/v3/homoit0002405
related: https://homosaurus.org/v3/homoit0002467
related: https://homosaurus.org/v3/homoit0002480
related: https://homosaurus.org/v3/homoit0002481
related: https://homosaurus.org/v3/homoit0002483

Aromantic authors
type: Concept
issued: 2021-11-09
modified: 2025-02-23
comment: Aromantic creators of written works.
alternative label: Aro authors
alternative label: Aro writers
alternative label: Aromantic writers
broader: https://homosaurus.org/v3/homoit0001723
change note: Version 3.7.0
has top concept: LGBTQ+ people
in scheme: v3
related: https://homosaurus.org/v3/homoit0001753
related: https://homosaurus.org/v3/homoit0002145
related: https://homosaurus.org/v3/homoit0002401
related: https://homosaurus.org/v3/homoit0002449
related: https://homosaurus.org/v3/homoit0002463
related: https://homosaurus.org/v3/homoit0002464
related: https://homosaurus.org/v3/homoit0002466

Intersex authors
type: Concept
issued: 2021-11-09
modified: 2025-02-23
comment: Intersex creators of written works.
alternative label: Intersex writers
broader: https://homosaurus.org/v3/homoit0001723
change note: Version 3.7.0
has top concept: LGBTQ+ people
in scheme: v3
related: https://homosaurus.org/v3/homoit0001752
related: https://homosaurus.org/v3/homoit0002750
related: https://homosaurus.org/v3/homoit0002779

Two-Spirit authors
type: Concept
issued: 2021-11-09
modified: 2025-02-23
comment: Two-Spirit creators of written works.
alternative label: 2S authors
alternative label: 2S writers
alternative label: Two Spirit authors
alternative label: Two Spirit writers
alternative label: Two Spirited authors
alternative label: Two Spirited writers
alternative label: Two-Spirit writers
alternative label: Two-Spirited authors
alternative label: Two-Spirited writers
broader: https://homosaurus.org/v3/homoit0001480
change note: Version 3.7.0
has top concept: Gender
in scheme: v3
narrower: https://homosaurus.org/v3/homoit0003671
related: https://homosaurus.org/v3/homoit0001723
related: https://homosaurus.org/v3/homoit0002710
related: https://homosaurus.org/v3/homoit0002679
related: https://homosaurus.org/v3/homoit0002680

Two-Spirit fiction
type: Concept
issued: 2021-11-09
modified: 2025-02-23
comment: Written works describing imagined events or people; use in reference to fictional works focusing on Two-Spirit characters or themes.
alternative label: 2S fiction
alternative label: Two Spirit fiction
alternative label: Two Spirited fiction
alternative label: Two-Spirited fiction
broader: https://homosaurus.org/v3/homoit0002710
change note: Version 3.7.0
has top concept: Two-Spirit literature
in scheme: v3
related: https://homosaurus.org/v3/homoit0000443
related: https://homosaurus.org/v3/homoit0002213

Intersex fiction
type: Concept
issued: 2021-11-09
modified: 2025-02-23
comment: Written works of fiction featuring intersex characters or addressing intersex themes.
broader: https://homosaurus.org/v3/homoit0000443
broader: https://homosaurus.org/v3/homoit0002175
change note: Version 3.7.0
has top concept: Subcultures
in scheme: v3
narrower: https://homosaurus.org/v3/homoit0002419
narrower: https://homosaurus.org/v3/homoit0002428
narrower: https://homosaurus.org/v3/homoit0002432
narrower: https://homosaurus.org/v3/homoit0002435
narrower: https://homosaurus.org/v3/homoit0002440
related: https://homosaurus.org/v3/homoit0000151
related: https://homosaurus.org/v3/homoit0000493
related: https://homosaurus.org/v3/homoit0000742
related: https://homosaurus.org/v3/homoit0000827
related: https://homosaurus.org/v3/homoit0001177
related: https://homosaurus.org/v3/homoit0001414
related: https://homosaurus.org/v3/homoit0001749
related: https://homosaurus.org/v3/homoit0001753
related: https://homosaurus.org/v3/homoit0001754
related: https://homosaurus.org/v3/homoit0002535

Aromantic fiction
type: Concept
issued: 2021-11-09
modified: 2025-02-23
comment: Written works describing imagined events or people; use in reference to fictional works focusing on aromantic characters or themes.
alternative label: Aro fiction
broader: https://homosaurus.org/v3/homoit0000443
change note: Version 3.7.0
has top concept: Subcultures
in scheme: v3
narrower: https://homosaurus.org/v3/homoit0002418
narrower: https://homosaurus.org/v3/homoit0002427
narrower: https://homosaurus.org/v3/homoit0002431
narrower: https://homosaurus.org/v3/homoit0002434
narrower: https://homosaurus.org/v3/homoit0002439
related: https://homosaurus.org/v3/homoit0000151
related: https://homosaurus.org/v3/homoit0000493
related: https://homosaurus.org/v3/homoit0000742
related: https://homosaurus.org/v3/homoit0000827
related: https://homosaurus.org/v3/homoit0001177
related: https://homosaurus.org/v3/homoit0001414
related: https://homosaurus.org/v3/homoit0001748
related: https://homosaurus.org/v3/homoit0001752
related: https://homosaurus.org/v3/homoit0001754
related: https://homosaurus.org/v3/homoit0002145

Asexual fiction
type: Concept
issued: 2021-11-09
modified: 2025-02-23
comment: Written works describing imagined events or people; use in reference to fictional works focusing on asexual characters or themes.
alternative label: Ace fiction
broader: https://homosaurus.org/v3/homoit0000443
change note: Version 3.7.0
has top concept: Subcultures
in scheme: v3
narrower: https://homosaurus.org/v3/homoit0002417
narrower: https://homosaurus.org/v3/homoit0002429
narrower: https://homosaurus.org/v3/homoit0002433
narrower: https://homosaurus.org/v3/homoit0002437
related: https://homosaurus.org/v3/homoit0000139
related: https://homosaurus.org/v3/homoit0000151
related: https://homosaurus.org/v3/homoit0000157
related: https://homosaurus.org/v3/homoit0000493
related: https://homosaurus.org/v3/homoit0000742
related: https://homosaurus.org/v3/homoit0000827
related: https://homosaurus.org/v3/homoit0001177
related: https://homosaurus.org/v3/homoit0001414
related: https://homosaurus.org/v3/homoit0001747
related: https://homosaurus.org/v3/homoit0001752
related: https://homosaurus.org/v3/homoit0001753
related: https://homosaurus.org/v3/homoit0002146
related: https://homosaurus.org/v3/homoit0002150
related: https://homosaurus.org/v3/homoit0002467
related: https://homosaurus.org/v3/homoit0002535

Gender creative
type: Concept
issued: 2021-11-23
modified: 2025-02-23
comment: Term used to describe people, typically children, who do not conform to traditional gender norms and instead creatively interweave their internal and external experiences to understand their gender identity and expression. May also be used to describe a way of raising children outside of traditional gender norms.
broader: https://homosaurus.org/v3/homoit0000568
broader: https://homosaurus.org/v3/homoit0000571
change note: Version 3.7.0
has top concept: Gender
in scheme: v3
related: https://homosaurus.org/v3/homoit0000047
related: https://homosaurus.org/v3/homoit0000256
related: https://homosaurus.org/v3/homoit0000562
related: https://homosaurus.org/v3/homoit0000574
related: https://homosaurus.org/v3/homoit0000577
related: https://homosaurus.org/v3/homoit0001521
related: https://homosaurus.org/v3/homoit0001922
related: https://homosaurus.org/v3/homoit0002222

Aromantic families
type: Concept
issued: 2021-11-23
modified: 2025-02-23
comment: Families, whether biological, adoptive, or chosen, in which one or more individuals identify as aromantic.
alternative label: Aro families
broader: https://homosaurus.org/v3/homoit0000420
change note: Version 3.7.0
has top concept: LGBTQ+ families
in scheme: v3
related: https://homosaurus.org/v3/homoit0000067
related: https://homosaurus.org/v3/homoit0001761
related: https://homosaurus.org/v3/homoit0001765

Asexual families
type: Concept
issued: 2021-11-23
modified: 2025-02-23
comment: Families, whether biological, adoptive, or chosen, in which one or more individuals identify as asexual.
alternative label: Ace families
broader: https://homosaurus.org/v3/homoit0000420
change note: Version 3.7.0
has top concept: LGBTQ+ families
in scheme: v3
related: https://homosaurus.org/v3/homoit0000071
related: https://homosaurus.org/v3/homoit0001762
related: https://homosaurus.org/v3/homoit0001766

Intersex families
type: Concept
issued: 2021-11-23
modified: 2025-02-23
comment: Families, whether biological, adoptive, or chosen, in which one or more individuals are intersex.
broader: https://homosaurus.org/v3/homoit0000420
change note: Version 3.7.0
has top concept: LGBTQ+ families
in scheme: v3
related: https://homosaurus.org/v3/homoit0000618
related: https://homosaurus.org/v3/homoit0001763
related: https://homosaurus.org/v3/homoit0001767

Two-Spirit families
type: Concept
issued: 2021-11-23
modified: 2025-02-23
comment: Families, whether biological, adoptive, or chosen, in which one or more individuals identify as Two-Spirit.
alternative label: 2S families
alternative label: Two Spirit families
alternative label: Two Spirited families
alternative label: Two-Spirited families
broader: https://homosaurus.org/v3/homoit0001480
change note: Version 3.7.0
has top concept: Gender
in scheme: v3
related: https://homosaurus.org/v3/homoit0001768
related: https://homosaurus.org/v3/homoit0003242
related: https://homosaurus.org/v3/homoit0003243

Aromantic parents
type: Concept
issued: 2021-11-23
modified: 2025-02-23
comment: Parents who are aromantic.
alternative label: Aro parents
broader: https://homosaurus.org/v3/homoit0001075
change note: Version 3.7.0
has top concept: LGBTQ+ families
in scheme: v3
related: https://homosaurus.org/v3/homoit0000067
related: https://homosaurus.org/v3/homoit0001757
related: https://homosaurus.org/v3/homoit0001765

Asexual parents
type: Concept
issued: 2021-11-23
modified: 2025-02-23
comment: Parents who are asexual.
alternative label: Ace parents
broader: https://homosaurus.org/v3/homoit0001075
change note: Version 3.7.0
has top concept: LGBTQ+ families
in scheme: v3
narrower: https://homosaurus.org/v3/homoit0002795
related: https://homosaurus.org/v3/homoit0000071
related: https://homosaurus.org/v3/homoit0001758
related: https://homosaurus.org/v3/homoit0001766

Intersex parents
type: Concept
issued: 2021-11-23
modified: 2025-02-23
comment: Parents who are intersex.
broader: https://homosaurus.org/v3/homoit0001075
change note: Version 3.7.0
has top concept: LGBTQ+ families
in scheme: v3
narrower: https://homosaurus.org/v3/homoit0002916
related: https://homosaurus.org/v3/homoit0000618
related: https://homosaurus.org/v3/homoit0001759
related: https://homosaurus.org/v3/homoit0001767
related: https://homosaurus.org/v3/homoit0002741

Two-Spirit parents
type: Concept
issued: 2021-11-23
modified: 2025-02-23
comment: Two-Spirit people who are parents.
alternative label: 2S parents
alternative label: Two Spirit parents
alternative label: Two Spirited parents
alternative label: Two-Spirited parents
broader: https://homosaurus.org/v3/homoit0001480
broader: https://homosaurus.org/v3/homoit0002372
change note: Version 3.7.0
has top concept: Gender
in scheme: v3
narrower: https://homosaurus.org/v3/homoit0003242
narrower: https://homosaurus.org/v3/homoit0003243
related: https://homosaurus.org/v3/homoit0001768

Children of aromantic people
type: Concept
issued: 2021-11-23
modified: 2025-02-23
comment: Children who have one or more aromantic parent.
alternative label: Children of aro people
broader: https://homosaurus.org/v3/homoit0000260
change note: Version 3.7.0
has top concept: Family members
in scheme: v3
related: https://homosaurus.org/v3/homoit0000067
related: https://homosaurus.org/v3/homoit0001757
related: https://homosaurus.org/v3/homoit0001761

Children of asexual people
type: Concept
issued: 2021-11-23
modified: 2025-02-23
comment: Children who have one or more asexual parent.
alternative label: Children of ace people
broader: https://homosaurus.org/v3/homoit0000260
change note: Version 3.7.0
has top concept: Family members
in scheme: v3
narrower: https://homosaurus.org/v3/homoit0002914
related: https://homosaurus.org/v3/homoit0000071
related: https://homosaurus.org/v3/homoit0001758
related: https://homosaurus.org/v3/homoit0001762

Children of intersex people
type: Concept
issued: 2021-11-23
modified: 2025-02-23
comment: Children who have one or more intersex parent.
broader: https://homosaurus.org/v3/homoit0000260
change note: Version 3.7.0
has top concept: Family members
in scheme: v3
related: https://homosaurus.org/v3/homoit0000618
related: https://homosaurus.org/v3/homoit0001759
related: https://homosaurus.org/v3/homoit0001763
related: https://homosaurus.org/v3/homoit0002745

Children of Two-Spirit people
type: Concept
issued: 2021-11-23
modified: 2025-02-23
comment: Children who have one or more Two-Spirit parent.
alternative label: Children of 2S people
alternative label: Children of Two Spirit people
alternative label: Children of Two Spirited people
alternative label: Children of Two-Spirited people
broader: https://homosaurus.org/v3/homoit0000255
change note: Version 3.7.0
has top concept: Family members
in scheme: v3
related: https://homosaurus.org/v3/homoit0001760
related: https://homosaurus.org/v3/homoit0001764

Anti-Two-Spirit violence
type: Concept
issued: 2021-11-23
modified: 2025-02-23
comment: Behavior involving physical force intended to harm or kill Two-Spirit people on the basis of their identity.
alternative label: Anti-2S violence
alternative label: Anti-Two Spirit violence
alternative label: Anti-Two Spirited violence
alternative label: Anti-Two-Spirited violence
broader: https://homosaurus.org/v3/homoit0000059
change note: Version 3.7.0
has top concept: Anti-LGBTQ+ violence
in scheme: v3
related: https://homosaurus.org/v3/homoit0000109

Anti-intersex violence
type: Concept
issued: 2021-11-23
modified: 2025-02-23
comment: Behavior involving physical force intended to harm or kill intersex people because they are intersex.
broader: https://homosaurus.org/v3/homoit0000059
change note: Version 3.7.0
has top concept: Anti-LGBTQ+ violence
in scheme: v3
related: https://homosaurus.org/v3/homoit0000109
related: https://homosaurus.org/v3/homoit0000666

LGBTQ+ chefs
type: Concept
issued: 2021-12-07
modified: 2025-02-23
comment: LGBTQ+ people who are trained, professional cooks, typically holding a leadership role in the kitchen in which they are employed.
alternative label: Chefs (LGBTQ)
broader: https://homosaurus.org/v3/homoit0000915
change note: Version 3.7.0
has top concept: LGBTQ+ people
in scheme: v3
narrower: https://homosaurus.org/v3/homoit0001772
narrower: https://homosaurus.org/v3/homoit0001773
narrower: https://homosaurus.org/v3/homoit0001774
narrower: https://homosaurus.org/v3/homoit0001775
narrower: https://homosaurus.org/v3/homoit0001776
narrower: https://homosaurus.org/v3/homoit0001777
narrower: https://homosaurus.org/v3/homoit0002771
related: https://homosaurus.org/v3/homoit0001717
related: https://homosaurus.org/v3/homoit0001778

Lesbian chefs
type: Concept
issued: 2021-12-07
modified: 2025-02-23
comment: Lesbians who are trained, professional cooks, typically holding a leadership role in the kitchen in which they are employed.
broader: https://homosaurus.org/v3/homoit0001771
change note: Version 3.7.0
has top concept: LGBTQ+ people
in scheme: v3
related: https://homosaurus.org/v3/homoit0001718
related: https://homosaurus.org/v3/homoit0001773
related: https://homosaurus.org/v3/homoit0001774
related: https://homosaurus.org/v3/homoit0001775
related: https://homosaurus.org/v3/homoit0001776
related: https://homosaurus.org/v3/homoit0001777
related: https://homosaurus.org/v3/homoit0002771

Gay chefs
type: Concept
issued: 2021-12-07
modified: 2025-02-23
comment: Gay men who are trained, professional cooks, typically holding a leadership role in the kitchen in which they are employed.
broader: https://homosaurus.org/v3/homoit0001771
change note: Version 3.7.0
has top concept: LGBTQ+ people
in scheme: v3
related: https://homosaurus.org/v3/homoit0001719
related: https://homosaurus.org/v3/homoit0001772
related: https://homosaurus.org/v3/homoit0001774
related: https://homosaurus.org/v3/homoit0001775
related: https://homosaurus.org/v3/homoit0001776
related: https://homosaurus.org/v3/homoit0001777
related: https://homosaurus.org/v3/homoit0002771

Bisexual chefs
type: Concept
issued: 2021-12-07
modified: 2025-02-23
comment: Bisexual people who are trained, professional cooks, typically holding a leadership role in the kitchens in which they are employed.
broader: https://homosaurus.org/v3/homoit0001771
change note: Version 3.7.0
has top concept: LGBTQ+ people
in scheme: v3
related: https://homosaurus.org/v3/homoit0001720
related: https://homosaurus.org/v3/homoit0001772
related: https://homosaurus.org/v3/homoit0001773
related: https://homosaurus.org/v3/homoit0001775
related: https://homosaurus.org/v3/homoit0001776
related: https://homosaurus.org/v3/homoit0001777
related: https://homosaurus.org/v3/homoit0002771

Transgender chefs
type: Concept
issued: 2021-12-07
modified: 2025-02-23
comment: Transgender people who are trained, professional cooks, typically holding a leadership role in the kitchen in which they are employed.
broader: https://homosaurus.org/v3/homoit0001771
change note: Version 3.7.0
has top concept: LGBTQ+ people
in scheme: v3
related: https://homosaurus.org/v3/homoit0001721
related: https://homosaurus.org/v3/homoit0001772
related: https://homosaurus.org/v3/homoit0001773
related: https://homosaurus.org/v3/homoit0001774
related: https://homosaurus.org/v3/homoit0001776
related: https://homosaurus.org/v3/homoit0001777
related: https://homosaurus.org/v3/homoit0002771

Queer chefs
type: Concept
issued: 2021-12-07
modified: 2025-02-23
comment: Queer people who are trained, professional cooks, typically holding a leadership role in the kitchen in which they are employed.
broader: https://homosaurus.org/v3/homoit0001771
change note: Version 3.7.0
has top concept: LGBTQ+ people
in scheme: v3
related: https://homosaurus.org/v3/homoit0001722
related: https://homosaurus.org/v3/homoit0001772
related: https://homosaurus.org/v3/homoit0001773
related: https://homosaurus.org/v3/homoit0001774
related: https://homosaurus.org/v3/homoit0001775
related: https://homosaurus.org/v3/homoit0001777
related: https://homosaurus.org/v3/homoit0002771

Intersex chefs
type: Concept
issued: 2021-12-07
modified: 2025-02-23
comment: Intersex people who are trained, professional cooks, typically holding a leadership role in the kitchen in which they are employed.
broader: https://homosaurus.org/v3/homoit0001771
change note: Version 3.7.0
has top concept: LGBTQ+ people
in scheme: v3
related: https://homosaurus.org/v3/homoit0001772
related: https://homosaurus.org/v3/homoit0001773
related: https://homosaurus.org/v3/homoit0001774
related: https://homosaurus.org/v3/homoit0001775
related: https://homosaurus.org/v3/homoit0001776
related: https://homosaurus.org/v3/homoit0002771

Two-Spirit chefs
type: Concept
issued: 2021-12-07
modified: 2025-02-23
comment: Two-Spirit people who are trained, professional cooks, typically holding a leadership role in the kitchen in which they are employed.
alternative label: 2S chefs
alternative label: Two Spirit chefs
alternative label: Two Spirited chefs
alternative label: Two-Spirited chefs
broader: https://homosaurus.org/v3/homoit0001480
change note: Version 3.7.0
has top concept: Gender
in scheme: v3
related: https://homosaurus.org/v3/homoit0001771

Vers (Sex)
type: Concept
issued: 2021-12-07
modified: 2025-02-23
comment: Slang term for individuals who alternate between being the giving partner and the receiving partner in sexual encounters; typically used as an adjective (e.g., "They're vers.").
alternative label: Vers
alternative label: Versatile
broader: https://homosaurus.org/v3/homoit0001295
broader: https://homosaurus.org/v3/homoit0001304
change note: Version 3.7.0
has top concept: Sexual identity
in scheme: v3
related: https://homosaurus.org/v3/homoit0000219
related: https://homosaurus.org/v3/homoit0001353
related: https://homosaurus.org/v3/homoit0001376

Blaqueer people
type: Concept
issued: 2021-12-07
modified: 2025-02-23
comment: Black queer people who recognize their queer identity as salient to their Blackness and vice versa; only use to describe individuals who identify as Blaqueer or BlaQ.
alternative label: BlaQ people
broader: https://homosaurus.org/v3/homoit0000208
change note: Version 3.7.0
has top concept: LGBTQ+ people
in scheme: v3

Closeted LGBTQ+ people
type: Concept
issued: 2021-12-08
modified: 2025-02-23
comment: LGBTQ+ people who do not identify as such to others.
alternative label: Closeted people (LGBTQ)
broader: https://homosaurus.org/v3/homoit0000915
change note: Version 3.7.0
has top concept: LGBTQ+ people
in scheme: v3
narrower: https://homosaurus.org/v3/homoit0000285
narrower: https://homosaurus.org/v3/homoit0000286
narrower: https://homosaurus.org/v3/homoit0000287
narrower: https://homosaurus.org/v3/homoit0001784
narrower: https://homosaurus.org/v3/homoit0001785
narrower: https://homosaurus.org/v3/homoit0001786
narrower: https://homosaurus.org/v3/homoit0002905
narrower: https://homosaurus.org/v3/homoit0003403
related: https://homosaurus.org/v3/homoit0000288
related: https://homosaurus.org/v3/homoit0000295
related: https://homosaurus.org/v3/homoit0000365
related: https://homosaurus.org/v3/homoit0001065
related: https://homosaurus.org/v3/homoit0001261
related: https://homosaurus.org/v3/homoit0001787
related: https://homosaurus.org/v3/homoit0001788

Closeted transgender people
type: Concept
issued: 2021-12-08
modified: 2025-02-23
comment: Transgender people who do not identify as such to others.
alternative label: Closeted trans people
broader: https://homosaurus.org/v3/homoit0001378
broader: https://homosaurus.org/v3/homoit0001783
change note: Version 3.7.0
has top concept: LGBTQ+ people
in scheme: v3
related: https://homosaurus.org/v3/homoit0000285
related: https://homosaurus.org/v3/homoit0000286
related: https://homosaurus.org/v3/homoit0000287
related: https://homosaurus.org/v3/homoit0000288
related: https://homosaurus.org/v3/homoit0000295
related: https://homosaurus.org/v3/homoit0001065
related: https://homosaurus.org/v3/homoit0001261
related: https://homosaurus.org/v3/homoit0001785
related: https://homosaurus.org/v3/homoit0002905

Closeted queer people
type: Concept
issued: 2021-12-08
modified: 2025-02-23
comment: Queer people who do not identify as such to others.
broader: https://homosaurus.org/v3/homoit0001195
broader: https://homosaurus.org/v3/homoit0001783
change note: Version 3.7.0
has top concept: LGBTQ+ people
in scheme: v3
related: https://homosaurus.org/v3/homoit0000285
related: https://homosaurus.org/v3/homoit0000286
related: https://homosaurus.org/v3/homoit0000287
related: https://homosaurus.org/v3/homoit0000288
related: https://homosaurus.org/v3/homoit0000295
related: https://homosaurus.org/v3/homoit0000365
related: https://homosaurus.org/v3/homoit0001065
related: https://homosaurus.org/v3/homoit0001261
related: https://homosaurus.org/v3/homoit0001784
related: https://homosaurus.org/v3/homoit0002905

Closeted intersex people
type: Concept
issued: 2021-12-08
modified: 2025-02-23
comment: Intersex people who do not disclose the fact that they are intersex to others.
broader: https://homosaurus.org/v3/homoit0001783
change note: Version 3.7.0
has top concept: LGBTQ+ people
in scheme: v3
related: https://homosaurus.org/v3/homoit0000288
related: https://homosaurus.org/v3/homoit0000295
related: https://homosaurus.org/v3/homoit0000365
related: https://homosaurus.org/v3/homoit0001065
related: https://homosaurus.org/v3/homoit0001261
related: https://homosaurus.org/v3/homoit0002905

Closeted Two-Spirit people
type: Concept
issued: 2021-12-08
modified: 2025-02-23
comment: Two-Spirit people who do not identify as such to others.
alternative label: Closeted 2S people
alternative label: Closeted Two Spirit people
alternative label: Closeted Two Spirited people
alternative label: Closeted Two-Spirited people
broader: https://homosaurus.org/v3/homoit0001480
change note: Version 3.7.0
has top concept: Gender
in scheme: v3
related: https://homosaurus.org/v3/homoit0000288
related: https://homosaurus.org/v3/homoit0000295
related: https://homosaurus.org/v3/homoit0000365
related: https://homosaurus.org/v3/homoit0001065
related: https://homosaurus.org/v3/homoit0001261
related: https://homosaurus.org/v3/homoit0001783

Beards (Gay culture)
type: Concept
issued: 2021-12-08
modified: 2025-02-23
comment: Individuals who pose as the date or partner of someone they are not in a relationship with, typically to prevent that person's sexuality from becoming public knowledge; most commonly used to refer to a woman pretending to be dating a gay man.
alternative label: Beards
broader: https://homosaurus.org/v3/homoit0000487
change note: Version 3.7.0
has top concept: Subcultures
in scheme: v3
related: https://homosaurus.org/v3/homoit0000365
related: https://homosaurus.org/v3/homoit0000381
related: https://homosaurus.org/v3/homoit0000416
related: https://homosaurus.org/v3/homoit0000598
related: https://homosaurus.org/v3/homoit0001261
related: https://homosaurus.org/v3/homoit0001783

Packers (Phallus)
type: Concept
issued: 2021-12-14
modified: 2025-02-23
comment: Padding or phallic objects designed to be worn in the front of an individual's pants or underwear to give the appearance of having a bulge.
broader: https://homosaurus.org/v3/homoit0000568
change note: Version 3.7.0
has top concept: Gender
in scheme: v3
related: https://homosaurus.org/v3/homoit0001067
related: https://homosaurus.org/v3/homoit0001099

Alloromanticism
type: Concept
issued: 2021-12-14
modified: 2025-02-23
comment: A romantic orientation characterized by the occurrence of romantic attraction or desire in a frequent and consistent manner, often alongside sexual attraction.
broader: https://homosaurus.org/v3/homoit0001828
change note: Version 3.7.0
has top concept: Romantic orientation
in scheme: v3
narrower: https://homosaurus.org/v3/homoit0001792
narrower: https://homosaurus.org/v3/homoit0001793
narrower: https://homosaurus.org/v3/homoit0001794
narrower: https://homosaurus.org/v3/homoit0001795
related: https://homosaurus.org/v3/homoit0001644
related: https://homosaurus.org/v3/homoit0001823

Biromanticism
type: Concept
issued: 2021-12-14
modified: 2025-02-23
comment: A romantic orientation characterized by the occurrence of romantic attraction or desire in a frequent and consistent manner toward more than one sex or gender.
broader: https://homosaurus.org/v3/homoit0001791
broader: https://homosaurus.org/v3/homoit0001828
change note: Version 3.7.0
has top concept: Romantic orientation
in scheme: v3
related: https://homosaurus.org/v3/homoit0001824

Homoromanticism
type: Concept
issued: 2021-12-14
modified: 2025-02-23
comment: A romantic orientation characterized by the occurrence of romantic attraction or desire in a frequent and consistent manner toward members of the same sex or gender.
broader: https://homosaurus.org/v3/homoit0001791
broader: https://homosaurus.org/v3/homoit0001828
change note: Version 3.7.0
has top concept: Romantic orientation
in scheme: v3
related: https://homosaurus.org/v3/homoit0001825

Heteroromanticism
type: Concept
issued: 2021-12-14
modified: 2025-02-23
comment: A romantic orientation characterized by the occurrence of romantic attraction or romantic desire in a frequent and consistent manner toward members of the opposite sex or gender.
broader: https://homosaurus.org/v3/homoit0001791
broader: https://homosaurus.org/v3/homoit0001828
change note: Version 3.7.0
has top concept: Romantic orientation
in scheme: v3
related: https://homosaurus.org/v3/homoit0001826

Panromanticism
type: Concept
issued: 2021-12-14
modified: 2025-02-23
comment: A romantic orientation characterized by the occurrence of romantic attraction or romantic desire in a frequent and consistent manner irrespective of sex or gender.
broader: https://homosaurus.org/v3/homoit0001791
broader: https://homosaurus.org/v3/homoit0001828
change note: Version 3.7.0
has top concept: Romantic orientation
in scheme: v3
related: https://homosaurus.org/v3/homoit0001827

Biracial lesbians
type: Concept
issued: 2022-01-18
modified: 2025-02-23
comment: Lesbians who belong to two or more racial groups. Only use to describe people who self-identify as biracial.
alternative label: Bi-racial lesbians
broader: https://homosaurus.org/v3/homoit0000820
change note: Version 3.7.0
has top concept: LGBTQ+ people
in scheme: v3

Biracial gay men
type: Concept
issued: 2022-01-18
modified: 2025-02-23
comment: Gay men who belong to two or more racial groups. Only use to describe people who self-identify as biracial.
alternative label: Bi-racial gay men
alternative label: Gay bi-racial men
alternative label: Gay biracial men
broader: https://homosaurus.org/v3/homoit0000820
change note: Version 3.7.0
has top concept: LGBTQ+ people
in scheme: v3

Biracial bisexual people
type: Concept
issued: 2022-01-18
modified: 2025-02-23
comment: Bisexual people who belong to two or more racial groups. Only use to describe people who self-identify as biracial.
alternative label: Bi-racial bisexual people
alternative label: Bisexual bi-racial people
alternative label: Bisexual biracial people
broader: https://homosaurus.org/v3/homoit0000820
change note: Version 3.7.0
has top concept: LGBTQ+ people
in scheme: v3

Biracial transgender people
type: Concept
issued: 2022-01-18
modified: 2025-02-23
comment: Transgender people who belong to two or more racial groups. Only use to describe people who self-identify as biracial.
alternative label: Bi-racial transgender people
alternative label: Transgender bi-racial people
alternative label: Transgender biracial people
broader: https://homosaurus.org/v3/homoit0000820
change note: Version 3.7.0
has top concept: LGBTQ+ people
in scheme: v3

Biracial queer people
type: Concept
issued: 2022-01-18
modified: 2025-02-23
comment: Queer people who belong to two or more racial groups. Only use to describe people who self-identify as biracial.
alternative label: Bi-racial queer people
alternative label: Queer bi-racial people
alternative label: Queer biracial people
broader: https://homosaurus.org/v3/homoit0000820
change note: Version 3.7.0
has top concept: LGBTQ+ people
in scheme: v3

Multiracial lesbians
type: Concept
issued: 2022-01-18
modified: 2025-02-23
comment: Lesbians who belong to two or more racial groups.
alternative label: Multi-racial lesbians
broader: https://homosaurus.org/v3/homoit0000903
change note: Version 3.7.0
has top concept: LGBTQ+ people
in scheme: v3
related: https://homosaurus.org/v3/homoit0001802
related: https://homosaurus.org/v3/homoit0001803
related: https://homosaurus.org/v3/homoit0001804
related: https://homosaurus.org/v3/homoit0001805

Multiracial gay men
type: Concept
issued: 2022-01-18
modified: 2025-02-23
comment: Gay men who belong to two or more racial groups.
alternative label: Gay multi-racial men
alternative label: Gay multiracial men
alternative label: Multi-racial gay men
broader: https://homosaurus.org/v3/homoit0000903
change note: Version 3.7.0
has top concept: LGBTQ+ people
in scheme: v3
related: https://homosaurus.org/v3/homoit0001801
related: https://homosaurus.org/v3/homoit0001803
related: https://homosaurus.org/v3/homoit0001804
related: https://homosaurus.org/v3/homoit0001805

Multiracial bisexual people
type: Concept
issued: 2022-01-18
modified: 2025-02-23
comment: Bisexual people who belong to two or more racial groups.
alternative label: Bisexual multi-racial people
alternative label: Bisexual multiracial people
alternative label: Multi-racial bisexual people
broader: https://homosaurus.org/v3/homoit0000903
change note: Version 3.7.0
has top concept: LGBTQ+ people
in scheme: v3
related: https://homosaurus.org/v3/homoit0001801
related: https://homosaurus.org/v3/homoit0001802
related: https://homosaurus.org/v3/homoit0001804
related: https://homosaurus.org/v3/homoit0001805

Multiracial transgender people
type: Concept
issued: 2022-01-18
modified: 2025-02-23
comment: Transgender people who belong to two or more racial groups.
alternative label: Multi-racial transgender people
alternative label: Transgender multi-racial people
alternative label: Transgender multiracial people
broader: https://homosaurus.org/v3/homoit0000903
change note: Version 3.7.0
has top concept: LGBTQ+ people
in scheme: v3
related: https://homosaurus.org/v3/homoit0001801
related: https://homosaurus.org/v3/homoit0001802
related: https://homosaurus.org/v3/homoit0001803
related: https://homosaurus.org/v3/homoit0001805

Multiracial queer people
type: Concept
issued: 2022-01-18
modified: 2025-02-23
comment: Queer people who belong to two or more racial groups.
alternative label: Multi-racial queer people
alternative label: Queer multi-racial people
alternative label: Queer multiracial people
broader: https://homosaurus.org/v3/homoit0000903
change note: Version 3.7.0
has top concept: LGBTQ+ people
in scheme: v3
related: https://homosaurus.org/v3/homoit0001801
related: https://homosaurus.org/v3/homoit0001802
related: https://homosaurus.org/v3/homoit0001803
related: https://homosaurus.org/v3/homoit0001804

Homoeroticism
type: Concept
issued: 2022-01-18
modified: 2025-02-23
comment: Sexual attraction or erotic desire between members of the same sex or gender; typically used to describe temporary, latent, or unfulfilled desire rather than a more permanent sexual identity or orientation.
alternative label: Homoerotic
broader: https://homosaurus.org/v3/homoit0000404
change note: Version 3.7.0
has top concept: Eroticism
in scheme: v3
related: https://homosaurus.org/v3/homoit0001112
related: https://homosaurus.org/v3/homoit0001284
related: https://homosaurus.org/v3/homoit0001306
related: https://homosaurus.org/v3/homoit0002142
related: https://homosaurus.org/v3/homoit0002147
related: https://homosaurus.org/v3/homoit0002177

Content warnings
type: Concept
issued: 2022-01-18
modified: 2025-02-23
comment: Statements used to caution individuals that materials may be disturbing or offensive. Includes warnings assigned to fanworks (usually by the creator) that give information about possibly upsetting, triggering, or controversial elements within a work.
alternative label: Trigger warnings
broader: https://homosaurus.org/v3/homoit0002161
change note: Version 3.7.0
has top concept: Subcultures
in scheme: v3
narrower: https://homosaurus.org/v3/homoit0002195
narrower: https://homosaurus.org/v3/homoit0002215

Costumes
type: Concept
issued: 2022-01-18
modified: 2025-02-23
comment: Sets of clothing worn to emulate a particular person, place, thing, or time period.
broader: https://homosaurus.org/v3/homoit0000289
change note: Version 3.7.0
has top concept: Gender
in scheme: v3
related: https://homosaurus.org/v3/homoit0000367
related: https://homosaurus.org/v3/homoit0000607
related: https://homosaurus.org/v3/homoit0002169

Indigiqueer people
type: Concept
issued: 2022-01-19
modified: 2025-02-23
comment: Indigenous queer people who recognize their queer identity as salient to their Indigenous identity and vice versa; some but not all Indigiqueer people also identify as Two-Spirit; only use to describe individuals who self-identify as Indigiqueer.
broader: https://homosaurus.org/v3/homoit0000886
broader: https://homosaurus.org/v3/homoit0001195
change note: Version 3.7.0
has top concept: LGBTQ+ people
in scheme: v3
related: https://homosaurus.org/v3/homoit0000002
related: https://homosaurus.org/v3/homoit0000676
related: https://homosaurus.org/v3/homoit0000913
related: https://homosaurus.org/v3/homoit0001037
related: https://homosaurus.org/v3/homoit0001480
related: https://homosaurus.org/v3/homoit0001810

Indigiqueer
type: Concept
issued: 2022-01-19
modified: 2025-02-23
comment: Term used to describe the identity of people who are both Indigenous and queer and view those identities as inherently related and interconnected.
broader: https://homosaurus.org/v3/homoit0000322
change note: Version 3.7.0
has top concept: Gender
in scheme: v3
related: https://homosaurus.org/v3/homoit0000002
related: https://homosaurus.org/v3/homoit0000676
related: https://homosaurus.org/v3/homoit0000898
related: https://homosaurus.org/v3/homoit0000913
related: https://homosaurus.org/v3/homoit0001037
related: https://homosaurus.org/v3/homoit0001480
related: https://homosaurus.org/v3/homoit0001809

Pacific Islander American LGBTQ+ people
type: Concept
issued: 2022-01-24
modified: 2025-02-23
comment: LGBTQ+ people who identify as both Pacific Islanders (or of Pacific Islander ancestry) and American.
alternative label: AAPI LGBTQ+ people
alternative label: LGBTQ+ AAPIs
alternative label: LGBTQ+ Pacific Islander American people
alternative label: LGBTQ+ Pacific Islander Americans
alternative label: Pacific Islander American people (LGBTQ)
alternative label: Pacific Islander Americans (LGBTQ)
broader: https://homosaurus.org/v3/homoit0000860
broader: https://homosaurus.org/v3/homoit0001101
broader: https://homosaurus.org/v3/homoit0000886
change note: Version 3.7.0
has top concept: LGBTQ+ people
in scheme: v3
narrower: https://homosaurus.org/v3/homoit0001937
narrower: https://homosaurus.org/v3/homoit0001938
narrower: https://homosaurus.org/v3/homoit0001939
narrower: https://homosaurus.org/v3/homoit0001940
narrower: https://homosaurus.org/v3/homoit0001941
narrower: https://homosaurus.org/v3/homoit0001942
narrower: https://homosaurus.org/v3/homoit0002926
narrower: https://homosaurus.org/v3/homoit0003423

LGBTQ+ special collections
type: Concept
issued: 2022-01-24
modified: 2025-02-23
comment: Special collections that hold materials primarily pertaining to LGBTQ+ people or intended for use by LGBTQ+ people. Special collections tend to be a blend of institutional types (e.g., an archives with a museum component). This term should be applied to institutions that refer to themselves as special collections; otherwise, use the term "LGBTQ+ cultural heritage institutions."
alternative label: Hidden collections (LGBTQ)
alternative label: LGBTQ+ hidden collections
alternative label: Special collections (LGBTQ)
broader: https://homosaurus.org/v3/homoit0001755
change note: Version 3.7.0
has top concept: LGBTQ+ cultural heritage institutions
in scheme: v3
related: https://homosaurus.org/v3/homoit0000968
related: https://homosaurus.org/v3/homoit0001030
related: https://homosaurus.org/v3/homoit0001363
related: https://homosaurus.org/v3/homoit0003547

Chasers
type: Concept
issued: 2022-01-24
modified: 2025-02-23
comment: Individuals who express fetishistic interest in and pursue sexual encounters with others based solely on their affiliation with a (typically marginalized) group that the chaser does not belong to. Often coupled with other terms to identify the type of chaser.
broader: https://homosaurus.org/v3/homoit0000442
broader: https://homosaurus.org/v3/homoit0001300
change note: Version 3.7.0
has top concept: Eroticism
in scheme: v3

LGBTQ+ immigrants
type: Concept
issued: 2022-01-24
modified: 2025-02-23
comment: LGBTQ+ people who have moved to another country.
alternative label: Immigrants (LGBTQ)
broader: https://homosaurus.org/v3/homoit0000915
change note: Version 3.7.0
has top concept: LGBTQ+ people
in scheme: v3
related: https://homosaurus.org/v3/homoit0000883
related: https://homosaurus.org/v3/homoit0000902
related: https://homosaurus.org/v3/homoit0000927
related: https://homosaurus.org/v3/homoit0001053
related: https://homosaurus.org/v3/homoit0001092
related: https://homosaurus.org/v3/homoit0001482
related: https://homosaurus.org/v3/homoit0001853

Gender transgression
type: Concept
issued: 2022-02-14
modified: 2025-02-23
comment: Behaviors, acts, or forms of expression that contradict or do not conform to a given culture's norms surrounding gender.
broader: https://homosaurus.org/v3/homoit0000568
change note: Version 3.7.0
has top concept: Gender
in scheme: v3
related: https://homosaurus.org/v3/homoit0000560
related: https://homosaurus.org/v3/homoit0000562
related: https://homosaurus.org/v3/homoit0000577
related: https://homosaurus.org/v3/homoit0000581
related: https://homosaurus.org/v3/homoit0001817
related: https://homosaurus.org/v3/homoit0003066

Trans inclusivity
type: Concept
issued: 2022-02-14
modified: 2025-02-23
comment: The practice or policy of providing equal access and support to trans people.
alternative label: Trans affirming
alternative label: Trans inclusion
alternative label: Trans inclusive
alternative label: Trans supportive
alternative label: Trans-inclusive
broader: https://homosaurus.org/v3/homoit0002291
change note: Version 3.7.0
has top concept: Inclusivity
in scheme: v3
related: https://homosaurus.org/v3/homoit0001378

Trans exclusivity
type: Concept
issued: 2022-02-14
modified: 2025-02-23
comment: The practice or policy of denying equal access and support to trans people.
alternative label: Trans exclusion
alternative label: Trans exclusive
alternative label: Trans-exclusive
broader: https://homosaurus.org/v3/homoit0000062
broader: https://homosaurus.org/v3/homoit0002291
change note: Version 3.7.0
has top concept: LGBTQ+ discrimination
in scheme: v3
related: https://homosaurus.org/v3/homoit0001139
related: https://homosaurus.org/v3/homoit0001467
related: https://homosaurus.org/v3/homoit0001516
related: https://homosaurus.org/v3/homoit0003499
related: https://homosaurus.org/v3/homoit0003737

Transmasculinity
type: Concept
issued: 2022-02-14
modified: 2025-02-23
comment: Masculine-aligned identities or practices of trans people.
broader: https://homosaurus.org/v3/homoit0000568
broader: https://homosaurus.org/v3/homoit0000995
change note: Version 3.7.0
has top concept: Gender
in scheme: v3
related: https://homosaurus.org/v3/homoit0001466
related: https://homosaurus.org/v3/homoit0001643
related: https://homosaurus.org/v3/homoit0001653

Transfemininity
type: Concept
issued: 2022-02-14
modified: 2025-02-23
comment: Feminine-aligned identities or practices of trans people.
broader: https://homosaurus.org/v3/homoit0000389
broader: https://homosaurus.org/v3/homoit0000568
change note: Version 3.7.0
has top concept: Gender
in scheme: v3
related: https://homosaurus.org/v3/homoit0001382
related: https://homosaurus.org/v3/homoit0001642
related: https://homosaurus.org/v3/homoit0001652

Hermaphrodites
type: Concept
issued: 2022-02-14
modified: 2025-02-23
comment: A term originating from Greek mythology that refers to beings that are both fully female and fully male. The term was once adopted in the medical realm to describe people with intersex variations generally (and later to describe someone with both ovarian and testicular tissue specifically), but it is now recognized to be stigmatizing, imprecise, and misleading. Many people in the intersex community consider the use of this term to be pathologizing and deeply offensive, while other intersex people have chosen to reclaim the term to describe themselves and their bodies. Do not use this term to describe an individual unless they explicitly identify with it and have chosen to use it.
broader: https://homosaurus.org/v3/homoit0000878
change note: Version 3.7.0
has top concept: LGBTQ+ historical terms
in scheme: v3
related: https://homosaurus.org/v3/homoit0000352
related: https://homosaurus.org/v3/homoit0000618

Biromantic people
type: Concept
issued: 2022-02-14
modified: 2025-02-23
comment: Individuals who experience romantic attraction or desire in a frequent and consistent manner toward people of more than one sex or gender.
broader: https://homosaurus.org/v3/homoit0001823
broader: https://homosaurus.org/v3/homoit0001829
change note: Version 3.7.0
has top concept: Alloromantic people
in scheme: v3
related: https://homosaurus.org/v3/homoit0000067
related: https://homosaurus.org/v3/homoit0001792
related: https://homosaurus.org/v3/homoit0001825
related: https://homosaurus.org/v3/homoit0001826
related: https://homosaurus.org/v3/homoit0001827

Homoromantic people
type: Concept
issued: 2022-02-14
modified: 2025-02-23
comment: Individuals who experience romantic attraction or desire in a frequent and consistent manner toward members of the same sex or gender.
broader: https://homosaurus.org/v3/homoit0001823
broader: https://homosaurus.org/v3/homoit0001829
change note: Version 3.7.0
has top concept: Alloromantic people
in scheme: v3
related: https://homosaurus.org/v3/homoit0000067
related: https://homosaurus.org/v3/homoit0001793
related: https://homosaurus.org/v3/homoit0001824
related: https://homosaurus.org/v3/homoit0001826
related: https://homosaurus.org/v3/homoit0001827

Heteroromantic people
type: Concept
issued: 2022-02-14
modified: 2025-02-23
comment: Individuals who experience romantic attraction or romantic desire in a frequent and consistent manner toward members of the opposite sex or gender.
broader: https://homosaurus.org/v3/homoit0001823
change note: Version 3.7.0
has top concept: Alloromantic people
in scheme: v3
related: https://homosaurus.org/v3/homoit0000067
related: https://homosaurus.org/v3/homoit0001794
related: https://homosaurus.org/v3/homoit0001824
related: https://homosaurus.org/v3/homoit0001825
related: https://homosaurus.org/v3/homoit0001827

Panromantic people
type: Concept
issued: 2022-02-14
modified: 2025-02-23
comment: Individuals who experience romantic attraction or romantic desire toward others in a frequent and consistent manner irrespective of sex or gender.
broader: https://homosaurus.org/v3/homoit0001823
broader: https://homosaurus.org/v3/homoit0001829
change note: Version 3.7.0
has top concept: Alloromantic people
in scheme: v3
related: https://homosaurus.org/v3/homoit0000067
related: https://homosaurus.org/v3/homoit0001795
related: https://homosaurus.org/v3/homoit0001824
related: https://homosaurus.org/v3/homoit0001825
related: https://homosaurus.org/v3/homoit0001826

LGBTQ+ culture
type: Concept
issued: 2022-02-14
modified: 2025-02-23
comment: Cultural experiences shared by members of LGBTQ+ communities or products of LGBTQ+ culture (e.g., art and media created by and for LGBTQ+ culture, activism focused on LGBTQ+ issues, slang commonly used in LGBTQ+ communities, etc.). Use a more specific term if possible.
broader: https://homosaurus.org/v3/homoit0001345
change note: Version 3.7.0
has top concept: Subcultures
in scheme: v3
narrower: https://homosaurus.org/v3/homoit0000382
narrower: https://homosaurus.org/v3/homoit0000487
narrower: https://homosaurus.org/v3/homoit0000816
narrower: https://homosaurus.org/v3/homoit0000972
narrower: https://homosaurus.org/v3/homoit0001406
narrower: https://homosaurus.org/v3/homoit0001832
narrower: https://homosaurus.org/v3/homoit0001833
narrower: https://homosaurus.org/v3/homoit0002788
narrower: https://homosaurus.org/v3/homoit0002970
related: https://homosaurus.org/v3/homoit0001755
related: https://homosaurus.org/v3/homoit0003698

Queer culture
type: Concept
issued: 2022-02-14
modified: 2025-02-23
comment: Cultural experiences shared by members of queer communities or products of queer culture (e.g., art and media created by and for queer people, activism focused on queer issues, slang commonly used in queer communities, etc.).
broader: https://homosaurus.org/v3/homoit0001831
change note: Version 3.7.0
has top concept: Subcultures
in scheme: v3
narrower: https://homosaurus.org/v3/homoit0002588
related: https://homosaurus.org/v3/homoit0000382
related: https://homosaurus.org/v3/homoit0000487
related: https://homosaurus.org/v3/homoit0001406
related: https://homosaurus.org/v3/homoit0001833

Bisexual culture
type: Concept
issued: 2022-02-14
modified: 2025-02-23
comment: Use to describe cultural experiences shared by members of bisexual communities or products of bisexual culture (e.g., art and media created by and for bisexual people, activism focused on bisexual issues, slang commonly used in bisexual communities, etc.).
broader: https://homosaurus.org/v3/homoit0001831
change note: Version 3.7.0
has top concept: Subcultures
in scheme: v3
related: https://homosaurus.org/v3/homoit0000382
related: https://homosaurus.org/v3/homoit0000487
related: https://homosaurus.org/v3/homoit0001406
related: https://homosaurus.org/v3/homoit0001832

Detransitioning
type: Concept
issued: 2022-02-14
modified: 2025-02-23
comment: Ceasing or reversing the process of gender transition for any reason, including personal safety, stigma, costs associated with transitioning, health concerns, to regain fertility, etc.
alternative label: Detransition
broader: https://homosaurus.org/v3/homoit0001465
change note: Version 3.7.0
has top concept: Transitioning (Gender)
in scheme: v3
related: https://homosaurus.org/v3/homoit0001464
related: https://homosaurus.org/v3/homoit0001835
related: https://homosaurus.org/v3/homoit0001836

Retransitioning
type: Concept
issued: 2022-02-14
modified: 2025-02-23
comment: Restarting the process of gender transition after a period of detransitioning.
alternative label: Retransition
broader: https://homosaurus.org/v3/homoit0001465
change note: Version 3.7.0
has top concept: Transitioning (Gender)
in scheme: v3
related: https://homosaurus.org/v3/homoit0001464
related: https://homosaurus.org/v3/homoit0001834
related: https://homosaurus.org/v3/homoit0001836

Desistance (Gender)
type: Concept
issued: 2022-02-14
modified: 2025-02-23
comment: No longer identifying as transgender, or, more broadly, no longer identifying as some particular gender.
broader: https://homosaurus.org/v3/homoit0001465
change note: Version 3.7.0
has top concept: Transitioning (Gender)
in scheme: v3
related: https://homosaurus.org/v3/homoit0001464
related: https://homosaurus.org/v3/homoit0001834
related: https://homosaurus.org/v3/homoit0001835

Facial gender affirming surgery
type: Concept
issued: 2022-02-14
modified: 2025-02-23
comment: Any of various surgeries that involve modifying the face or facial features to affirm the patient's gender.
alternative label: Facial gender affirmation surgery
alternative label: Facial gender confirmation surgery
alternative label: Facial gender confirming surgery
broader: https://homosaurus.org/v3/homoit0000561
change note: Version 3.7.0
has top concept: Medical care
in scheme: v3
narrower: https://homosaurus.org/v3/homoit0001838
narrower: https://homosaurus.org/v3/homoit0001839
related: https://homosaurus.org/v3/homoit0001464
related: https://homosaurus.org/v3/homoit0001465
related: https://homosaurus.org/v3/homoit0001849

Facial masculinization surgery
type: Concept
issued: 2022-02-14
modified: 2025-02-23
comment: Any of various surgeries undertaken to masculinize the face or facial features.
alternative label: FMS
broader: https://homosaurus.org/v3/homoit0001837
change note: Version 3.7.0
has top concept: Medical care
in scheme: v3
preferred label: Facial masculinisation surgery
related: https://homosaurus.org/v3/homoit0001464
related: https://homosaurus.org/v3/homoit0001465
related: https://homosaurus.org/v3/homoit0001839

Facial feminization surgery
type: Concept
issued: 2022-02-14
modified: 2025-02-23
comment: Any of various surgeries undertaken to feminize the face or facial features.
alternative label: FFS
broader: https://homosaurus.org/v3/homoit0001837
change note: Version 3.7.0
has top concept: Medical care
in scheme: v3
narrower: https://homosaurus.org/v3/homoit0001849
preferred label: Facial feminisation surgery
related: https://homosaurus.org/v3/homoit0001464
related: https://homosaurus.org/v3/homoit0001465
related: https://homosaurus.org/v3/homoit0001838

Top surgery
type: Concept
issued: 2022-02-14
modified: 2025-02-23
comment: Colloquial term for gender-affirming surgical alterations of the chest.
broader: https://homosaurus.org/v3/homoit0000561
change note: Version 3.7.0
has top concept: Medical care
in scheme: v3
narrower: https://homosaurus.org/v3/homoit0001620
narrower: https://homosaurus.org/v3/homoit0001631
narrower: https://homosaurus.org/v3/homoit0001841
related: https://homosaurus.org/v3/homoit0000114
related: https://homosaurus.org/v3/homoit0000584
related: https://homosaurus.org/v3/homoit0001465

Chest reconstruction surgery
type: Concept
issued: 2022-02-14
modified: 2025-02-23
comment: Reconstruction of the chest, typically following a mastectomy, to give the chest a more masculine appearance.
alternative label: Chest wall reconstruction
broader: https://homosaurus.org/v3/homoit0001840
change note: Version 3.7.0
has top concept: Medical care
in scheme: v3
related: https://homosaurus.org/v3/homoit0001465
related: https://homosaurus.org/v3/homoit0001631
related: https://homosaurus.org/v3/homoit0003118

Feminizing vocal surgery
type: Concept
issued: 2022-02-14
modified: 2025-02-23
comment: Any of various surgical procedures undertaken to feminize the voice.
alternative label: VFS
alternative label: Vocal feminization surgery
alternative label: Voice feminization surgery
broader: https://homosaurus.org/v3/homoit0000561
change note: Version 3.7.0
has top concept: Medical care
in scheme: v3
related: https://homosaurus.org/v3/homoit0001465
related: https://homosaurus.org/v3/homoit0001495
related: https://homosaurus.org/v3/homoit0001496
related: https://homosaurus.org/v3/homoit0001843

Masculinizing vocal surgery
type: Concept
issued: 2022-02-14
modified: 2025-02-23
comment: Any of various surgical procedures undertaken to masculinize the voice.
alternative label: Masculinization laryngoplasty
alternative label: Vocal masculinization surgery
alternative label: Voice masculinization surgery
broader: https://homosaurus.org/v3/homoit0000561
change note: Version 3.7.0
has top concept: Medical care
in scheme: v3
related: https://homosaurus.org/v3/homoit0001465
related: https://homosaurus.org/v3/homoit0001495
related: https://homosaurus.org/v3/homoit0001496
related: https://homosaurus.org/v3/homoit0001842

Clitoroplasty
type: Concept
issued: 2022-02-14
modified: 2025-02-23
comment: Surgical construction of the clitoris, often undertaken as a form of gender affirming surgery.
broader: https://homosaurus.org/v3/homoit0000584
change note: Version 3.7.0
has top concept: Medical care
in scheme: v3
related: https://homosaurus.org/v3/homoit0000282
related: https://homosaurus.org/v3/homoit0001040
related: https://homosaurus.org/v3/homoit0001465
related: https://homosaurus.org/v3/homoit0001845
related: https://homosaurus.org/v3/homoit0001851

Labiaplasty
type: Concept
issued: 2022-02-14
modified: 2025-02-23
comment: Surgical construction of the labia.
alternative label: Labioplasty
broader: https://homosaurus.org/v3/homoit0000584
change note: Version 3.7.0
has top concept: Medical care
in scheme: v3
related: https://homosaurus.org/v3/homoit0001040
related: https://homosaurus.org/v3/homoit0001465
related: https://homosaurus.org/v3/homoit0001488
related: https://homosaurus.org/v3/homoit0001497
related: https://homosaurus.org/v3/homoit0001844
related: https://homosaurus.org/v3/homoit0001851

Metoidioplasty
type: Concept
issued: 2022-02-14
modified: 2025-02-23
comment: Surgical procedure in which the urethra is elongated and placed along a neophallus, typically to allow for standing urination.
alternative label: Meta
alternative label: Metaoidioplasty
alternative label: Meto
broader: https://homosaurus.org/v3/homoit0000584
change note: Version 3.7.0
has top concept: Medical care
in scheme: v3
related: https://homosaurus.org/v3/homoit0001099
related: https://homosaurus.org/v3/homoit0001361
related: https://homosaurus.org/v3/homoit0001465
related: https://homosaurus.org/v3/homoit0001847
related: https://homosaurus.org/v3/homoit0001848
related: https://homosaurus.org/v3/homoit0001850
related: https://homosaurus.org/v3/homoit0001852
related: https://homosaurus.org/v3/homoit0001894

Scrotoplasty
type: Concept
issued: 2022-02-14
modified: 2025-02-23
comment: Surgical construction of the scrotum.
alternative label: Oscheoplasty
broader: https://homosaurus.org/v3/homoit0000584
change note: Version 3.7.0
has top concept: Medical care
in scheme: v3
related: https://homosaurus.org/v3/homoit0001099
related: https://homosaurus.org/v3/homoit0001361
related: https://homosaurus.org/v3/homoit0001465
related: https://homosaurus.org/v3/homoit0001846
related: https://homosaurus.org/v3/homoit0001848
related: https://homosaurus.org/v3/homoit0001850
related: https://homosaurus.org/v3/homoit0001894

Vaginectomy
type: Concept
issued: 2022-02-14
modified: 2025-02-23
comment: Surgical removal of the vagina.
broader: https://homosaurus.org/v3/homoit0000584
change note: Version 3.7.0
has top concept: Medical care
in scheme: v3
related: https://homosaurus.org/v3/homoit0000282
related: https://homosaurus.org/v3/homoit0001465
related: https://homosaurus.org/v3/homoit0001488
related: https://homosaurus.org/v3/homoit0001497
related: https://homosaurus.org/v3/homoit0001846
related: https://homosaurus.org/v3/homoit0001847
related: https://homosaurus.org/v3/homoit0001850
related: https://homosaurus.org/v3/homoit0001894

Tracheal shave
type: Concept
issued: 2022-02-15
modified: 2025-02-23
comment: A surgery in which the laryngeal prominence, colloquially referred to as the Adam's apple, is reduced in size, often as part of facial feminization surgery for transfeminine people. Cisgender men and cisgender women may also undergo tracheal shaves if they feel their laryngeal prominence is too prominent.
alternative label: Adam's apple reduction
alternative label: Chondrolaryngoplasty
alternative label: TCR
alternative label: Thyroid cartilage reduction
alternative label: Trache shave
alternative label: Trachea shave
broader: https://homosaurus.org/v3/homoit0001839
change note: Version 3.7.0
has top concept: Medical care
in scheme: v3
related: https://homosaurus.org/v3/homoit0001465
related: https://homosaurus.org/v3/homoit0001837

Phalloplasty
type: Concept
issued: 2022-02-15
modified: 2025-02-23
comment: Surgical construction of the penis.
alternative label: Phallo
alternative label: Vagina-preserving phalloplasty
broader: https://homosaurus.org/v3/homoit0000584
change note: Version 3.7.0
has top concept: Medical care
in scheme: v3
related: https://homosaurus.org/v3/homoit0001099
related: https://homosaurus.org/v3/homoit0001465
related: https://homosaurus.org/v3/homoit0001846
related: https://homosaurus.org/v3/homoit0001847
related: https://homosaurus.org/v3/homoit0001848
related: https://homosaurus.org/v3/homoit0001894

Vaginoplasty
type: Concept
issued: 2022-02-15
modified: 2025-02-23
comment: Surgical construction of the vagina.
alternative label: Intestinal vaginoplasty
alternative label: Penile inversion vaginoplasty
alternative label: Phallus-preserving vaginoplasty
alternative label: Zero depth vaginoplasty
broader: https://homosaurus.org/v3/homoit0000584
change note: Version 3.7.0
has top concept: Medical care
in scheme: v3
related: https://homosaurus.org/v3/homoit0001040
related: https://homosaurus.org/v3/homoit0001465
related: https://homosaurus.org/v3/homoit0001488
related: https://homosaurus.org/v3/homoit0001497
related: https://homosaurus.org/v3/homoit0001844
related: https://homosaurus.org/v3/homoit0001845

Stand-to-Pee devices
type: Concept
issued: 2022-02-15
modified: 2025-02-23
comment: Devices designed to allow individuals to pee while standing up; often used by trans men or transmasculine people to pee in public urinals without risking their safety.
alternative label: STP devices
alternative label: STPs
alternative label: Stand to pee devices
broader: https://homosaurus.org/v3/homoit0000568
change note: Version 3.7.0
has top concept: Gender
in scheme: v3
related: https://homosaurus.org/v3/homoit0000114
related: https://homosaurus.org/v3/homoit0001846
related: https://homosaurus.org/v3/homoit0001894

LGBTQ+ asylum seekers
type: Concept
issued: 2022-02-15
modified: 2025-02-23
comment: LGBTQ+ people who have left their home countries and are seeking protection from persecution and/or human rights violations in other countries but have not yet been legally recognized as refugees.
alternative label: Asylum seekers (LGBTQ)
broader: https://homosaurus.org/v3/homoit0000915
change note: Version 3.7.0
has top concept: LGBTQ+ people
in scheme: v3
related: https://homosaurus.org/v3/homoit0000883
related: https://homosaurus.org/v3/homoit0000902
related: https://homosaurus.org/v3/homoit0000927
related: https://homosaurus.org/v3/homoit0001053
related: https://homosaurus.org/v3/homoit0001092
related: https://homosaurus.org/v3/homoit0001482
related: https://homosaurus.org/v3/homoit0001815

LGBTQ+ disabled people
type: Concept
issued: 2022-02-15
modified: 2025-02-23
comment: LGBTQ+ people who are disabled.
alternative label: Disabled people (LGBTQ)
alternative label: LGBTQ+ people with disabilities
alternative label: LGBTQ+ people with physical disabilities
alternative label: LGBTQ+ people with visual disabilities
alternative label: People with disabilities (LGBTQ)
broader: https://homosaurus.org/v3/homoit0000915
change note: Version 3.7.0
has top concept: LGBTQ+ people
in scheme: v3
narrower: https://homosaurus.org/v3/homoit0000822
narrower: https://homosaurus.org/v3/homoit0001855
narrower: https://homosaurus.org/v3/homoit0001856
narrower: https://homosaurus.org/v3/homoit0001857
narrower: https://homosaurus.org/v3/homoit0001858
narrower: https://homosaurus.org/v3/homoit0001859
narrower: https://homosaurus.org/v3/homoit0001860
narrower: https://homosaurus.org/v3/homoit0001866
narrower: https://homosaurus.org/v3/homoit0001877
narrower: https://homosaurus.org/v3/homoit0002652
narrower: https://homosaurus.org/v3/homoit0002658
narrower: https://homosaurus.org/v3/homoit0002782
narrower: https://homosaurus.org/v3/homoit0002929
narrower: https://homosaurus.org/v3/homoit0002993
narrower: https://homosaurus.org/v3/homoit0002994
narrower: https://homosaurus.org/v3/homoit0002995
narrower: https://homosaurus.org/v3/homoit0002996
related: https://homosaurus.org/v3/homoit0001878
related: https://homosaurus.org/v3/homoit0001879
related: https://homosaurus.org/v3/homoit0001891
related: https://homosaurus.org/v3/homoit0002229
related: https://homosaurus.org/v3/homoit0002577
related: https://homosaurus.org/v3/homoit0002682

Lesbian disabled people
type: Concept
issued: 2022-02-15
modified: 2025-02-23
comment: Lesbians who are disabled.
alternative label: Disabled lesbians
alternative label: Lesbians with disabilities
broader: https://homosaurus.org/v3/homoit0001854
change note: Version 3.7.0
has top concept: LGBTQ+ people
in scheme: v3
narrower: https://homosaurus.org/v3/homoit0001861
narrower: https://homosaurus.org/v3/homoit0001867
narrower: https://homosaurus.org/v3/homoit0001872
related: https://homosaurus.org/v3/homoit0001880

Gay disabled men
type: Concept
issued: 2022-02-15
modified: 2025-02-23
comment: Gay men who are disabled.
alternative label: Disabled gay men
alternative label: Gay men with disabilities
alternative label: Gay disabled people
alternative label: Disabled gay people
alternative label: Gay people with disabilities
broader: https://homosaurus.org/v3/homoit0001854
change note: Version 3.7.0
has top concept: LGBTQ+ people
in scheme: v3
narrower: https://homosaurus.org/v3/homoit0001862
narrower: https://homosaurus.org/v3/homoit0001868
narrower: https://homosaurus.org/v3/homoit0001873
related: https://homosaurus.org/v3/homoit0001881

Bisexual disabled people
type: Concept
issued: 2022-02-17
modified: 2025-02-23
comment: Bisexual people who are disabled.
alternative label: Bisexual people with disabilities
alternative label: Disabled bisexual people
broader: https://homosaurus.org/v3/homoit0001854
change note: Version 3.7.0
has top concept: LGBTQ+ people
in scheme: v3
narrower: https://homosaurus.org/v3/homoit0001863
narrower: https://homosaurus.org/v3/homoit0001869
narrower: https://homosaurus.org/v3/homoit0001874
related: https://homosaurus.org/v3/homoit0001882

Transgender disabled people
type: Concept
issued: 2022-02-17
modified: 2025-02-23
comment: Transgender people who are disabled.
alternative label: Disabled transgender people
alternative label: Transgender people with disabilities
broader: https://homosaurus.org/v3/homoit0001854
change note: Version 3.7.0
has top concept: LGBTQ+ people
in scheme: v3
narrower: https://homosaurus.org/v3/homoit0001864
narrower: https://homosaurus.org/v3/homoit0001870
narrower: https://homosaurus.org/v3/homoit0001875
related: https://homosaurus.org/v3/homoit0001883

Queer disabled people
type: Concept
issued: 2022-02-17
modified: 2025-02-23
comment: Queer people who are disabled.
alternative label: Disabled queer people
alternative label: Queer people with disabilities
broader: https://homosaurus.org/v3/homoit0001854
change note: Version 3.7.0
has top concept: LGBTQ+ people
in scheme: v3
narrower: https://homosaurus.org/v3/homoit0001865
narrower: https://homosaurus.org/v3/homoit0001871
narrower: https://homosaurus.org/v3/homoit0001876
related: https://homosaurus.org/v3/homoit0001884

LGBTQ+ hard of hearing people
type: Concept
issued: 2022-02-17
modified: 2025-02-23
comment: LGBTQ+ people with significant or total hearing loss who may or may not consider themselves d/Deaf.
alternative label: Hard of hearing people (LGBTQ)
alternative label: Hearing impaired people (LGBTQ)
alternative label: HoH people (LGBTQ)
alternative label: LGBTQ+ HoH people
alternative label: LGBTQ+ hearing impaired people
broader: https://homosaurus.org/v3/homoit0001854
change note: Version 3.7.0
has top concept: LGBTQ+ people
in scheme: v3
narrower: https://homosaurus.org/v3/homoit0001861
narrower: https://homosaurus.org/v3/homoit0001862
narrower: https://homosaurus.org/v3/homoit0001863
narrower: https://homosaurus.org/v3/homoit0001864
narrower: https://homosaurus.org/v3/homoit0001865
narrower: https://homosaurus.org/v3/homoit0002785
related: https://homosaurus.org/v3/homoit0001878
related: https://homosaurus.org/v3/homoit0002693

Lesbian hard of hearing people
type: Concept
issued: 2022-02-17
modified: 2025-02-23
comment: Lesbians with significant or total hearing loss who may or may not consider themselves d/Deaf.
alternative label: Hearing impaired lesbians
alternative label: HoH lesbians
alternative label: Lesbian HoH people
alternative label: Lesbian hearing impaired people
broader: https://homosaurus.org/v3/homoit0001855
broader: https://homosaurus.org/v3/homoit0001860
change note: Version 3.7.0
has top concept: LGBTQ+ people
in scheme: v3
related: https://homosaurus.org/v3/homoit0001867
related: https://homosaurus.org/v3/homoit0001878

Gay hard of hearing men
type: Concept
issued: 2022-02-17
modified: 2025-02-23
comment: Gay men with significant or total hearing loss who may or may not consider themselves d/Deaf.
alternative label: Gay HoH people
alternative label: Hearing impaired gay men
alternative label: HoH gay men
alternative label: Gay HoH men
alternative label: Gay hard of hearing people
alternative label: HoH gay people
alternative label: Gay hearing impaired men
broader: https://homosaurus.org/v3/homoit0001856
broader: https://homosaurus.org/v3/homoit0001860
change note: Version 3.7.0
has top concept: LGBTQ+ people
in scheme: v3
related: https://homosaurus.org/v3/homoit0001868
related: https://homosaurus.org/v3/homoit0001878

Bisexual hard of hearing people
type: Concept
issued: 2022-02-17
modified: 2025-02-23
comment: Bisexual people with significant or total hearing loss who may or may not consider themselves d/Deaf.
alternative label: Bisexual HoH people
alternative label: Bisexual hearing impaired people
alternative label: Hearing impaired bisexual people
alternative label: HoH bisexual people
broader: https://homosaurus.org/v3/homoit0001857
broader: https://homosaurus.org/v3/homoit0001860
change note: Version 3.7.0
has top concept: LGBTQ+ people
in scheme: v3
related: https://homosaurus.org/v3/homoit0001869
related: https://homosaurus.org/v3/homoit0001878

Transgender hard of hearing people
type: Concept
issued: 2022-02-17
modified: 2025-02-23
comment: Transgender people with significant or total hearing loss who may or may not consider themselves d/Deaf.
alternative label: Hearing impaired transgender people
alternative label: HoH transgender people
alternative label: Transgender HoH people
alternative label: Transgender hearing impaired people
broader: https://homosaurus.org/v3/homoit0001858
broader: https://homosaurus.org/v3/homoit0001860
change note: Version 3.7.0
has top concept: LGBTQ+ people
in scheme: v3
related: https://homosaurus.org/v3/homoit0001870
related: https://homosaurus.org/v3/homoit0001878

Queer hard of hearing people
type: Concept
issued: 2022-02-17
modified: 2025-02-23
comment: Queer people with significant or total hearing loss who may or may not consider themselves d/Deaf.
alternative label: Hearing impaired queer people
alternative label: HoH queer people
alternative label: Queer HoH people
alternative label: Queer hearing impaired people
broader: https://homosaurus.org/v3/homoit0001859
broader: https://homosaurus.org/v3/homoit0001860
change note: Version 3.7.0
has top concept: LGBTQ+ people
in scheme: v3
related: https://homosaurus.org/v3/homoit0001871
related: https://homosaurus.org/v3/homoit0001878

LGBTQ+ Deaf people
type: Concept
issued: 2022-02-17
modified: 2025-02-23
comment: LGBTQ+ people with significant or total hearing loss. Some but not all Deaf people prefer to capitalize Deaf in recognition of the cultural and linguistic identity they share with other Deaf people.
alternative label: Deaf people (LGBTQ)
broader: https://homosaurus.org/v3/homoit0001854
change note: Version 3.7.0
has top concept: LGBTQ+ people
in scheme: v3
narrower: https://homosaurus.org/v3/homoit0001867
narrower: https://homosaurus.org/v3/homoit0001868
narrower: https://homosaurus.org/v3/homoit0001869
narrower: https://homosaurus.org/v3/homoit0001870
narrower: https://homosaurus.org/v3/homoit0001871
narrower: https://homosaurus.org/v3/homoit0002784
related: https://homosaurus.org/v3/homoit0001878
related: https://homosaurus.org/v3/homoit0002684

Lesbian Deaf people
type: Concept
issued: 2022-02-17
modified: 2025-02-23
comment: Lesbians with significant or total hearing loss. Some but not all Deaf people prefer to capitalize Deaf in recognition of the cultural and linguistic identity they share with other Deaf people.
alternative label: Deaf lesbians
broader: https://homosaurus.org/v3/homoit0001855
broader: https://homosaurus.org/v3/homoit0001866
change note: Version 3.7.0
has top concept: LGBTQ+ people
in scheme: v3
related: https://homosaurus.org/v3/homoit0001861
related: https://homosaurus.org/v3/homoit0001878

Gay Deaf men
type: Concept
issued: 2022-02-17
modified: 2025-02-23
comment: Gay men with significant or total hearing loss. Some but not all Deaf people prefer to capitalize Deaf in recognition of the cultural and linguistic identity they share with other Deaf people.
alternative label: Deaf gay men
alternative label: Gay Deaf people
alternative label: Deaf gay people
broader: https://homosaurus.org/v3/homoit0001856
broader: https://homosaurus.org/v3/homoit0001866
change note: Version 3.7.0
has top concept: LGBTQ+ people
in scheme: v3
related: https://homosaurus.org/v3/homoit0001862
related: https://homosaurus.org/v3/homoit0001878

Bisexual Deaf people
type: Concept
issued: 2022-02-17
modified: 2025-02-23
comment: Bisexual people with significant or total hearing loss. Some but not all Deaf people prefer to capitalize Deaf in recognition of the cultural and linguistic identity they share with other Deaf people.
alternative label: Deaf bisexual people
broader: https://homosaurus.org/v3/homoit0001857
broader: https://homosaurus.org/v3/homoit0001866
change note: Version 3.7.0
has top concept: LGBTQ+ people
in scheme: v3
related: https://homosaurus.org/v3/homoit0001863
related: https://homosaurus.org/v3/homoit0001878

Transgender Deaf people
type: Concept
issued: 2022-02-17
modified: 2025-02-23
comment: Transgender people with significant or total hearing loss. Some but not all Deaf people prefer to capitalize Deaf in recognition of the cultural and linguistic identity they share with other Deaf people.
alternative label: Deaf transgender people
broader: https://homosaurus.org/v3/homoit0001858
broader: https://homosaurus.org/v3/homoit0001866
change note: Version 3.7.0
has top concept: LGBTQ+ people
in scheme: v3
related: https://homosaurus.org/v3/homoit0001864
related: https://homosaurus.org/v3/homoit0001878

Queer Deaf people
type: Concept
issued: 2022-02-17
modified: 2025-02-23
comment: Queer people with significant or total hearing loss. Some but not all Deaf people prefer to capitalize Deaf in recognition of the cultural and linguistic identity they share with other Deaf people.
alternative label: Deaf queer people
broader: https://homosaurus.org/v3/homoit0001859
broader: https://homosaurus.org/v3/homoit0001866
change note: Version 3.7.0
has top concept: LGBTQ+ people
in scheme: v3
related: https://homosaurus.org/v3/homoit0001865
related: https://homosaurus.org/v3/homoit0001878

Lesbian blind people
type: Concept
issued: 2022-02-17
modified: 2025-02-23
comment: Lesbians with significant or total loss of vision.
alternative label: Blind lesbians
broader: https://homosaurus.org/v3/homoit0000822
broader: https://homosaurus.org/v3/homoit0001855
change note: Version 3.7.0
has top concept: LGBTQ+ people
in scheme: v3

Gay blind men
type: Concept
issued: 2022-02-17
modified: 2025-02-23
comment: Gay men with significant or total loss of vision.
alternative label: Blind gay men
alternative label: Gay blind people
alternative label: Blind gay people
broader: https://homosaurus.org/v3/homoit0000822
broader: https://homosaurus.org/v3/homoit0001856
change note: Version 3.7.0
has top concept: LGBTQ+ people
in scheme: v3

Bisexual blind people
type: Concept
issued: 2022-02-17
modified: 2025-02-23
comment: Bisexual people with significant or total loss of vision.
alternative label: Blind bisexual people
broader: https://homosaurus.org/v3/homoit0000822
broader: https://homosaurus.org/v3/homoit0001857
change note: Version 3.7.0
has top concept: LGBTQ+ people
in scheme: v3

Transgender blind people
type: Concept
issued: 2022-02-17
modified: 2025-02-23
comment: Transgender people with significant or total loss of vision.
alternative label: Blind transgender people
broader: https://homosaurus.org/v3/homoit0000822
broader: https://homosaurus.org/v3/homoit0001858
change note: Version 3.7.0
has top concept: LGBTQ+ people
in scheme: v3

Queer blind people
type: Concept
issued: 2022-02-17
modified: 2025-02-23
comment: Queer people with significant or total loss of vision.
alternative label: Blind queer people
broader: https://homosaurus.org/v3/homoit0000822
broader: https://homosaurus.org/v3/homoit0001859
change note: Version 3.7.0
has top concept: LGBTQ+ people
in scheme: v3

LGBTQ+ wheelchair users
type: Concept
issued: 2022-02-17
modified: 2025-02-23
comment: LGBTQ+ people who use wheelchairs.
alternative label: Wheelchair users (LGBTQ)
broader: https://homosaurus.org/v3/homoit0001854
change note: Version 3.7.0
has top concept: LGBTQ+ people
in scheme: v3
narrower: https://homosaurus.org/v3/homoit0001886
narrower: https://homosaurus.org/v3/homoit0001887
narrower: https://homosaurus.org/v3/homoit0001888
narrower: https://homosaurus.org/v3/homoit0001889
narrower: https://homosaurus.org/v3/homoit0001890
narrower: https://homosaurus.org/v3/homoit0002787
narrower: https://homosaurus.org/v3/homoit0002952
related: https://homosaurus.org/v3/homoit0002695

LGBTQ+ Deaf culture
type: Concept
issued: 2022-02-17
modified: 2025-02-23
comment: The community of Deaf LGBTQ+ people who share a cultural and/or linguistic identity.
alternative label: Deaf culture (LGBTQ)
broader: https://homosaurus.org/v3/homoit0000297
change note: Version 3.7.0
has top concept: LGBTQ+ communities
in scheme: v3
related: https://homosaurus.org/v3/homoit0001854
related: https://homosaurus.org/v3/homoit0001860
related: https://homosaurus.org/v3/homoit0001861
related: https://homosaurus.org/v3/homoit0001862
related: https://homosaurus.org/v3/homoit0001863
related: https://homosaurus.org/v3/homoit0001864
related: https://homosaurus.org/v3/homoit0001865
related: https://homosaurus.org/v3/homoit0001866
related: https://homosaurus.org/v3/homoit0001867
related: https://homosaurus.org/v3/homoit0001868
related: https://homosaurus.org/v3/homoit0001869
related: https://homosaurus.org/v3/homoit0001870
related: https://homosaurus.org/v3/homoit0001871
related: https://homosaurus.org/v3/homoit0001891

LGBTQ+ people with chronic illnesses
type: Concept
issued: 2022-02-17
modified: 2025-02-23
comment: LGBTQ+ people who have long-term health conditions that require continued medical attention and/or significantly impact or limit daily life; some but not all people with chronic illnesses consider themselves disabled.
alternative label: Chronically ill people (LGBTQ)
alternative label: People with chronic illnesses (LGBTQ)
broader: https://homosaurus.org/v3/homoit0000915
change note: Version 3.7.0
has top concept: LGBTQ+ people
in scheme: v3
narrower: https://homosaurus.org/v3/homoit0001880
narrower: https://homosaurus.org/v3/homoit0001881
narrower: https://homosaurus.org/v3/homoit0001882
narrower: https://homosaurus.org/v3/homoit0001883
narrower: https://homosaurus.org/v3/homoit0001884
narrower: https://homosaurus.org/v3/homoit0002786
narrower: https://homosaurus.org/v3/homoit0002928
related: https://homosaurus.org/v3/homoit0001854
related: https://homosaurus.org/v3/homoit0001891
related: https://homosaurus.org/v3/homoit0002229
related: https://homosaurus.org/v3/homoit0002577
related: https://homosaurus.org/v3/homoit0002694

Lesbians with chronic illnesses
type: Concept
issued: 2022-02-17
modified: 2025-02-23
comment: Lesbians who have long-term health conditions that require continued medical attention and/or significantly impact or limit daily life; some but not all people with chronic illnesses consider themselves disabled.
alternative label: Chronically ill lesbians
broader: https://homosaurus.org/v3/homoit0001879
change note: Version 3.7.0
has top concept: LGBTQ+ people
in scheme: v3
related: https://homosaurus.org/v3/homoit0001855
related: https://homosaurus.org/v3/homoit0001886

Gay men with chronic illnesses
type: Concept
issued: 2022-02-17
modified: 2025-02-23
comment: Gay men who have long-term health conditions that require continued medical attention and/or significantly impact or limit daily life; some but not all people with chronic illnesses consider themselves disabled.
alternative label: Chronically ill gay men
broader: https://homosaurus.org/v3/homoit0001879
change note: Version 3.7.0
has top concept: LGBTQ+ people
in scheme: v3
related: https://homosaurus.org/v3/homoit0001856
related: https://homosaurus.org/v3/homoit0001887

Bisexual people with chronic illnesses
type: Concept
issued: 2022-02-17
modified: 2025-02-23
comment: Bisexual people who have long-term health conditions that require continued medical attention and/or significantly impact or limit daily life; some but not all people with chronic illnesses consider themselves disabled.
alternative label: Chronically ill bisexual people
broader: https://homosaurus.org/v3/homoit0001879
change note: Version 3.7.0
has top concept: LGBTQ+ people
in scheme: v3
related: https://homosaurus.org/v3/homoit0001857
related: https://homosaurus.org/v3/homoit0001888

Transgender people with chronic illnesses
type: Concept
issued: 2022-02-17
modified: 2025-02-23
comment: Transgender people who have long-term health conditions that require continued medical attention and/or significantly impact or limit daily life; some but not all people with chronic illnesses consider themselves disabled.
alternative label: Chronically ill transgender people
broader: https://homosaurus.org/v3/homoit0001879
change note: Version 3.7.0
has top concept: LGBTQ+ people
in scheme: v3
related: https://homosaurus.org/v3/homoit0001378
related: https://homosaurus.org/v3/homoit0001858
related: https://homosaurus.org/v3/homoit0001889

Queer people with chronic illnesses
type: Concept
issued: 2022-02-17
modified: 2025-02-23
comment: Queer people who have long-term health conditions that require continued medical attention and/or significantly impact or limit daily life; some but not all people with chronic illnesses consider themselves disabled.
alternative label: Chronically ill queer people
broader: https://homosaurus.org/v3/homoit0001879
change note: Version 3.7.0
has top concept: LGBTQ+ people
in scheme: v3
related: https://homosaurus.org/v3/homoit0001859
related: https://homosaurus.org/v3/homoit0001890

Anti-Two-Spirit discrimination
type: Concept
issued: 2022-02-17
modified: 2025-02-23
comment: The unjust or prejudicial treatment of Two-Spirit people due to their identity; may include the denial of legal rights, employment, and housing.
alternative label: Anti-2S discrimination
alternative label: Anti-Two Spirit discrimination
alternative label: Anti-Two Spirited discrimination
alternative label: Anti-Two-Spirited discrimination
broader: https://homosaurus.org/v3/homoit0000356
change note: Version 3.7.0
has top concept: LGBTQ+ discrimination
in scheme: v3
related: https://homosaurus.org/v3/homoit0000112
related: https://homosaurus.org/v3/homoit0000920
related: https://homosaurus.org/v3/homoit0003158
related: https://homosaurus.org/v3/homoit0003737

Lesbian wheelchair users
type: Concept
issued: 2022-02-24
modified: 2025-02-23
comment: Lesbians who use wheelchairs.
broader: https://homosaurus.org/v3/homoit0001877
change note: Version 3.7.0
has top concept: LGBTQ+ people
in scheme: v3
related: https://homosaurus.org/v3/homoit0001880

Gay wheelchair users
type: Concept
issued: 2022-02-24
modified: 2025-02-23
comment: Gay men who use wheelchairs.
broader: https://homosaurus.org/v3/homoit0001877
change note: Version 3.7.0
has top concept: LGBTQ+ people
in scheme: v3
related: https://homosaurus.org/v3/homoit0001881

Bisexual wheelchair users
type: Concept
issued: 2022-02-24
modified: 2025-02-23
comment: Bisexual people who use wheelchairs.
broader: https://homosaurus.org/v3/homoit0001877
change note: Version 3.7.0
has top concept: LGBTQ+ people
in scheme: v3
related: https://homosaurus.org/v3/homoit0001882

Transgender wheelchair users
type: Concept
issued: 2022-02-24
modified: 2025-02-23
comment: Transgender people who use wheelchairs.
broader: https://homosaurus.org/v3/homoit0001877
change note: Version 3.7.0
has top concept: LGBTQ+ people
in scheme: v3
related: https://homosaurus.org/v3/homoit0001883

Queer wheelchair users
type: Concept
issued: 2022-02-24
modified: 2025-02-23
comment: Queer people who use wheelchairs.
broader: https://homosaurus.org/v3/homoit0001877
change note: Version 3.7.0
has top concept: LGBTQ+ people
in scheme: v3
related: https://homosaurus.org/v3/homoit0001884

Crip
type: Concept
issued: 2022-02-24
modified: 2025-02-23
comment: A shortened form of the word "cripple" that has been reclaimed by disabled people to express pride and identify their political and community ties. Only use in reference to individuals or organizations that self-identify as crip. Because of the many intersections between crip theory/culture and queer theory/culture, the two are often but not always viewed as related.
broader: https://homosaurus.org/v3/homoit0001559
change note: Version 3.7.0
has top concept: LGBTQ+ slang
in scheme: v3
related: https://homosaurus.org/v3/homoit0001149
related: https://homosaurus.org/v3/homoit0001854
related: https://homosaurus.org/v3/homoit0001878
related: https://homosaurus.org/v3/homoit0001879
related: https://homosaurus.org/v3/homoit0002577

Anti-intersex discrimination
type: Concept
issued: 2022-02-28
modified: 2025-02-23
comment: The unjust or prejudicial treatment of intersex people due to the fact that they are intersex; may include the denial of legal rights, employment, and housing.
broader: https://homosaurus.org/v3/homoit0000356
change note: Version 3.7.0
has top concept: LGBTQ+ discrimination
in scheme: v3
related: https://homosaurus.org/v3/homoit0000112
related: https://homosaurus.org/v3/homoit0000666
related: https://homosaurus.org/v3/homoit0003737

Neophallus
type: Concept
issued: 2022-02-28
modified: 2025-02-23
comment: A surgically constructed penis; typically made using tissue grafts from other parts of the body.
broader: https://homosaurus.org/v3/homoit0000561
broader: https://homosaurus.org/v3/homoit0001099
change note: Version 3.7.0
has top concept: Medical care
in scheme: v3
related: https://homosaurus.org/v3/homoit0001465
related: https://homosaurus.org/v3/homoit0001846
related: https://homosaurus.org/v3/homoit0001847
related: https://homosaurus.org/v3/homoit0001848
related: https://homosaurus.org/v3/homoit0001850
related: https://homosaurus.org/v3/homoit0001852

Masquerading
type: Concept
issued: 2022-02-28
modified: 2025-02-23
comment: Term used in the 18th and 19th centuries to describe the act of dressing in disguise, often to emulate another gender. Only use in historical contexts.
broader: https://homosaurus.org/v3/homoit0000878
change note: Version 3.7.0
has top concept: LGBTQ+ historical terms
in scheme: v3
related: https://homosaurus.org/v3/homoit0000289
related: https://homosaurus.org/v3/homoit0000318
related: https://homosaurus.org/v3/homoit0000367
related: https://homosaurus.org/v3/homoit0001469

Endosex
type: Concept
issued: 2022-02-28
modified: 2025-02-23
comment: The state of individuals born with the sexual anatomy, reproductive system, and chromosomes associated with their assigned sex (i.e., not intersex).
alternative label: Dyadic
alternative label: Non-intersex
alternative label: Perisex
broader: https://homosaurus.org/v3/homoit0001269
change note: Version 3.7.0
has top concept: Sex (Body)
in scheme: v3
related: https://homosaurus.org/v3/homoit0001268
related: https://homosaurus.org/v3/homoit0001648
related: https://homosaurus.org/v3/homoit0001897

Studs
type: Concept
issued: 2022-02-28
modified: 2025-02-23
comment: Masculine identity associated with Black lesbian communities in the United States.
broader: https://homosaurus.org/v3/homoit0000577
broader: https://homosaurus.org/v3/homoit0001295
broader: https://homosaurus.org/v3/homoit0001304
change note: Version 3.7.0
has top concept: Role behavior
in scheme: v3
related: https://homosaurus.org/v3/homoit0000215
related: https://homosaurus.org/v3/homoit0000432
related: https://homosaurus.org/v3/homoit0000995

Gender ambiguity
type: Concept
issued: 2022-02-28
modified: 2025-02-23
comment: Gender expression that does not conform to a single, distinct gender identity.
broader: https://homosaurus.org/v3/homoit0000568
change note: Version 3.7.0
has top concept: Gender
in scheme: v3
related: https://homosaurus.org/v3/homoit0000560
related: https://homosaurus.org/v3/homoit0000577

Critical race theory
type: Concept
issued: 2022-03-29
modified: 2025-02-23
comment: A multidiscplinary field of study and intellectual framework used by scholars and activists to examine the intersections of race, class, and law in the United States, as well as to challenge mainstream U.S. liberal approaches to racial justice. Key concepts of CRT include the argument that race is a social construct with no biological basis and that racism and disparate racial outcomes are the result of complex, changing, and often subtle social and institutional dynamics, rather than individuals' explicit and intentional prejudices.
alternative label: CRT
broader: https://homosaurus.org/v3/homoit0001365
change note: Version 3.7.0
has top concept: Theories
in scheme: v3
related: https://homosaurus.org/v3/homoit0001903
related: https://homosaurus.org/v3/homoit0002038
related: https://homosaurus.org/v3/homoit0002257
related: https://homosaurus.org/v3/homoit0002269

Zaps
type: Concept
issued: 2022-03-29
modified: 2025-02-23
comment: Popularized by the gay liberation group Gays Activists Alliance, zaps are public demonstrations focused on confronting or embarrassing specific politicians or public officials while calling attention to the liberation movement.
broader: https://homosaurus.org/v3/homoit0000851
change note: Version 3.7.0
has top concept: LGBTQ+ activism
in scheme: v3
related: https://homosaurus.org/v3/homoit0000007
related: https://homosaurus.org/v3/homoit0001026

LGBTQ+ witches
type: Concept
issued: 2022-03-29
modified: 2025-02-23
comment: LGBTQ+ practitioners of Wicca or other Pagan religions who self-identify as witches.
alternative label: LGBTQ+ Wiccans
broader: https://homosaurus.org/v3/homoit0001069
change note: Version 3.7.0
has top concept: LGBTQ+ religious people
in scheme: v3
narrower: https://homosaurus.org/v3/homoit0001908
narrower: https://homosaurus.org/v3/homoit0001909
narrower: https://homosaurus.org/v3/homoit0001910
narrower: https://homosaurus.org/v3/homoit0001911
narrower: https://homosaurus.org/v3/homoit0001912
narrower: https://homosaurus.org/v3/homoit0001913
narrower: https://homosaurus.org/v3/homoit0002985
related: https://homosaurus.org/v3/homoit0000596

Lesbian witches
type: Concept
issued: 2022-03-29
modified: 2025-02-23
comment: Lesbians who practice Wicca or other Pagan religions and self-identify as witches.
alternative label: Lesbian Wiccans
alternative label: Witches (Lesbians)
broader: https://homosaurus.org/v3/homoit0001907
change note: Version 3.7.0
has top concept: LGBTQ+ religious people
in scheme: v3
related: https://homosaurus.org/v3/homoit0000596
related: https://homosaurus.org/v3/homoit0000761

Gay witches
type: Concept
issued: 2022-03-29
modified: 2025-02-23
comment: Gay men who practice Wicca or other Pagan religions and self-identify as witches.
alternative label: Gay Wiccans
broader: https://homosaurus.org/v3/homoit0001907
change note: Version 3.7.0
has top concept: LGBTQ+ religious people
in scheme: v3
related: https://homosaurus.org/v3/homoit0000516
related: https://homosaurus.org/v3/homoit0000596

Bisexual witches
type: Concept
issued: 2022-03-29
modified: 2025-02-23
comment: Bisexual practitioners of Wicca or other Pagan religions who self-identify as witches.
alternative label: Bisexual Wiccans
broader: https://homosaurus.org/v3/homoit0001907
change note: Version 3.7.0
has top concept: LGBTQ+ religious people
in scheme: v3
related: https://homosaurus.org/v3/homoit0000168
related: https://homosaurus.org/v3/homoit0000596

Transgender witches
type: Concept
issued: 2022-03-29
modified: 2025-02-23
comment: Transgender practitioners of Wicca or other Pagan religions who self-identify as witches.
alternative label: Transgender Wiccans
broader: https://homosaurus.org/v3/homoit0001907
change note: Version 3.7.0
has top concept: LGBTQ+ religious people
in scheme: v3
related: https://homosaurus.org/v3/homoit0000596
related: https://homosaurus.org/v3/homoit0001429

Queer witches
type: Concept
issued: 2022-03-29
modified: 2025-02-23
comment: Queer practitioners of Wicca or other Pagan religions who self-identify as witches.
alternative label: Queer Wiccans
broader: https://homosaurus.org/v3/homoit0001907
change note: Version 3.7.0
has top concept: LGBTQ+ religious people
in scheme: v3
related: https://homosaurus.org/v3/homoit0000596
related: https://homosaurus.org/v3/homoit0001193

Intersex witches
type: Concept
issued: 2022-03-29
modified: 2025-02-23
comment: Intersex practitioners of Wicca or other Pagan religions who self-identify as witches.
alternative label: Intersex Wiccans
broader: https://homosaurus.org/v3/homoit0001907
change note: Version 3.7.0
has top concept: LGBTQ+ religious people
in scheme: v3
related: https://homosaurus.org/v3/homoit0000596

Two-Spirit identity
type: Concept
issued: 2022-03-29
modified: 2025-02-23
comment: Identity term used by Indigenous people in North America to reconnect with the multiple gender and sexual roles in Indigenous cultures.
alternative label: 2S identity
alternative label: Two Spirit identity
alternative label: Two Spirited identity
alternative label: Two-Spirited identity
broader: https://homosaurus.org/v3/homoit0000322
change note: Version 3.7.0
has top concept: Gender
in scheme: v3
related: https://homosaurus.org/v3/homoit0000098
related: https://homosaurus.org/v3/homoit0001037
related: https://homosaurus.org/v3/homoit0002581

Transgenderqueer identity
type: Concept
issued: 2022-03-31
modified: 2025-02-23
comment: Identity term used to describe the intersection of trans identity and genderqueer identity.
alternative label: Transgenderqueerness
broader: https://homosaurus.org/v3/homoit0000571
change note: Version 3.7.0
has top concept: Gender
in scheme: v3
related: https://homosaurus.org/v3/homoit0001378
related: https://homosaurus.org/v3/homoit0001668

Polysexual people
type: Concept
issued: 2022-03-31
modified: 2025-02-23
comment: Individuals who experience sexual attraction to more than one gender; includes bisexual and pansexual people.
alternative label: Polysexuals
broader: https://homosaurus.org/v3/homoit0000108
broader: https://homosaurus.org/v3/homoit0000915
change note: Version 3.7.0
has top concept: LGBTQ+ people
in scheme: v3
related: https://homosaurus.org/v3/homoit0000204
related: https://homosaurus.org/v3/homoit0001558

Non-binary identity
type: Concept
issued: 2022-03-31
modified: 2025-02-23
comment: Gender identity that exists outside of the gender binary; may be used as a specific gender identity or as an umbrella term in the Euro-American gender system for gender identities outside of the gender binary.
alternative label: Nonbinary identity
broader: https://homosaurus.org/v3/homoit0000571
change note: Version 3.7.0
has top concept: Gender
in scheme: v3
related: https://homosaurus.org/v3/homoit0001048

Genderqueer identity
type: Concept
issued: 2022-03-31
modified: 2025-02-23
comment: Gender identity that does not conform to the gender binary and emphasizes alignment with queer politics.
alternative label: Genderqueerness
broader: https://homosaurus.org/v3/homoit0000571
change note: Version 3.7.0
has top concept: Gender
in scheme: v3
related: https://homosaurus.org/v3/homoit0000582
related: https://homosaurus.org/v3/homoit0001195
related: https://homosaurus.org/v3/homoit0001378
related: https://homosaurus.org/v3/homoit0001668

Gender non-conforming identity
type: Concept
issued: 2022-03-31
modified: 2025-02-23
comment: Gender identity that does not conform to the gender binary, not to be confused with gender non-conforming practices engaged in by cisgender people.
alternative label: Gender nonconforming identity
alternative label: Gender-nonconforming identity
broader: https://homosaurus.org/v3/homoit0000571
change note: Version 3.7.0
has top concept: Gender
in scheme: v3
related: https://homosaurus.org/v3/homoit0000574
related: https://homosaurus.org/v3/homoit0001378
related: https://homosaurus.org/v3/homoit0001756
related: https://homosaurus.org/v3/homoit0002388

Demigender identity
type: Concept
issued: 2022-03-31
modified: 2025-02-23
comment: Umbrella term for gender identities that emphasize a partial connection to a certain gender or concept of gender.
broader: https://homosaurus.org/v3/homoit0000571
change note: Version 3.7.0
has top concept: Gender
in scheme: v3
related: https://homosaurus.org/v3/homoit0000342
related: https://homosaurus.org/v3/homoit0000343
related: https://homosaurus.org/v3/homoit0001652
related: https://homosaurus.org/v3/homoit0001653

Cisgender identity
type: Concept
issued: 2022-03-31
modified: 2025-02-23
comment: Term used to describe the identity of people who identify with the sex or gender they were assigned at birth.
alternative label: Cis identity
broader: https://homosaurus.org/v3/homoit0000571
change note: Version 3.7.0
has top concept: Gender
in scheme: v3
related: https://homosaurus.org/v3/homoit0000270
related: https://homosaurus.org/v3/homoit0000271
related: https://homosaurus.org/v3/homoit0000272
related: https://homosaurus.org/v3/homoit0001924

Pansexuality
type: Concept
issued: 2022-03-31
modified: 2025-02-23
comment: Sexual identity used to describe sexual and/or romantic attraction to people of all genders.
broader: https://homosaurus.org/v3/homoit0001295
broader: https://homosaurus.org/v3/homoit0001298
broader: https://homosaurus.org/v3/homoit0001558
change note: Version 3.7.0
has top concept: Sexual identity
in scheme: v3
related: https://homosaurus.org/v3/homoit0001073

Agender identity
type: Concept
issued: 2022-03-31
modified: 2025-02-23
comment: Identity term used to describe people who do not have genders or who identify with genderlessness.
broader: https://homosaurus.org/v3/homoit0000571
change note: Version 3.7.0
has top concept: Gender
in scheme: v3
related: https://homosaurus.org/v3/homoit0000021

LGBTQ+ athletes
type: Concept
issued: 2022-05-03
modified: 2025-02-23
comment: Professional or amateur sports players who self-identify as LGBTQ+.
alternative label: LGBTQ+ sports players
alternative label: LGBTQ+ sportspeople
alternative label: LGBTQ+ sportspersons
broader: https://homosaurus.org/v3/homoit0000915
change note: Version 3.7.0
has top concept: LGBTQ+ people
in scheme: v3
narrower: https://homosaurus.org/v3/homoit0001930
narrower: https://homosaurus.org/v3/homoit0001931
narrower: https://homosaurus.org/v3/homoit0001932
narrower: https://homosaurus.org/v3/homoit0001933
narrower: https://homosaurus.org/v3/homoit0001934
narrower: https://homosaurus.org/v3/homoit0001935
narrower: https://homosaurus.org/v3/homoit0003443
related: https://homosaurus.org/v3/homoit0000949
related: https://homosaurus.org/v3/homoit0000950
related: https://homosaurus.org/v3/homoit0001936

Lesbian athletes
type: Concept
issued: 2022-05-03
modified: 2025-02-23
comment: Professional or amateur/recreational sports players who self-identify as lesbians.
alternative label: Lesbian sports players
alternative label: Lesbian sportspeople
alternative label: Lesbian sportspersons
alternative label: Lesbian sportswomen
broader: https://homosaurus.org/v3/homoit0001929
change note: Version 3.7.0
has top concept: LGBTQ+ people
in scheme: v3
related: https://homosaurus.org/v3/homoit0000780

Gay athletes
type: Concept
issued: 2022-05-03
modified: 2025-02-23
comment: Professional or amateur/recreational sports players who self-identify as gay men.
alternative label: Gay sports players
alternative label: Gay sportsmen
alternative label: Gay sportspeople
alternative label: Gay sportspersons
broader: https://homosaurus.org/v3/homoit0001929
change note: Version 3.7.0
has top concept: LGBTQ+ people
in scheme: v3
related: https://homosaurus.org/v3/homoit0000537

Bisexual athletes
type: Concept
issued: 2022-05-03
modified: 2025-02-23
comment: Professional or amateur/recreational sports players who are bisexual.
alternative label: Bisexual sports players
alternative label: Bisexual sportspeople
alternative label: Bisexual sportspersons
broader: https://homosaurus.org/v3/homoit0001929
change note: Version 3.7.0
has top concept: LGBTQ+ people
in scheme: v3

Transgender athletes
type: Concept
issued: 2022-05-03
modified: 2025-02-23
comment: Professional or recreational sports players who self-identify as transgender.
alternative label: Transgender sports players
alternative label: Transgender sportspeople
alternative label: Transgender sportspersons
broader: https://homosaurus.org/v3/homoit0001929
change note: Version 3.7.0
has top concept: LGBTQ+ people
in scheme: v3
related: https://homosaurus.org/v3/homoit0003510

Queer athletes
type: Concept
issued: 2022-05-03
modified: 2025-02-23
comment: Professional or recreational sports players who self-identify as queer.
alternative label: Queer sports players
alternative label: Queer sportspeople
alternative label: Queer sportspersons
broader: https://homosaurus.org/v3/homoit0001929
change note: Version 3.7.0
has top concept: LGBTQ+ people
in scheme: v3

Intersex athletes
type: Concept
issued: 2022-05-03
modified: 2025-02-23
comment: Professional or amateur sports players who are intersex.
alternative label: Intersex sports players
alternative label: Intersex sportspeople
alternative label: Intersex sportspersons
broader: https://homosaurus.org/v3/homoit0001929
change note: Version 3.7.0
has top concept: LGBTQ+ people
in scheme: v3

Two-Spirit athletes
type: Concept
issued: 2022-05-03
modified: 2025-02-23
comment: Professional or recreational sports players who self-identify as Two-Spirit.
alternative label: 2S athletes
alternative label: Two Spirited athletes
alternative label: Two-Spirit sports players
alternative label: Two-Spirit sportspeople
alternative label: Two-Spirit sportspersons
alternative label: Two-Spirited athletes
broader: https://homosaurus.org/v3/homoit0001480
change note: Version 3.7.0
has top concept: Gender
in scheme: v3
related: https://homosaurus.org/v3/homoit0001929

Pacific Islander American lesbians
type: Concept
issued: 2022-05-10
modified: 2025-02-23
comment: Lesbians who identify as both Pacific Islanders (or of Pacific Islander ancestry) and American.
alternative label: Lesbian Pacific Islander Americans
broader: https://homosaurus.org/v3/homoit0001812
change note: Version 3.7.0
has top concept: LGBTQ+ people
in scheme: v3

Pacific Islander American gay men
type: Concept
issued: 2022-05-10
modified: 2025-02-23
comment: Gay men who identify as both Pacific Islanders (or of Pacific Islander ancestry) and American.
alternative label: Gay Pacific Islander American men
alternative label: Gay Pacific Islander Americans
broader: https://homosaurus.org/v3/homoit0001812
change note: Version 3.7.0
has top concept: LGBTQ+ people
in scheme: v3

Pacific Islander American bisexual people
type: Concept
issued: 2022-05-10
modified: 2025-02-23
comment: Bisexual people who identify as both Pacific Islanders (or of Pacific Islander ancestry) and American.
alternative label: Bisexual Pacific Islander American people
alternative label: Bisexual Pacific Islander Americans
broader: https://homosaurus.org/v3/homoit0001812
change note: Version 3.7.0
has top concept: LGBTQ+ people
in scheme: v3

Pacific Islander American transgender people
type: Concept
issued: 2022-05-10
modified: 2025-02-23
comment: Transgender people who identify as both Pacific Islanders (or of Pacific Islander ancestry) and American.
alternative label: Transgender Pacific Islander American people
alternative label: Transgender Pacific Islander Americans
broader: https://homosaurus.org/v3/homoit0001812
change note: Version 3.7.0
has top concept: LGBTQ+ people
in scheme: v3

Pacific Islander American queer people
type: Concept
issued: 2022-05-10
modified: 2025-02-23
comment: Queer people who identify as both Pacific Islanders (or of Pacific Islander ancestry) and American.
alternative label: Queer Pacific Islander American people
alternative label: Queer Pacific Islander Americans
broader: https://homosaurus.org/v3/homoit0001812
change note: Version 3.7.0
has top concept: LGBTQ+ people
in scheme: v3

Pacific Islander American intersex people
type: Concept
issued: 2022-05-10
modified: 2025-02-23
comment: Intersex people who identify as both Pacific Islanders (or of Pacific Islander ancestry) and American.
alternative label: Intersex Pacific Islander American people
alternative label: Intersex Pacific Islander Americans
broader: https://homosaurus.org/v3/homoit0001812
broader: https://homosaurus.org/v3/homoit0001973
change note: Version 3.7.0
has top concept: LGBTQ+ people
in scheme: v3
related: https://homosaurus.org/v3/homoit0001961

Papuan lesbians
type: Concept
issued: 2022-05-11
modified: 2025-02-23
comment: Lesbians who are Papuan, or part of the Indigenous peoples of new Guinea; only use for people who identify as Papuan.
alternative label: Lesbian Papuans
broader: https://homosaurus.org/v3/homoit0000913
change note: Version 3.7.0
has top concept: LGBTQ+ people
in scheme: v3

Papuan gay men
type: Concept
issued: 2022-05-11
modified: 2025-02-23
comment: Gay men who are Papuan, or part of the Indigenous peoples of new Guinea; only use for people who identify as Papuan.
alternative label: Gay Papuan men
alternative label: Gay Papuans
broader: https://homosaurus.org/v3/homoit0000913
change note: Version 3.7.0
has top concept: LGBTQ+ people
in scheme: v3

Papuan bisexual people
type: Concept
issued: 2022-05-11
modified: 2025-02-23
comment: Bisexual people who are Papuan, or part of the Indigenous peoples of new Guinea; only use for people who identify as Papuan.
alternative label: Bisexual Papuan people
alternative label: Bisexual Papuans
broader: https://homosaurus.org/v3/homoit0000913
change note: Version 3.7.0
has top concept: LGBTQ+ people
in scheme: v3

Papuan transgender people
type: Concept
issued: 2022-05-11
modified: 2025-02-23
comment: Transgender people who are Papuan, or part of the Indigenous peoples of new Guinea; only use for people who identify as Papuan.
alternative label: Transgender Papuan people
alternative label: Transgender Papuans
broader: https://homosaurus.org/v3/homoit0000913
change note: Version 3.7.0
has top concept: LGBTQ+ people
in scheme: v3

Papuan queer people
type: Concept
issued: 2022-05-11
modified: 2025-02-23
comment: Queer people who are Papuan, or part of the Indigenous peoples of new Guinea; only use for people who identify as Papuan.
alternative label: Queer Papuan people
alternative label: Queer Papuans
broader: https://homosaurus.org/v3/homoit0000913
change note: Version 3.7.0
has top concept: LGBTQ+ people
in scheme: v3

Papuan intersex people
type: Concept
issued: 2022-05-11
modified: 2025-02-23
comment: Intersex people who are Papuan, or part of the Indigenous peoples of new Guinea; only use for people who identify as Papuan.
alternative label: Intersex Papuan people
alternative label: Intersex Papuans
broader: https://homosaurus.org/v3/homoit0000913
change note: Version 3.7.0
has top concept: LGBTQ+ people
in scheme: v3

Romani lesbians
type: Concept
issued: 2022-05-11
modified: 2025-02-23
comment: Lesbians who are Romani, or part of the traditionally nomadic Indo-European people.
alternative label: Lesbian Roma
alternative label: Lesbian Romanis
alternative label: Lesbian Romany
alternative label: Roma lesbians
alternative label: Romany lesbians
broader: https://homosaurus.org/v3/homoit0000875
change note: Version 3.7.0
has top concept: LGBTQ+ people
in scheme: v3

Romani gay men
type: Concept
issued: 2022-05-11
modified: 2025-02-23
comment: Gay men who are Romani, or part of the traditionally nomadic Indo-European people.
alternative label: Gay Roma
alternative label: Gay Romanis
alternative label: Gay Romany
alternative label: Roma gay men
alternative label: Romany gay men
broader: https://homosaurus.org/v3/homoit0000875
change note: Version 3.7.0
has top concept: LGBTQ+ people
in scheme: v3

Romani bisexual people
type: Concept
issued: 2022-05-11
modified: 2025-02-23
comment: Bisexual people who are Romani, or part of the traditionally nomadic Indo-European people.
alternative label: Bisexual Roma
alternative label: Bisexual Romanis
alternative label: Bisexual Romany
alternative label: Roma bisexual people
alternative label: Romany bisexual people
broader: https://homosaurus.org/v3/homoit0000875
change note: Version 3.7.0
has top concept: LGBTQ+ people
in scheme: v3

Romani transgender people
type: Concept
issued: 2022-05-11
modified: 2025-02-23
comment: Transgender people who are Romani, or part of the traditionally nomadic Indo-European people.
alternative label: Roma transgender people
alternative label: Romany transgender people
alternative label: Transgender Roma
alternative label: Transgender Romanis
alternative label: Transgender Romany
broader: https://homosaurus.org/v3/homoit0000875
change note: Version 3.7.0
has top concept: LGBTQ+ people
in scheme: v3

Romani queer people
type: Concept
issued: 2022-05-11
modified: 2025-02-23
comment: Queer people who are Romani, or part of the traditionally nomadic Indo-European people.
alternative label: Queer Roma
alternative label: Queer Romanis
alternative label: Queer Romany
alternative label: Roma queer people
alternative label: Romany queer people
broader: https://homosaurus.org/v3/homoit0000875
change note: Version 3.7.0
has top concept: LGBTQ+ people
in scheme: v3

Romani intersex people
type: Concept
issued: 2022-05-11
modified: 2025-02-23
comment: Intersex people who are Romani, or part of the traditionally nomadic Indo-European people.
alternative label: Intersex Roma
alternative label: Intersex Romanis
alternative label: Intersex Romany
alternative label: Roma intersex people
alternative label: Romany intersex people
broader: https://homosaurus.org/v3/homoit0000875
change note: Version 3.7.0
has top concept: LGBTQ+ people
in scheme: v3

Kānaka Maoli LGBTQ+ people
type: Concept
issued: 2022-05-11
modified: 2025-02-23
comment: LGBTQ+ people who are part of the Indigenous people of Mokupuni o Hawai‘i, or the Hawaiian Islands; only use to refer to people who identify as Kanaka Maoli.
alternative label: Indigenous Hawaiian LGBTQ+ people
alternative label: Indigenous Hawaiians (LGBTQ)
alternative label: Kānaka Maoli (LGBTQ)
alternative label: Kānaka Maoli people (LGBTQ)
alternative label: LGBTQ+ Indigenous Hawaiians
alternative label: LGBTQ+ Kānaka Maoli
alternative label: LGBTQ+ Kānaka ʻŌiwi
alternative label: LGBTQ+ Native Hawaiians
alternative label: Native Hawaiian LGBTQ+ people
alternative label: Native Hawaiians (LGBTQ)
broader: https://homosaurus.org/v3/homoit0000886
change note: Version 3.7.0
has top concept: LGBTQ+ people
in scheme: v3
narrower: https://homosaurus.org/v3/homoit0001956
narrower: https://homosaurus.org/v3/homoit0001957
narrower: https://homosaurus.org/v3/homoit0001958
narrower: https://homosaurus.org/v3/homoit0001959
narrower: https://homosaurus.org/v3/homoit0001960
narrower: https://homosaurus.org/v3/homoit0001961
narrower: https://homosaurus.org/v3/homoit0002924
narrower: https://homosaurus.org/v3/homoit0003413
related: https://homosaurus.org/v3/homoit0000979

Kānaka Maoli lesbians
type: Concept
issued: 2022-05-11
modified: 2025-02-23
comment: Lesbians who are part of the Indigenous people of Mokupuni o Hawai‘i, or the Hawaiian Islands; only use to refer to people who identify as Kanaka Maoli.
alternative label: Indigenous Hawaiian lesbians
alternative label: Lesbian Indigenous Hawaiians
alternative label: Lesbian Kānaka Maoli
alternative label: Lesbian Kānaka ʻŌiwi
alternative label: Lesbian Native Hawaiians
alternative label: Native Hawaiian lesbians
broader: https://homosaurus.org/v3/homoit0001955
change note: Version 3.7.0
has top concept: LGBTQ+ people
in scheme: v3

Kānaka Maoli gay men
type: Concept
issued: 2022-05-11
modified: 2025-02-23
comment: Gay men who are part of the Indigenous people of Mokupuni o Hawai‘i, or the Hawaiian Islands; only use to refer to people who identify as Kanaka Maoli.
alternative label: Gay Indigenous Hawaiians
alternative label: Gay Kānaka Maoli
alternative label: Gay Kānaka ʻŌiwi
alternative label: Gay Native Hawaiians
alternative label: Indigenous Hawaiian gay men
alternative label: Native Hawaiian gay men
broader: https://homosaurus.org/v3/homoit0001955
change note: Version 3.7.0
has top concept: LGBTQ+ people
in scheme: v3

Kānaka Maoli bisexual people
type: Concept
issued: 2022-05-11
modified: 2025-02-23
comment: Bisexual people who are part of the Indigenous people of Mokupuni o Hawai‘i, or the Hawaiian Islands; only use to refer to people who identify as Kanaka Maoli.
alternative label: Bisexual Indigenous Hawaiians
alternative label: Bisexual Kānaka Maoli
alternative label: Bisexual Kānaka ʻŌiwi
alternative label: Bisexual Native Hawaiians
alternative label: Indigenous Hawaiian bisexual people
alternative label: Native Hawaiian bisexual people
broader: https://homosaurus.org/v3/homoit0001955
change note: Version 3.7.0
has top concept: LGBTQ+ people
in scheme: v3

Kānaka Maoli transgender people
type: Concept
issued: 2022-05-11
modified: 2025-02-23
comment: Transgender people who are part of the Indigenous people of Mokupuni o Hawai‘i, or the Hawaiian Islands; only use to refer to people who identify as Kanaka Maoli and transgender.
alternative label: Indigenous Hawaiian transgender people
alternative label: Native Hawaiian transgender people
alternative label: Transgender Indigenous Hawaiians
alternative label: Transgender Kānaka Maoli
alternative label: Transgender Kānaka ʻŌiwi
alternative label: Transgender Native Hawaiians
broader: https://homosaurus.org/v3/homoit0001955
change note: Version 3.7.0
has top concept: LGBTQ+ people
in scheme: v3
related: https://homosaurus.org/v3/homoit0000979

Kānaka Maoli queer people
type: Concept
issued: 2022-05-11
modified: 2025-02-23
comment: Queer people who are part of the Indigenous people of Mokupuni o Hawai‘i, or the Hawaiian Islands; only use to refer to people who identify as Kanaka Maoli.
alternative label: Indigenous Hawaiian queer people
alternative label: Native Hawaiian queer people
alternative label: Queer Indigenous Hawaiians
alternative label: Queer Kānaka Maoli
alternative label: Queer Kānaka ʻŌiwi
alternative label: Queer Native Hawaiians
broader: https://homosaurus.org/v3/homoit0001955
change note: Version 3.7.0
has top concept: LGBTQ+ people
in scheme: v3

Kānaka Maoli intersex people
type: Concept
issued: 2022-05-11
modified: 2025-02-23
comment: Intersex people who are part of the Indigenous people of Mokupuni o Hawai‘i, or the Hawaiian Islands; only use to refer to people who identify as Kanaka Maoli.
alternative label: Intersex Kānaka ʻŌiwi
alternative label: Indigenous Hawaiian intersex people
alternative label: Intersex Indigenous Hawaiians
alternative label: Intersex Kānaka Maoli
alternative label: Intersex Native Hawaiians
alternative label: Native Hawaiian intersex people
broader: https://homosaurus.org/v3/homoit0001955
broader: https://homosaurus.org/v3/homoit0001973
change note: Version 3.7.0
has top concept: LGBTQ+ people
in scheme: v3
related: https://homosaurus.org/v3/homoit0001942

Inuit lesbians
type: Concept
issued: 2022-05-11
modified: 2025-02-23
comment: Lesbians who are Inuit, or part of several Indigenous peoples inhabiting the Inuit homeland in the Arctic and subarctic regions of Greenland, Canada, and Alaska. Only use for people who identify as Inuit.
alternative label: Lesbian Inuit people
alternative label: Lesbian Inuits
broader: https://homosaurus.org/v3/homoit0000676
change note: Version 3.7.0
has top concept: LGBTQ+ people
in scheme: v3

Inuit gay men
type: Concept
issued: 2022-05-11
modified: 2025-02-23
comment: Gay men who are Inuit, or part of several Indigenous peoples inhabiting the Inuit homeland in the Arctic and subarctic regions of Greenland, Canada, and Alaska. Only use for people who identify as Inuit.
alternative label: Gay Inuit men
alternative label: Gay Inuits
alternative label: Inuit gays
broader: https://homosaurus.org/v3/homoit0000676
change note: Version 3.7.0
has top concept: LGBTQ+ people
in scheme: v3

Inuit bisexual people
type: Concept
issued: 2022-05-11
modified: 2025-02-23
comment: Bisexual people who are Inuit, or part of several Indigenous peoples inhabiting the Inuit homeland in the Arctic and subarctic regions of Greenland, Canada, and Alaska. Only use for people who identify as Inuit.
alternative label: Bisexual Inuit people
alternative label: Bisexual Inuits
broader: https://homosaurus.org/v3/homoit0000676
change note: Version 3.7.0
has top concept: LGBTQ+ people
in scheme: v3

Inuit transgender people
type: Concept
issued: 2022-05-11
modified: 2025-02-23
comment: Transgender people who are Inuit, or part of several Indigenous peoples inhabiting the Inuit homeland in the Arctic and subarctic regions of Greenland, Canada, and Alaska. Only use for people who identify as Inuit.
alternative label: Transgender Inuit people
alternative label: Transgender Inuits
broader: https://homosaurus.org/v3/homoit0000676
change note: Version 3.7.0
has top concept: LGBTQ+ people
in scheme: v3

Inuit queer people
type: Concept
issued: 2022-05-11
modified: 2025-02-23
comment: Queer people who are Inuit, or part of several Indigenous peoples inhabiting the Inuit homeland in the Arctic and subarctic regions of Greenland, Canada, and Alaska. Only use for people who identify as Inuit.
alternative label: Queer Inuit people
alternative label: Queer Inuits
broader: https://homosaurus.org/v3/homoit0000676
change note: Version 3.7.0
has top concept: LGBTQ+ people
in scheme: v3

Inuit intersex people
type: Concept
issued: 2022-05-11
modified: 2025-02-23
comment: Intersex people who are Inuit, or part of several Indigenous peoples inhabiting the Inuit homeland in the Arctic and subarctic regions of Greenland, Canada, and Alaska. Only use for people who identify as Inuit.
alternative label: Intersex Inuit people
alternative label: Intersex Inuits
broader: https://homosaurus.org/v3/homoit0000676
change note: Version 3.7.0
has top concept: LGBTQ+ people
in scheme: v3

Indigenous lesbians
type: Concept
issued: 2022-05-11
modified: 2025-02-23
comment: Lesbians who are part of an Indigenous people, or culturally distinct ethnic group whose members are directly descended from the earliest known inhabitants of a particular region and, to some extent, maintain the language and culture of those people. Only use to describe people who identify as Indigenous; use more specific terms whenever possible.
alternative label: Lesbian Indigenous people
broader: https://homosaurus.org/v3/homoit0000886
change note: Version 3.7.0
has top concept: LGBTQ+ people
in scheme: v3

Indigenous gay men
type: Concept
issued: 2022-05-11
modified: 2025-02-23
comment: Gay men who are part of an Indigenous people, or culturally distinct ethnic group whose members are directly descended from the earliest known inhabitants of a particular region and, to some extent, maintain the language and culture of those people. Only use to describe people who identify as Indigenous; use more specific terms whenever possible.
alternative label: Gay Indigenous men
alternative label: Indigenous gays
broader: https://homosaurus.org/v3/homoit0000886
change note: Version 3.7.0
has top concept: LGBTQ+ people
in scheme: v3

Indigenous bisexual people
type: Concept
issued: 2022-05-11
modified: 2025-02-23
comment: Bisexual people who are part of an Indigenous people, or culturally distinct ethnic group whose members are directly descended from the earliest known inhabitants of a particular region and, to some extent, maintain the language and culture of those people. Only use to describe people who identify as Indigenous; use more specific terms whenever possible.
alternative label: Bisexual Indigenous people
broader: https://homosaurus.org/v3/homoit0000886
change note: Version 3.7.0
has top concept: LGBTQ+ people
in scheme: v3

Indigenous transgender people
type: Concept
issued: 2022-05-11
modified: 2025-02-23
comment: Transgender people who are part of an Indigenous people, or culturally distinct ethnic group whose members are directly descended from the earliest known inhabitants of a particular region and, to some extent, maintain the language and culture of those people. Only use to describe people who identify as Indigenous; use more specific terms whenever possible.
alternative label: Transgender Indigenous people
broader: https://homosaurus.org/v3/homoit0000886
change note: Version 3.7.0
has top concept: LGBTQ+ people
in scheme: v3

Indigenous queer people
type: Concept
issued: 2022-05-11
modified: 2025-02-23
comment: Queer people who are part of an Indigenous people, or culturally distinct ethnic group whose members are directly descended from the earliest known inhabitants of a particular region and, to some extent, maintain the language and culture of those people. Only use to describe people who identify as Indigenous; use more specific terms whenever possible.
alternative label: Queer Indigenous people
broader: https://homosaurus.org/v3/homoit0000886
change note: Version 3.7.0
has top concept: LGBTQ+ people
in scheme: v3

Indigenous intersex people
type: Concept
issued: 2022-05-11
modified: 2025-02-23
comment: Intersex people who are part of an Indigenous people, or culturally distinct ethnic group whose members are directly descended from the earliest known inhabitants of a particular region and, to some extent, maintain the language and culture of those people. Only use to describe people who identify as Indigenous; use more specific terms whenever possible.
alternative label: Intersex Indigenous people
broader: https://homosaurus.org/v3/homoit0000886
change note: Version 3.7.0
has top concept: LGBTQ+ people
in scheme: v3
narrower: https://homosaurus.org/v3/homoit0001942
narrower: https://homosaurus.org/v3/homoit0001961
narrower: https://homosaurus.org/v3/homoit0002964

Aboriginal Australian lesbians
type: Concept
issued: 2022-05-11
modified: 2025-02-23
comment: Lesbians who belong to one or more of the various Indigenous peoples of Australia; do not use to refer to the Indigenous people of the Torres Strait Islands, who are considered ethnically and culturally distinct. Only use to describe people who identify as Aboriginal Australian.
alternative label: Aboriginal lesbians
alternative label: Lesbian aboriginal Australians
broader: https://homosaurus.org/v3/homoit0000002
change note: Version 3.7.0
has top concept: LGBTQ+ people
in scheme: v3

Aboriginal Australian gay men
type: Concept
issued: 2022-05-11
modified: 2025-02-23
comment: Gay men who belong to one or more of the various Indigenous peoples of Australia; do not use to refer to the Indigenous people of the Torres Strait Islands, who are considered ethnically and culturally distinct. Only use to describe people who identify as Aboriginal Australian.
alternative label: Aboriginal gay men
alternative label: Gay Aboriginal Australian men
alternative label: Gay Aboriginal Australians
broader: https://homosaurus.org/v3/homoit0000002
change note: Version 3.7.0
has top concept: LGBTQ+ people
in scheme: v3

Aboriginal Australian bisexual people
type: Concept
issued: 2022-05-11
modified: 2025-02-23
comment: Bisexual people who belong to one or more of the various Indigenous peoples of Australia; do not use to refer to the Indigenous people of the Torres Strait Islands, who are considered ethnically and culturally distinct. Only use to describe people who identify as Aboriginal Australian.
alternative label: Aboriginal bisexual people
alternative label: Bisexual Aboriginal Australian people
alternative label: Bisexual Aboriginal Australians
broader: https://homosaurus.org/v3/homoit0000002
change note: Version 3.7.0
has top concept: LGBTQ+ people
in scheme: v3

Aboriginal Australian transgender people
type: Concept
issued: 2022-05-11
modified: 2025-02-23
comment: Transgender people who belong to one or more of the various Indigenous peoples of Australia; do not use to refer to the Indigenous people of the Torres Strait Islands, who are considered ethnically and culturally distinct. Only use to describe people who identify as Aboriginal Australian.
alternative label: Aboriginal transgender people
alternative label: Transgender Aboriginal Australian people
alternative label: Transgender Aboriginal Australians
broader: https://homosaurus.org/v3/homoit0000002
change note: Version 3.7.0
has top concept: LGBTQ+ people
in scheme: v3

Aboriginal Australian queer people
type: Concept
issued: 2022-05-11
modified: 2025-02-23
comment: Queer people who belong to one or more of the various Indigenous peoples of Australia; do not use to refer to the Indigenous people of the Torres Strait Islands, who are considered ethnically and culturally distinct. Only use to describe people who identify as Aboriginal Australian.
alternative label: Aboriginal queer people
alternative label: Queer Aboriginal Australian people
alternative label: Queer Aboriginal Australians
broader: https://homosaurus.org/v3/homoit0000002
change note: Version 3.7.0
has top concept: LGBTQ+ people
in scheme: v3

Aboriginal Australian intersex people
type: Concept
issued: 2022-05-11
modified: 2025-02-23
comment: Intersex people who belong to one or more of the various Indigenous peoples of Australia; do not use to refer to the Indigenous people of the Torres Strait Islands, who are considered ethnically and culturally distinct. Only use to describe people who identify as Aboriginal Australian.
alternative label: Aboriginal intersex people
alternative label: Intersex Aboriginal Australian people
alternative label: Intersex Aboriginal Australians
broader: https://homosaurus.org/v3/homoit0000002
change note: Version 3.7.0
has top concept: LGBTQ+ people
in scheme: v3

GRID (Gay-Related Immune Deficiency)
type: Concept
issued: 2022-05-11
modified: 2025-02-23
comment: The original name for AIDS, proposed after public health scientists noticed clusters of Kaposi's sarcoma and Pneumocystis pneumonia among gay men in California and New York City. Should only be used in historical contexts.
alternative label: GRID
alternative label: GRIDS
alternative label: Gay Related Immune Deficiency
alternative label: Gay-Related Immune Deficiency
broader: https://homosaurus.org/v3/homoit0000005
broader: https://homosaurus.org/v3/homoit0000878
change note: Version 3.7.0
has top concept: STDs
in scheme: v3
related: https://homosaurus.org/v3/homoit0000686

HAART (Highly Active Antiretroviral Therapy)
type: Concept
issued: 2022-05-11
modified: 2025-02-23
comment: Treatment that involves the use of three or more drugs in combination to treat HIV infection by preventing the virus from making copies of itself in the body; can lessen the damage to the immune system caused by HIV, slow down the development of AIDS, and prevent the transmission of HIV to others.
alternative label: Combination Anti-Retroviral Therapy
alternative label: Combination Antiretroviral Therapy
alternative label: HAART
alternative label: Highly Active Anti-Retroviral Therapy
alternative label: Highly Active Antiretroviral Therapy
alternative label: cART
broader: https://homosaurus.org/v3/homoit0001007
change note: Version 3.7.0
has top concept: Medical care
in scheme: v3
related: https://homosaurus.org/v3/homoit0000005

LGBTQ+ home movies
type: Concept
issued: 2022-05-11
modified: 2025-02-23
comment: Short amateur films or videos created primarily to preserve memories; use in reference to home movies created by or featuring LGBTQ+ people.
alternative label: Home movies (LGBTQ)
alternative label: LGBTQ+ personal films
alternative label: Personal films (LGBTQ)
broader: https://homosaurus.org/v3/homoit0000869
change note: Version 3.7.0
has top concept: Subcultures
in scheme: v3
narrower: https://homosaurus.org/v3/homoit0001983

LGBTQ+ vlogs
type: Concept
issued: 2022-05-11
modified: 2025-02-23
comment: A form of online blogging via short videos about an individual's life; use in reference to vlogs created by LGBTQ+ people or focusing on LGBTQ+ issues.
alternative label: LGBTQ+ video blogs
alternative label: Video blogs (LGBTQ)
alternative label: Vlogs (LGBTQ)
broader: https://homosaurus.org/v3/homoit0000823
broader: https://homosaurus.org/v3/homoit0001982
change note: Version 3.7.0
has top concept: Social media
in scheme: v3
related: https://homosaurus.org/v3/homoit0000946

Nipple
type: Concept
issued: 2022-05-11
modified: 2025-02-23
comment: The small protuberance of a mammary gland.
alternative label: Nipples
broader: https://homosaurus.org/v3/homoit0000401
change note: Version 3.7.0
has top concept: Erogenous body parts
in scheme: v3
related: https://homosaurus.org/v3/homoit0001045
related: https://homosaurus.org/v3/homoit0001046
related: https://homosaurus.org/v3/homoit0003131

Demiromantic people
type: Concept
issued: 2022-05-11
modified: 2025-02-23
comment: Individuals who experience romantic attraction to other people only after forming emotional bonds.
alternative label: Demi-romantic people
broader: https://homosaurus.org/v3/homoit0001829
change note: Version 3.7.0
has top concept: Romantic minorities
in scheme: v3
related: https://homosaurus.org/v3/homoit0000344
related: https://homosaurus.org/v3/homoit0001986

Demiromanticism
type: Concept
issued: 2022-05-11
modified: 2025-02-23
comment: Romantic orientation in which romantic attraction to other people is only experienced after forming emotional bonds.
alternative label: Demi-romantic
alternative label: Demiromantic
broader: https://homosaurus.org/v3/homoit0001828
change note: Version 3.7.0
has top concept: Romantic orientation
in scheme: v3
related: https://homosaurus.org/v3/homoit0000343
related: https://homosaurus.org/v3/homoit0001985

Greyromantic people
type: Concept
issued: 2022-05-11
modified: 2025-02-23
comment: Individuals who experience rare, infrequent, or low-intensity romantic attraction.
alternative label: Gray-romantic people
alternative label: Grayromantic people
alternative label: Grayromantics
alternative label: Grey-romantic people
alternative label: Greyromantics
broader: https://homosaurus.org/v3/homoit0001829
change note: Version 3.7.0
has top concept: Romantic minorities
in scheme: v3
narrower: https://homosaurus.org/v3/homoit0003038
related: https://homosaurus.org/v3/homoit0001627
related: https://homosaurus.org/v3/homoit0001988

Greyromanticism
type: Concept
issued: 2022-05-11
modified: 2025-02-23
comment: An umbrella term for romantic orientations generally characterized by rare, infrequent, or low-intensity romantic attraction.
alternative label: Gray-romantic
alternative label: Grayromantic
alternative label: Grayromanticism
alternative label: Grey-romantic
alternative label: Greyromantic
broader: https://homosaurus.org/v3/homoit0001828
change note: Version 3.7.0
has top concept: Romantic orientation
in scheme: v3
related: https://homosaurus.org/v3/homoit0001626
related: https://homosaurus.org/v3/homoit0001987

LGBTQ+ victims of bullying
type: Concept
issued: 2022-05-11
modified: 2025-02-23
comment: LGBTQ+ people who have experienced bullying due to their gender or sexual identity and may or may not have survived; follow the individual's preference for "victims" or "survivors" whenever possible.
alternative label: Victims of bullying (LGBTQ)
broader: https://homosaurus.org/v3/homoit0000915
change note: Version 3.7.0
has top concept: LGBTQ+ people
in scheme: v3
narrower: https://homosaurus.org/v3/homoit0001990
narrower: https://homosaurus.org/v3/homoit0001991
narrower: https://homosaurus.org/v3/homoit0001992
narrower: https://homosaurus.org/v3/homoit0001993
narrower: https://homosaurus.org/v3/homoit0001994
narrower: https://homosaurus.org/v3/homoit0001995
narrower: https://homosaurus.org/v3/homoit0001996
narrower: https://homosaurus.org/v3/homoit0001998
narrower: https://homosaurus.org/v3/homoit0003474
related: https://homosaurus.org/v3/homoit0000228
related: https://homosaurus.org/v3/homoit0001997
related: https://homosaurus.org/v3/homoit0003487

Lesbian victims of bullying
type: Concept
issued: 2022-05-11
modified: 2025-02-23
comment: Lesbians who have experienced bullying due to their sexual identity and may or may not have survived; follow the individual's preference for "victims" or "survivors" whenever possible.
broader: https://homosaurus.org/v3/homoit0001989
change note: Version 3.7.0
has top concept: LGBTQ+ people
in scheme: v3

Gay victims of bullying
type: Concept
issued: 2022-05-11
modified: 2025-02-23
comment: Gay men who have experienced bullying due to their sexual identity and may or may not have survived; follow the individual's preference for "victims" or "survivors" whenever possible.
broader: https://homosaurus.org/v3/homoit0001989
change note: Version 3.7.0
has top concept: LGBTQ+ people
in scheme: v3

Bisexual victims of bullying
type: Concept
issued: 2022-05-11
modified: 2025-02-23
comment: Bisexual people who have experienced bullying due to their sexual identity and may or may not have survived; follow the individual's preference for "victims" or "survivors" whenever possible.
broader: https://homosaurus.org/v3/homoit0001989
change note: Version 3.7.0
has top concept: LGBTQ+ people
in scheme: v3

Transgender victims of bullying
type: Concept
issued: 2022-05-11
modified: 2025-02-23
comment: Transgender people who have experienced bullying due to their gender identity and may or may not have survived; follow the individual's preference for "victims" or "survivors" whenever possible.
broader: https://homosaurus.org/v3/homoit0001989
change note: Version 3.7.0
has top concept: LGBTQ+ people
in scheme: v3

Queer victims of bullying
type: Concept
issued: 2022-05-11
modified: 2025-02-23
comment: Queer people who have experienced bullying due to their gender or sexual identity and may or may not have survived; follow the individual's preference for "victims" or "survivors" whenever possible.
broader: https://homosaurus.org/v3/homoit0001989
change note: Version 3.7.0
has top concept: LGBTQ+ people
in scheme: v3

Asexual victims of bullying
type: Concept
issued: 2022-05-11
modified: 2025-02-23
comment: Asexual people who have experienced bullying due to their sexual identity and may or may not have survived; follow the individual's preference for "victims" or "survivors" whenever possible.
broader: https://homosaurus.org/v3/homoit0001989
broader: https://homosaurus.org/v3/homoit0003474
change note: Version 3.7.0
has top concept: LGBTQ+ people
in scheme: v3

Intersex victims of bullying
type: Concept
issued: 2022-05-11
modified: 2025-02-23
comment: Intersex people who have experienced bullying directed toward them because they are intersex and may or may not have survived; follow the individual's preference for "victims" or "survivors" whenever possible.
broader: https://homosaurus.org/v3/homoit0001989
change note: Version 3.7.0
has top concept: LGBTQ+ people
in scheme: v3

Two-Spirit victims of bullying
type: Concept
issued: 2022-05-11
modified: 2025-02-23
comment: Two-Spirit people who have experienced bullying due to their gender or sexual identity and may or may not have survived; follow the individual's preference for "victims" or "survivors" whenever possible.
alternative label: 2S victims of bullying
alternative label: Two Spirit victims of bullying
alternative label: Two Spirited victims of bullying
alternative label: Two-Spirited victims of bullying
broader: https://homosaurus.org/v3/homoit0001480
change note: Version 3.7.0
has top concept: Gender
in scheme: v3
narrower: https://homosaurus.org/v3/homoit0003487
narrower: https://homosaurus.org/v3/homoit0002006
related: https://homosaurus.org/v3/homoit0001989
related: https://homosaurus.org/v3/homoit0003748

LGBTQ+ survivors of bullying
type: Concept
issued: 2022-05-11
modified: 2025-02-23
comment: LGBTQ+ people who have experienced and survived bullying due to their gender or sexual identity; follow the individual's preference for "victims" or "survivors" whenever possible.
broader: https://homosaurus.org/v3/homoit0001989
change note: Version 3.7.0
has top concept: LGBTQ+ people
in scheme: v3
narrower: https://homosaurus.org/v3/homoit0001999
narrower: https://homosaurus.org/v3/homoit0002000
narrower: https://homosaurus.org/v3/homoit0002001
narrower: https://homosaurus.org/v3/homoit0002002
narrower: https://homosaurus.org/v3/homoit0002003
narrower: https://homosaurus.org/v3/homoit0002004
narrower: https://homosaurus.org/v3/homoit0002005
narrower: https://homosaurus.org/v3/homoit0003460
related: https://homosaurus.org/v3/homoit0000228
related: https://homosaurus.org/v3/homoit0002006

Lesbian survivors of bullying
type: Concept
issued: 2022-05-11
modified: 2025-02-23
comment: Lesbians who have experienced and survived bullying due to their sexual identity; follow the individual's preference for "victims" or "survivors" whenever possible.
broader: https://homosaurus.org/v3/homoit0001998
change note: Version 3.7.0
has top concept: LGBTQ+ people
in scheme: v3

Gay survivors of bullying
type: Concept
issued: 2022-05-11
modified: 2025-02-23
comment: Gay men who have experienced and survived bullying due to their sexual identity; follow the individual's preference for "victims" or "survivors" whenever possible.
broader: https://homosaurus.org/v3/homoit0001998
change note: Version 3.7.0
has top concept: LGBTQ+ people
in scheme: v3

Bisexual survivors of bullying
type: Concept
issued: 2022-05-11
modified: 2025-02-23
comment: Bisexual people who have experienced and survived bullying due to their sexual identity; follow the individual's preference for "victims" or "survivors" whenever possible.
broader: https://homosaurus.org/v3/homoit0001998
change note: Version 3.7.0
has top concept: LGBTQ+ people
in scheme: v3

Transgender survivors of bullying
type: Concept
issued: 2022-05-11
modified: 2025-02-23
comment: Transgender people who have experienced and survived bullying due to their gender identity; follow the individual's preference for "victims" or "survivors" whenever possible.
broader: https://homosaurus.org/v3/homoit0001998
change note: Version 3.7.0
has top concept: LGBTQ+ people
in scheme: v3

Queer survivors of bullying
type: Concept
issued: 2022-05-11
modified: 2025-02-23
comment: Queer people who have experienced and survived bullying due to their gender or sexual identity; follow the individual's preference for "victims" or "survivors" whenever possible.
broader: https://homosaurus.org/v3/homoit0001998
change note: Version 3.7.0
has top concept: LGBTQ+ people
in scheme: v3

Asexual survivors of bullying
type: Concept
issued: 2022-05-11
modified: 2025-02-23
comment: Asexual people who have experienced and survived bullying due to their sexual identity; follow the individual's preference for "victims" or "survivors" whenever possible.
broader: https://homosaurus.org/v3/homoit0001998
change note: Version 3.7.0
has top concept: LGBTQ+ people
in scheme: v3

Intersex survivors of bullying
type: Concept
issued: 2022-05-11
modified: 2025-02-23
comment: Intersex people who have experienced and survived bullying directed toward them because they are intersex; follow the individual's preference for "victims" or "survivors" whenever possible.
broader: https://homosaurus.org/v3/homoit0001998
change note: Version 3.7.0
has top concept: LGBTQ+ people
in scheme: v3

Two-Spirit survivors of bullying
type: Concept
issued: 2022-05-11
modified: 2025-02-23
comment: Two-Spirit people who have experienced and survived bullying due to their gender or sexual identity; follow the individual's preference for "victims" or "survivors" whenever possible.
alternative label: 2S survivors of bullying
alternative label: Two Spirit survivors of bullying
alternative label: Two Spirited survivors of bullying
alternative label: Two-Spirited survivors of bullying
broader: https://homosaurus.org/v3/homoit0001997
change note: Version 3.7.0
has top concept: Gender
in scheme: v3
narrower: https://homosaurus.org/v3/homoit0003473
related: https://homosaurus.org/v3/homoit0001998

Chicano/a/x LGBTQ+ people
type: Concept
issued: 2022-05-11
modified: 2025-02-23
comment: LGBTQ+ people of Mexican descent born in the United States; only use to describe people who self-identify as Chicano, Chicana, or Chicanx. Do not conflate with Latino/a/x or Hispanic people.
alternative label: Chicana LGBTQ+ people
alternative label: Chicanas (LGBTQ)
alternative label: Chicano LGBTQ+ people
alternative label: Chicanos (LGBTQ)
alternative label: Chicanx LGBTQ+ people
alternative label: Chicanx people (LGBTQ)
alternative label: Chicanxs (LGBTQ)
alternative label: LGBTQ+ Chicanas
alternative label: LGBTQ+ Chicanos
alternative label: LGBTQ+ Chicanx people
alternative label: LGBTQ+ Chicanxs
broader: https://homosaurus.org/v3/homoit0000860
change note: Version 3.7.0
has top concept: LGBTQ+ people
in scheme: v3
narrower: https://homosaurus.org/v3/homoit0002008
narrower: https://homosaurus.org/v3/homoit0002017
narrower: https://homosaurus.org/v3/homoit0002018
narrower: https://homosaurus.org/v3/homoit0002019
narrower: https://homosaurus.org/v3/homoit0002020
narrower: https://homosaurus.org/v3/homoit0002021
narrower: https://homosaurus.org/v3/homoit0003402
narrower: https://homosaurus.org/v3/homoit0003820

Chicano/a/x lesbians
type: Concept
issued: 2022-05-11
modified: 2025-02-23
comment: Lesbians of Mexican descent born in the United States; only use to describe people who self-identify as Chicano, Chicana, or Chicanx. Do not conflate with Latino/a/x or Hispanic people.
alternative label: Chicana lesbians
alternative label: Chicano lesbians
alternative label: Chicanx lesbians
alternative label: LGBTQ+ Chicanas
alternative label: Lesbian Chicanos
alternative label: Lesbian Chicanx people
alternative label: Lesbian Chicanxs
broader: https://homosaurus.org/v3/homoit0002007
change note: Version 3.7.0
has top concept: LGBTQ+ people
in scheme: v3

Arab LGBTQ+ people
type: Concept
issued: 2022-05-11
modified: 2025-02-23
comment: LGBTQ+ people who are from Arab countries and/or are descended from Arab peoples. Do not conflate with Muslim people.
alternative label: Arab people (LGBTQ)
alternative label: Arabs (LGBTQ)
alternative label: LGBTQ+ Arab people
alternative label: LGBTQ+ Arabs
broader: https://homosaurus.org/v3/homoit0000860
broader: https://homosaurus.org/v3/homoit0001101
change note: Version 3.7.0
has top concept: LGBTQ+ people
in scheme: v3
narrower: https://homosaurus.org/v3/homoit0002010
narrower: https://homosaurus.org/v3/homoit0002011
narrower: https://homosaurus.org/v3/homoit0002012
narrower: https://homosaurus.org/v3/homoit0002013
narrower: https://homosaurus.org/v3/homoit0002014
narrower: https://homosaurus.org/v3/homoit0002015
narrower: https://homosaurus.org/v3/homoit0002016
narrower: https://homosaurus.org/v3/homoit0003232
narrower: https://homosaurus.org/v3/homoit0003277
narrower: https://homosaurus.org/v3/homoit0003382
narrower: https://homosaurus.org/v3/homoit0003392

Arab lesbians
type: Concept
issued: 2022-05-11
modified: 2025-02-23
comment: Lesbians from Arab countries and/or are descended from Arab peoples. Do not conflate with Muslim people.
alternative label: Lesbian Arab people
alternative label: Lesbian Arabs
broader: https://homosaurus.org/v3/homoit0002009
change note: Version 3.7.0
has top concept: LGBTQ+ people
in scheme: v3

Arab gay men
type: Concept
issued: 2022-05-11
modified: 2025-02-23
comment: Gay men who are from Arab countries and/or are descended from Arab peoples. Do not conflate with Muslim people.
alternative label: Gay Arab men
alternative label: Gay Arabs
broader: https://homosaurus.org/v3/homoit0002009
change note: Version 3.7.0
has top concept: LGBTQ+ people
in scheme: v3

Arab bisexual people
type: Concept
issued: 2022-05-11
modified: 2025-02-23
comment: Bisexual people who are from Arab countries and/or are descended from Arab peoples. Do not conflate with Muslim people.
alternative label: Bisexual Arab people
alternative label: Bisexual Arabs
broader: https://homosaurus.org/v3/homoit0002009
change note: Version 3.7.0
has top concept: LGBTQ+ people
in scheme: v3

Arab transgender people
type: Concept
issued: 2022-05-11
modified: 2025-02-23
comment: Transgender people who are from Arab countries and/or are descended from Arab peoples. Do not conflate with Muslim people.
alternative label: Transgender Arab people
alternative label: Transgender Arabs
broader: https://homosaurus.org/v3/homoit0002009
change note: Version 3.7.0
has top concept: LGBTQ+ people
in scheme: v3

Arab queer people
type: Concept
issued: 2022-05-11
modified: 2025-02-23
comment: Queer people who are from Arab countries and/or are descended from Arab peoples. Do not conflate with Muslim people.
alternative label: Queer Arab people
alternative label: Queer Arabs
broader: https://homosaurus.org/v3/homoit0002009
change note: Version 3.7.0
has top concept: LGBTQ+ people
in scheme: v3

Arab asexual people
type: Concept
issued: 2022-05-11
modified: 2025-02-23
comment: Asexual people who are from Arab countries and/or are descended from Arab peoples. Do not conflate with Muslim people.
alternative label: Asexual Arab people
alternative label: Asexual Arabs
broader: https://homosaurus.org/v3/homoit0002009
change note: Version 3.7.0
has top concept: LGBTQ+ people
in scheme: v3

Arab intersex people
type: Concept
issued: 2022-05-11
modified: 2025-02-23
comment: Intersex people who are from Arab countries and/or are descended from Arab peoples. Do not conflate with Muslim people.
alternative label: Intersex Arab people
alternative label: Intersex Arabs
broader: https://homosaurus.org/v3/homoit0002009
change note: Version 3.7.0
has top concept: LGBTQ+ people
in scheme: v3

Chicano/a/x gay men
type: Concept
issued: 2022-05-11
modified: 2025-02-23
comment: Gay men of Mexican descent born in the United States; only use to describe people who self-identify as Chicano, Chicana, or Chicanx. Do not conflate with Latino/a/x or Hispanic people.
alternative label: Chicano gay men
alternative label: Chicanx gay men
alternative label: Gay Chicanos
alternative label: Gay Chicanx men
alternative label: Gay Chicanxs
broader: https://homosaurus.org/v3/homoit0002007
change note: Version 3.7.0
has top concept: LGBTQ+ people
in scheme: v3
related: https://homosaurus.org/v3/homoit0000095

Chicano/a/x bisexual people
type: Concept
issued: 2022-05-11
modified: 2025-02-23
comment: Bisexual people of Mexican descent born in the United States; only use to describe people who self-identify as Chicano, Chicana, or Chicanx. Do not conflate with Latino/a/x or Hispanic people.
alternative label: Bisexual Chicanas
alternative label: Bisexual Chicanos
alternative label: Bisexual Chicanx people
alternative label: Bisexual Chicanxs
alternative label: Chicana bisexual people
alternative label: Chicano bisexual people
alternative label: Chicanx bisexual people
broader: https://homosaurus.org/v3/homoit0002007
change note: Version 3.7.0
has top concept: LGBTQ+ people
in scheme: v3

Chicano/a/x transgender people
type: Concept
issued: 2022-05-11
modified: 2025-02-23
comment: Transgender people of Mexican descent born in the United States; only use to describe people who self-identify as Chicano, Chicana, or Chicanx. Do not conflate with Latino/a/x or Hispanic people.
alternative label: Chicana transgender people
alternative label: Chicano transgender people
alternative label: Chicanx transgender people
alternative label: Transgender Chicanas
alternative label: Transgender Chicanos
alternative label: Transgender Chicanx people
alternative label: Transgender Chicanxs
broader: https://homosaurus.org/v3/homoit0002007
change note: Version 3.7.0
has top concept: LGBTQ+ people
in scheme: v3

Chicano/a/x queer people
type: Concept
issued: 2022-05-11
modified: 2025-02-23
comment: Queer people of Mexican descent born in the United States; only use to describe people who self-identify as Chicano, Chicana, or Chicanx. Do not conflate with Latino/a/x or Hispanic people.
alternative label: Chicana queer people
alternative label: Chicano queer people
alternative label: Chicanx queer people
alternative label: Queer Chicanas
alternative label: Queer Chicanos
alternative label: Queer Chicanx people
alternative label: Queer Chicanxs
broader: https://homosaurus.org/v3/homoit0002007
change note: Version 3.7.0
has top concept: LGBTQ+ people
in scheme: v3

Chicano/a/x intersex people
type: Concept
issued: 2022-05-11
modified: 2025-02-23
comment: Intersex people of Mexican descent born in the United States; only use to describe people who self-identify as Chicano, Chicana, or Chicanx. Do not conflate with Latino/a/x or Hispanic people.
alternative label: Chicana intersex people
alternative label: Chicano intersex people
alternative label: Chicanx intersex people
alternative label: Intersex Chicanas
alternative label: Intersex Chicanos
alternative label: Intersex Chicanx people
alternative label: Intersex Chicanxs
broader: https://homosaurus.org/v3/homoit0002007
change note: Version 3.7.0
has top concept: LGBTQ+ people
in scheme: v3

Hispanic LGBTQ+ people
type: Concept
issued: 2022-05-16
modified: 2025-02-23
comment: LGBTQ+ people who are from or descended from Spain or other regions formerly colonized by Spain that are primarily Spanish-speaking. Only use for individuals who self-identify as Hispanic; do not conflate with Latino/a/x or Chicano/a/x.
alternative label: Hispanic people (LGBTQ)
alternative label: LGBTQ+ Hispanic people
alternative label: LGBTQ+ Hispanics
broader: https://homosaurus.org/v3/homoit0000860
change note: Version 3.7.0
has top concept: LGBTQ+ people
in scheme: v3
narrower: https://homosaurus.org/v3/homoit0002023
narrower: https://homosaurus.org/v3/homoit0002024
narrower: https://homosaurus.org/v3/homoit0002025
narrower: https://homosaurus.org/v3/homoit0002026
narrower: https://homosaurus.org/v3/homoit0002027
narrower: https://homosaurus.org/v3/homoit0002028
narrower: https://homosaurus.org/v3/homoit0003818
narrower: https://homosaurus.org/v3/homoit0003819
narrower: https://homosaurus.org/v3/homoit0003827

Hispanic lesbians
type: Concept
issued: 2022-05-16
modified: 2025-02-23
comment: Lesbians who are from or descended from Spain or other regions formerly colonized by Spain that are primarily Spanish-speaking. Only use for individuals who self-identify as Hispanic; do not conflate with Latino/a/x or Chicano/a/x.
alternative label: Lesbian Hispanics
broader: https://homosaurus.org/v3/homoit0002022
change note: Version 3.7.0
has top concept: LGBTQ+ people
in scheme: v3

Hispanic gay men
type: Concept
issued: 2022-05-16
modified: 2025-02-23
comment: Gay men who are from or descended from Spain or other regions formerly colonized by Spain that are primarily Spanish-speaking. Only use for individuals who self-identify as Hispanic; do not conflate with Latino/a/x or Chicano/a/x.
alternative label: Gay Hispanic men
alternative label: Gay Hispanics
broader: https://homosaurus.org/v3/homoit0002022
change note: Version 3.7.0
has top concept: LGBTQ+ people
in scheme: v3

Hispanic bisexual people
type: Concept
issued: 2022-05-16
modified: 2025-02-23
comment: Bisexual people who are from or descended from Spain or other regions formerly colonized by Spain that are primarily Spanish-speaking. Only use for individuals who self-identify as Hispanic; do not conflate with Latino/a/x or Chicano/a/x.
alternative label: Bisexual Hispanic people
alternative label: Bisexual Hispanics
broader: https://homosaurus.org/v3/homoit0002022
change note: Version 3.7.0
has top concept: LGBTQ+ people
in scheme: v3

Hispanic transgender people
type: Concept
issued: 2022-05-16
modified: 2025-02-23
comment: Trans people who are from or descended from Spain or other regions formerly colonized by Spain that are primarily Spanish-speaking. Only use for individuals who self-identify as Hispanic; do not conflate with Latino/a/x or Chicano/a/x.
alternative label: Transgender Hispanic people
alternative label: Transgender Hispanics
broader: https://homosaurus.org/v3/homoit0002022
change note: Version 3.7.0
has top concept: LGBTQ+ people
in scheme: v3

Hispanic queer people
type: Concept
issued: 2022-05-16
modified: 2025-02-23
comment: Queer people who are from or descended from Spain or other regions formerly colonized by Spain that are primarily Spanish-speaking. Only use for individuals who self-identify as Hispanic; do not conflate with Latino/a/x or Chicano/a/x.
alternative label: Queer Hispanic people
alternative label: Queer Hispanics
broader: https://homosaurus.org/v3/homoit0002022
change note: Version 3.7.0
has top concept: LGBTQ+ people
in scheme: v3

Hispanic intersex people
type: Concept
issued: 2022-05-16
modified: 2025-02-23
comment: Intersex people who are from or descended from Spain or other regions formerly colonized by Spain that are primarily Spanish-speaking. Only use for individuals who self-identify as Hispanic; do not conflate with Latino/a/x or Chicano/a/x.
alternative label: Intersex Hispanic people
alternative label: Intersex Hispanics
broader: https://homosaurus.org/v3/homoit0002022
change note: Version 3.7.0
has top concept: LGBTQ+ people
in scheme: v3

LGBTQ+ people in the workplace
type: Concept
issued: 2022-06-15
modified: 2025-02-23
comment: The presence of LGBTQ+ people in the workplace, including acceptance of and issues faced by LGBTQ+ workers.
alternative label: People in the workplace (LGBTQ)
broader: https://homosaurus.org/v3/homoit0001717
change note: Version 3.7.0
has top concept: LGBTQ+ employment
in scheme: v3
narrower: https://homosaurus.org/v3/homoit0002030
narrower: https://homosaurus.org/v3/homoit0002031
narrower: https://homosaurus.org/v3/homoit0002032
narrower: https://homosaurus.org/v3/homoit0002033
narrower: https://homosaurus.org/v3/homoit0002034
narrower: https://homosaurus.org/v3/homoit0002036
narrower: https://homosaurus.org/v3/homoit0002037
related: https://homosaurus.org/v3/homoit0001735
related: https://homosaurus.org/v3/homoit0001741
related: https://homosaurus.org/v3/homoit0002035

Lesbians in the workplace
type: Concept
issued: 2022-06-15
modified: 2025-02-23
comment: The presence of lesbians in the workplace, including acceptance of and issues faced by lesbian workers.
broader: https://homosaurus.org/v3/homoit0002029
change note: Version 3.7.0
has top concept: LGBTQ+ employment
in scheme: v3
related: https://homosaurus.org/v3/homoit0001736
related: https://homosaurus.org/v3/homoit0001742

Gay men in the workplace
type: Concept
issued: 2022-06-15
modified: 2025-02-23
comment: The presence of gay men in the workplace, including acceptance of and issues faced by gay workers.
broader: https://homosaurus.org/v3/homoit0002029
change note: Version 3.7.0
has top concept: LGBTQ+ employment
in scheme: v3
related: https://homosaurus.org/v3/homoit0001737
related: https://homosaurus.org/v3/homoit0001743

Bisexual people in the workplace
type: Concept
issued: 2022-06-15
modified: 2025-02-23
comment: The presence of bisexual people in the workplace, including acceptance of and issues faced by bisexual workers.
broader: https://homosaurus.org/v3/homoit0002029
change note: Version 3.7.0
has top concept: LGBTQ+ employment
in scheme: v3
related: https://homosaurus.org/v3/homoit0001738
related: https://homosaurus.org/v3/homoit0001744

Transgender people in the workplace
type: Concept
issued: 2022-06-15
modified: 2025-02-23
comment: The presence of transgender people in the workplace, including acceptance of and issues faced by transgender workers.
broader: https://homosaurus.org/v3/homoit0002029
change note: Version 3.7.0
has top concept: LGBTQ+ employment
in scheme: v3
related: https://homosaurus.org/v3/homoit0001378
related: https://homosaurus.org/v3/homoit0001739
related: https://homosaurus.org/v3/homoit0001745

Queer people in the workplace
type: Concept
issued: 2022-06-15
modified: 2025-02-23
comment: The presence of queer people in the workplace, including acceptance of and issues faced by queer workers.
broader: https://homosaurus.org/v3/homoit0002029
change note: Version 3.7.0
has top concept: LGBTQ+ employment
in scheme: v3
related: https://homosaurus.org/v3/homoit0001740
related: https://homosaurus.org/v3/homoit0001746

Two-Spirit people in the workplace
type: Concept
issued: 2022-06-15
modified: 2025-02-23
comment: The presence of Two-Spirit people in the workplace, including acceptance of and issues faced by Two-Spirit workers.
broader: https://homosaurus.org/v3/homoit0001480
change note: Version 3.7.0
has top concept: Gender
in scheme: v3
related: https://homosaurus.org/v3/homoit0002029

Intersex people in the workplace
type: Concept
issued: 2022-06-15
modified: 2025-02-23
comment: The presence of intersex people in the workplace, including acceptance of and issues faced by intersex workers.
broader: https://homosaurus.org/v3/homoit0002029
change note: Version 3.7.0
has top concept: LGBTQ+ employment
in scheme: v3

Asexual people in the workplace
type: Concept
issued: 2022-06-15
modified: 2025-02-23
comment: The presence of asexual people in the workplace, including acceptance of and issues faced by asexual workers.
broader: https://homosaurus.org/v3/homoit0002029
change note: Version 3.7.0
has top concept: LGBTQ+ employment
in scheme: v3

Feminist theory
type: Concept
issued: 2022-06-15
modified: 2025-02-23
comment: The extension of feminism into theoretical, fictional, or philosophical discourse, often seeking to understand the nature of gender inequity.
alternative label: Feminist philosophy
alternative label: Theory of feminism
broader: https://homosaurus.org/v3/homoit0001365
change note: Version 3.7.0
has top concept: Theories
in scheme: v3
narrower: https://homosaurus.org/v3/homoit0002040
narrower: https://homosaurus.org/v3/homoit0002041
narrower: https://homosaurus.org/v3/homoit0003444
narrower: https://homosaurus.org/v3/homoit0003706
related: https://homosaurus.org/v3/homoit0000437
related: https://homosaurus.org/v3/homoit0000579
related: https://homosaurus.org/v3/homoit0001210

Female gaze
type: Concept
issued: 2022-06-15
modified: 2025-02-23
comment: A term used to describe the depiction of women in media and the arts as subjects with agency and whose perspective a text may be presented from. Often used in contrast to the male gaze.
broader: https://homosaurus.org/v3/homoit0002039
change note: Version 3.7.0
has top concept: Theories
in scheme: v3
related: https://homosaurus.org/v3/homoit0002042

Male gaze
type: Concept
issued: 2022-06-15
modified: 2025-02-23
comment: A term used to describe the sexualized and objectified depiction of women in media and the arts from the perspective of and for the pleasure of the heterosexual man/male viewer. Originally used solely to describe the heterosexual, cisgender gaze but has since been expanded.
broader: https://homosaurus.org/v3/homoit0002039
change note: Version 3.7.0
has top concept: Theories
in scheme: v3
related: https://homosaurus.org/v3/homoit0002042

Queer gaze
type: Concept
issued: 2022-06-15
modified: 2025-02-23
comment: A term used to describe the ways LGBTQ+ people create and engage with media and art, in contrast to the male gaze, female gaze, or straight gaze.
broader: https://homosaurus.org/v3/homoit0001219
change note: Version 3.7.0
has top concept: Theories
in scheme: v3
related: https://homosaurus.org/v3/homoit0001149
related: https://homosaurus.org/v3/homoit0002040
related: https://homosaurus.org/v3/homoit0002041

Feminine of center
type: Concept
issued: 2022-06-15
modified: 2025-02-23
comment: Term used to describe individuals whose gender expression is more feminine than androgynous. Generally used as a self-descriptor within LGBTQ+ communities.
alternative label: FOC
alternative label: Fem of center
alternative label: Femme of center
broader: https://homosaurus.org/v3/homoit0000389
change note: Version 3.7.0
has top concept: Gender
in scheme: v3
related: https://homosaurus.org/v3/homoit0000440
related: https://homosaurus.org/v3/homoit0001382
related: https://homosaurus.org/v3/homoit0001642
related: https://homosaurus.org/v3/homoit0001652
related: https://homosaurus.org/v3/homoit0002061

South Asian LGBTQ+ people
type: Concept
issued: 2022-06-15
modified: 2025-02-23
comment: LGBTQ+ people who belong to or are descended from the ethnolinguistic groups of South Asia.
alternative label: LGBTQ+ South Asian people
alternative label: LGBTQ+ South Asians
alternative label: South Asian people (LGBTQ)
alternative label: South Asians (LGBTQ)
broader: https://homosaurus.org/v3/homoit0000860
broader: https://homosaurus.org/v3/homoit0001101
change note: Version 3.7.0
has top concept: LGBTQ+ people
in scheme: v3
narrower: https://homosaurus.org/v3/homoit0002045
narrower: https://homosaurus.org/v3/homoit0002046
narrower: https://homosaurus.org/v3/homoit0002047
narrower: https://homosaurus.org/v3/homoit0002048
narrower: https://homosaurus.org/v3/homoit0002049
narrower: https://homosaurus.org/v3/homoit0002050
narrower: https://homosaurus.org/v3/homoit0002051
narrower: https://homosaurus.org/v3/homoit0002052
narrower: https://homosaurus.org/v3/homoit0003426

South Asian lesbians
type: Concept
issued: 2022-06-15
modified: 2025-02-23
comment: Lesbians who belong to or are descended from the ethnolinguistic groups of South Asia.
alternative label: Lesbian South Asian people
alternative label: Lesbian South Asians
broader: https://homosaurus.org/v3/homoit0002044
change note: Version 3.7.0
has top concept: LGBTQ+ people
in scheme: v3

South Asian gay men
type: Concept
issued: 2022-06-15
modified: 2025-02-23
comment: Gay men who belong to or are descended from the ethnolinguistic groups of South Asia.
alternative label: Gay South Asian men
alternative label: Gay South Asians
broader: https://homosaurus.org/v3/homoit0002044
change note: Version 3.7.0
has top concept: LGBTQ+ people
in scheme: v3

South Asian bisexual people
type: Concept
issued: 2022-06-15
modified: 2025-02-23
comment: Bisexual people who belong to or are descended from the ethnolinguistic groups of South Asia.
alternative label: Bisexual South Asian men
alternative label: Bisexual South Asians
broader: https://homosaurus.org/v3/homoit0002044
change note: Version 3.7.0
has top concept: LGBTQ+ people
in scheme: v3

South Asian queer people
type: Concept
issued: 2022-06-15
modified: 2025-02-23
comment: Queer people who belong to or are descended from the ethnolinguistic groups of South Asia.
alternative label: Queer South Asian people
alternative label: Queer South Asians
broader: https://homosaurus.org/v3/homoit0002044
change note: Version 3.7.0
has top concept: LGBTQ+ people
in scheme: v3

South Asian intersex people
type: Concept
issued: 2022-06-15
modified: 2025-02-23
comment: Intersex people who belong to or are descended from the ethnolinguistic groups of South Asia.
alternative label: Intersex South Asian people
alternative label: Intersex South Asians
broader: https://homosaurus.org/v3/homoit0002044
change note: Version 3.7.0
has top concept: LGBTQ+ people
in scheme: v3

South Asian transgender people
type: Concept
issued: 2022-06-15
modified: 2025-02-23
comment: Transgender people who belong to or are descended from the ethnolinguistic groups of South Asia.
alternative label: Transgender South Asian people
alternative label: Transgender South Asians
broader: https://homosaurus.org/v3/homoit0002044
change note: Version 3.7.0
has top concept: LGBTQ+ people
in scheme: v3

South Asian asexual people
type: Concept
issued: 2022-06-15
modified: 2025-02-23
comment: Asexual people who belong to or are descended from the ethnolinguistic groups of South Asia.
alternative label: Asexual South Asian people
alternative label: Asexual South Asians
broader: https://homosaurus.org/v3/homoit0002044
change note: Version 3.7.0
has top concept: LGBTQ+ people
in scheme: v3

Indian LGBTQ+ people
type: Concept
issued: 2022-06-15
modified: 2025-02-23
comment: LGBTQ+ people who were born in India or are of Indian descent. Do not conflate with the Indigenous peoples of the United States.
alternative label: Indian people (LGBTQ)
alternative label: Indians (LGBTQ)
alternative label: LGBTQ+ Indians
broader: https://homosaurus.org/v3/homoit0002044
change note: Version 3.7.0
has top concept: LGBTQ+ people
in scheme: v3
narrower: https://homosaurus.org/v3/homoit0002053
narrower: https://homosaurus.org/v3/homoit0002054
narrower: https://homosaurus.org/v3/homoit0002055
narrower: https://homosaurus.org/v3/homoit0002056
narrower: https://homosaurus.org/v3/homoit0002057
narrower: https://homosaurus.org/v3/homoit0002058
narrower: https://homosaurus.org/v3/homoit0002059

Indian lesbians
type: Concept
issued: 2022-06-15
modified: 2025-02-23
comment: Lesbians who were born in India or are of Indian descent. Do not conflate with the Indigenous peoples of the United States.
alternative label: Lesbian Indians
broader: https://homosaurus.org/v3/homoit0002052
change note: Version 3.7.0
has top concept: LGBTQ+ people
in scheme: v3

Indian gay men
type: Concept
issued: 2022-06-15
modified: 2025-02-23
comment: Gay men who were born in India or are of Indian descent. Do not conflate with the Indigenous peoples of the United States.
alternative label: Gay Indian men
alternative label: Gay Indians
broader: https://homosaurus.org/v3/homoit0002052
change note: Version 3.7.0
has top concept: LGBTQ+ people
in scheme: v3

Indian bisexual people
type: Concept
issued: 2022-06-15
modified: 2025-02-23
comment: Bisexual people who were born in India or are of Indian descent. Do not conflate with the Indigenous peoples of the United States.
alternative label: Bisexual Indian people
alternative label: Bisexual Indians
broader: https://homosaurus.org/v3/homoit0002052
change note: Version 3.7.0
has top concept: LGBTQ+ people
in scheme: v3

Indian queer people
type: Concept
issued: 2022-06-15
modified: 2025-02-23
comment: Queer people who were born in India or are of Indian descent. Do not conflate with the Indigenous peoples of the United States.
alternative label: Queer Indian people
alternative label: Queer Indians
broader: https://homosaurus.org/v3/homoit0002052
change note: Version 3.7.0
has top concept: LGBTQ+ people
in scheme: v3

Indian intersex people
type: Concept
issued: 2022-06-15
modified: 2025-02-23
comment: Intersex people who were born in India or are of Indian descent. Do not conflate with the Indigenous peoples of the United States.
alternative label: Intersex Indian people
alternative label: Intersex Indians
broader: https://homosaurus.org/v3/homoit0002052
change note: Version 3.7.0
has top concept: LGBTQ+ people
in scheme: v3

Indian transgender people
type: Concept
issued: 2022-06-15
modified: 2025-02-23
comment: Transgender people who were born in India or are of Indian descent. Do not conflate with the Indigenous peoples of the United States.
alternative label: Transgender Indian people
alternative label: Transgender Indians
broader: https://homosaurus.org/v3/homoit0002052
change note: Version 3.7.0
has top concept: LGBTQ+ people
in scheme: v3

Indian asexual people
type: Concept
issued: 2022-06-15
modified: 2025-02-23
comment: Asexual people who were born in India or are of Indian descent. Do not conflate with the Indigenous peoples of the United States.
alternative label: Asexual Indian people
alternative label: Asexual Indians
broader: https://homosaurus.org/v3/homoit0002052
change note: Version 3.7.0
has top concept: LGBTQ+ people
in scheme: v3

Assamese LGBTQ+ people
type: Concept
issued: 2022-06-15
modified: 2025-02-23
comment: LGBTQ+ people who are a part of the socio-ethnic Assamese peoples, speak the Assamese language, or reside in the Indian state of Assam. Only use for people who identify as Assamese.
alternative label: Asomiya (LGBTQ)
alternative label: Assamese people (LGBTQ)
alternative label: LGBTQ+ Asomiya
alternative label: LGBTQ+ Assamese people
broader: https://homosaurus.org/v3/homoit0000860
broader: https://homosaurus.org/v3/homoit0001101
change note: Version 3.7.0
has top concept: LGBTQ+ people
in scheme: v3
narrower: https://homosaurus.org/v3/homoit0002063
narrower: https://homosaurus.org/v3/homoit0002064
narrower: https://homosaurus.org/v3/homoit0002065
narrower: https://homosaurus.org/v3/homoit0002066
narrower: https://homosaurus.org/v3/homoit0002067
narrower: https://homosaurus.org/v3/homoit0002068
narrower: https://homosaurus.org/v3/homoit0002069
narrower: https://homosaurus.org/v3/homoit0003394

Masculine of center
type: Concept
issued: 2022-06-27
modified: 2025-02-23
comment: Term used to describe individuals whose gender expression is more masculine than androgynous. Generally used as a self-descriptor within LGBTQ+ communities.
alternative label: MOC
alternative label: Masc of center
broader: https://homosaurus.org/v3/homoit0000995
change note: Version 3.7.0
has top concept: Gender
in scheme: v3
related: https://homosaurus.org/v3/homoit0000215
related: https://homosaurus.org/v3/homoit0000231
related: https://homosaurus.org/v3/homoit0001327
related: https://homosaurus.org/v3/homoit0001374
related: https://homosaurus.org/v3/homoit0001466
related: https://homosaurus.org/v3/homoit0001643
related: https://homosaurus.org/v3/homoit0001653
related: https://homosaurus.org/v3/homoit0002043

LGBTQ+ incest survivors
type: Concept
issued: 2022-06-27
modified: 2025-02-23
comment: LGBTQ+ people who have experienced and survived incest; follow the individual's preference for "victims" or "survivors" whenever possible.
alternative label: Incest survivors (LGBTQ)
alternative label: LGBTQ+ survivors of incest
alternative label: Survivors of incest (LGBTQ)
broader: https://homosaurus.org/v3/homoit0000885
change note: Version 3.7.0
has top concept: LGBTQ+ people
in scheme: v3

Assamese lesbians
type: Concept
issued: 2022-06-27
modified: 2025-02-23
comment: Lesbians who are a part of the socio-ethnic Assamese peoples, speak the Assamese language, or reside in the Indian state of Assam.
alternative label: Lesbian Asomiya
broader: https://homosaurus.org/v3/homoit0002060
change note: Version 3.7.0
has top concept: LGBTQ+ people
in scheme: v3

Assamese gay men
type: Concept
issued: 2022-06-27
modified: 2025-02-23
comment: Gay men who are a part of the socio-ethnic Assamese peoples, speak the Assamese language, or reside in the Indian state of Assam.
alternative label: Assamese gays
alternative label: Gay Asomiya
alternative label: Gay Assamese men
broader: https://homosaurus.org/v3/homoit0002060
change note: Version 3.7.0
has top concept: LGBTQ+ people
in scheme: v3

Assamese bisexual people
type: Concept
issued: 2022-06-27
modified: 2025-02-23
comment: Bisexual people who are a part of the socio-ethnic Assamese peoples, speak the Assamese language, or reside in the Indian state of Assam.
alternative label: Bisexual Asomiya
alternative label: Bisexual Assamese people
broader: https://homosaurus.org/v3/homoit0002060
change note: Version 3.7.0
has top concept: LGBTQ+ people
in scheme: v3

Assamese queer people
type: Concept
issued: 2022-06-27
modified: 2025-02-23
comment: Queer people who are a part of the socio-ethnic Assamese peoples, speak the Assamese language, or reside in the Indian state of Assam.
alternative label: Queer Asomiya
alternative label: Queer Assamese people
broader: https://homosaurus.org/v3/homoit0002060
change note: Version 3.7.0
has top concept: LGBTQ+ people
in scheme: v3

Assamese intersex people
type: Concept
issued: 2022-06-27
modified: 2025-02-23
comment: Intersex people who are a part of the socio-ethnic Assamese peoples, speak the Assamese language, or reside in the Indian state of Assam.
alternative label: Intersex Asomiya
alternative label: Intersex Assamese people
broader: https://homosaurus.org/v3/homoit0002060
change note: Version 3.7.0
has top concept: LGBTQ+ people
in scheme: v3

Assamese transgender people
type: Concept
issued: 2022-06-27
modified: 2025-02-23
comment: Transgender people who are a part of the socio-ethnic Assamese peoples, speak the Assamese language, or reside in the Indian state of Assam.
alternative label: Transgender Asomiya
alternative label: Transgender assamese people
broader: https://homosaurus.org/v3/homoit0002060
change note: Version 3.7.0
has top concept: LGBTQ+ people
in scheme: v3

Assamese asexual people
type: Concept
issued: 2022-06-27
modified: 2025-02-23
comment: Asexual people who are a part of the socio-ethnic Assamese peoples, speak the Assamese language, or reside in the Indian state of Assam.
alternative label: Asexual Asomiya
alternative label: Asexual Assamese people
broader: https://homosaurus.org/v3/homoit0002060
change note: Version 3.7.0
has top concept: LGBTQ+ people
in scheme: v3

Awadhi LGBTQ+ people
type: Concept
issued: 2022-06-27
modified: 2025-02-23
comment: LGBTQ+ people who speak the Awadhi dialect and reside in or are descended from those who resided in the Awadh region of Uttar Pradesh.
alternative label: Awadhi people (LGBTQ)
alternative label: Awadhis (LGBTQ)
alternative label: LGBTQ Awadhis
alternative label: LGBTQ+ Awadhi people
broader: https://homosaurus.org/v3/homoit0000860
broader: https://homosaurus.org/v3/homoit0001101
change note: Version 3.7.0
has top concept: LGBTQ+ people
in scheme: v3
narrower: https://homosaurus.org/v3/homoit0002071
narrower: https://homosaurus.org/v3/homoit0002072
narrower: https://homosaurus.org/v3/homoit0002073
narrower: https://homosaurus.org/v3/homoit0002074
narrower: https://homosaurus.org/v3/homoit0002075
narrower: https://homosaurus.org/v3/homoit0002076
narrower: https://homosaurus.org/v3/homoit0002077
narrower: https://homosaurus.org/v3/homoit0003395

Awadhi lesbians
type: Concept
issued: 2022-06-27
modified: 2025-02-23
comment: Lesbians who speak the Awadhi dialect and reside in or are descended from those who resided in the Awadh region of Uttar Pradesh.
alternative label: Lesbian Awadhis
broader: https://homosaurus.org/v3/homoit0002070
change note: Version 3.7.0
has top concept: LGBTQ+ people
in scheme: v3

Awadhi gay men
type: Concept
issued: 2022-06-27
modified: 2025-02-23
comment: Gay men who speak the Awadhi dialect and reside in or are descended from those who resided in the Awadh region of Uttar Pradesh.
alternative label: Gay Awadhi men
alternative label: Gay Awadhis
broader: https://homosaurus.org/v3/homoit0002070
change note: Version 3.7.0
has top concept: LGBTQ+ people
in scheme: v3

Awadhi bisexual people
type: Concept
issued: 2022-06-27
modified: 2025-02-23
comment: Bisexual people who speak the Awadhi dialect and reside in or are descended from those who resided in the Awadh region of Uttar Pradesh.
alternative label: Bisexual Awadhi people
alternative label: Bisexual Awadhis
broader: https://homosaurus.org/v3/homoit0002070
change note: Version 3.7.0
has top concept: LGBTQ+ people
in scheme: v3

Awadhi queer people
type: Concept
issued: 2022-06-27
modified: 2025-02-23
comment: Queer people who speak the Awadhi dialect and reside in or are descended from those who resided in the Awadh region of Uttar Pradesh.
alternative label: Queer Awadhi people
alternative label: Queer Awadhis
broader: https://homosaurus.org/v3/homoit0002070
change note: Version 3.7.0
has top concept: LGBTQ+ people
in scheme: v3

Awadhi transgender people
type: Concept
issued: 2022-06-27
modified: 2025-02-23
comment: Transgender people who speak the Awadhi dialect and reside in or are descended from those who resided in the Awadh region of Uttar Pradesh.
alternative label: Transgender Awadhi people
alternative label: Transgender Awadhis
broader: https://homosaurus.org/v3/homoit0002070
change note: Version 3.7.0
has top concept: LGBTQ+ people
in scheme: v3

Awadhi intersex people
type: Concept
issued: 2022-06-27
modified: 2025-02-23
comment: Intersex people who speak the Awadhi dialect and reside in or are descended from those who resided in the Awadh region of Uttar Pradesh.
alternative label: Intersex Awadhi people
alternative label: Intersex Awadhis
broader: https://homosaurus.org/v3/homoit0002070
change note: Version 3.7.0
has top concept: LGBTQ+ people
in scheme: v3

Awadhi asexual people
type: Concept
issued: 2022-06-27
modified: 2025-02-23
comment: Asexual people who speak the Awadhi dialect and reside in or are descended from those who resided in the Awadh region of Uttar Pradesh.
alternative label: Asexual Awadhi people
alternative label: Asexual Awadhis
broader: https://homosaurus.org/v3/homoit0002070
change note: Version 3.7.0
has top concept: LGBTQ+ people
in scheme: v3

Bhojpuri LGBTQ+ people
type: Concept
issued: 2022-06-27
modified: 2025-02-23
comment: LGBTQ+ people who speak the Bhojpuri language and live in or are descended from those who inhabited the Bhojpuri-Purvanchal region of India and Nepal.
alternative label: Bhojpuri people (LGBTQ)
alternative label: Bhojpuriyas (LGBTQ)
alternative label: LGBTQ+ Bhojpuri people
alternative label: LGBTQ+ Bhojpuriyas
broader: https://homosaurus.org/v3/homoit0000860
broader: https://homosaurus.org/v3/homoit0001101
change note: Version 3.7.0
has top concept: LGBTQ+ people
in scheme: v3
narrower: https://homosaurus.org/v3/homoit0002079
narrower: https://homosaurus.org/v3/homoit0002080
narrower: https://homosaurus.org/v3/homoit0002081
narrower: https://homosaurus.org/v3/homoit0002082
narrower: https://homosaurus.org/v3/homoit0002083
narrower: https://homosaurus.org/v3/homoit0002084
narrower: https://homosaurus.org/v3/homoit0002085
narrower: https://homosaurus.org/v3/homoit0003398

Bhojpuri lesbians
type: Concept
issued: 2022-06-27
modified: 2025-02-23
comment: Lesbians who speak the Bhojpuri language and live in or are descended from those who inhabited the Bhojpuri-Purvanchal region of India and Nepal.
alternative label: Lesbian Bhojpuriyas
broader: https://homosaurus.org/v3/homoit0002078
change note: Version 3.7.0
has top concept: LGBTQ+ people
in scheme: v3

Bhojpuri gay men
type: Concept
issued: 2022-06-27
modified: 2025-02-23
comment: Gay men who speak the Bhojpuri language and live in or are descended from those who inhabited the Bhojpuri-Purvanchal region of India and Nepal.
alternative label: Gay Bhojpuri people
alternative label: Gay Bhojpuriyas
broader: https://homosaurus.org/v3/homoit0002078
change note: Version 3.7.0
has top concept: LGBTQ+ people
in scheme: v3

Bhojpuri bisexual people
type: Concept
issued: 2022-06-27
modified: 2025-02-23
comment: Bisexual people who speak the Bhojpuri language and live in or are descended from those who inhabited the Bhojpuri-Purvanchal region of India and Nepal.
alternative label: Bisexual Bhojpuri people
alternative label: Bisexual Bhojpuriyas
broader: https://homosaurus.org/v3/homoit0002078
change note: Version 3.7.0
has top concept: LGBTQ+ people
in scheme: v3

Bhojpuri queer people
type: Concept
issued: 2022-06-27
modified: 2025-02-23
comment: Queer people who speak the Bhojpuri language and live in or are descended from those who inhabited the Bhojpuri-Purvanchal region of India and Nepal.
alternative label: Queer Bhojpuri people
alternative label: Queer Bhojpuriyas
broader: https://homosaurus.org/v3/homoit0002078
change note: Version 3.7.0
has top concept: LGBTQ+ people
in scheme: v3

Bhojpuri transgender people
type: Concept
issued: 2022-06-27
modified: 2025-02-23
comment: Transgender people who speak the Bhojpuri language and live in or are descended from those who inhabited the Bhojpuri-Purvanchal region of India and Nepal.
alternative label: Transgender Bhojpuri people
alternative label: Transgender Bhojpuriyas
broader: https://homosaurus.org/v3/homoit0002078
change note: Version 3.7.0
has top concept: LGBTQ+ people
in scheme: v3

Bhojpuri intersex people
type: Concept
issued: 2022-06-27
modified: 2025-02-23
comment: Intersex people who speak the Bhojpuri language and live in or are descended from those who inhabited the Bhojpuri-Purvanchal region of India and Nepal.
alternative label: Intersex Bhojpuri people
alternative label: Intersex Bhojpuriyas
broader: https://homosaurus.org/v3/homoit0002078
change note: Version 3.7.0
has top concept: LGBTQ+ people
in scheme: v3

Bhojpuri asexual people
type: Concept
issued: 2022-06-27
modified: 2025-02-23
comment: Asexual people who speak the Bhojpuri language and live in or are descended from those who inhabited the Bhojpuri-Purvanchal region of India and Nepal.
alternative label: Asexual Bhojpuri people
alternative label: Asexual Bhojpuriyas
broader: https://homosaurus.org/v3/homoit0002078
change note: Version 3.7.0
has top concept: LGBTQ+ people
in scheme: v3

Bengali LGBTQ+ people
type: Concept
issued: 2022-06-27
modified: 2025-02-23
comment: LGBTQ+ people who speak the Bengali language or are of Bengali descent.
alternative label: Bengali people (LGBTQ)
alternative label: Bengalis (LGBTQ)
alternative label: LGBTQ+ Bengali people
alternative label: LGBTQ+ Bengalis
broader: https://homosaurus.org/v3/homoit0000860
broader: https://homosaurus.org/v3/homoit0001101
change note: Version 3.7.0
has top concept: LGBTQ+ people
in scheme: v3
narrower: https://homosaurus.org/v3/homoit0002087
narrower: https://homosaurus.org/v3/homoit0002088
narrower: https://homosaurus.org/v3/homoit0002089
narrower: https://homosaurus.org/v3/homoit0002090
narrower: https://homosaurus.org/v3/homoit0002091
narrower: https://homosaurus.org/v3/homoit0002092
narrower: https://homosaurus.org/v3/homoit0002093
narrower: https://homosaurus.org/v3/homoit0003396

Bengali lesbians
type: Concept
issued: 2022-06-27
modified: 2025-02-23
comment: Lesbians who speak the Bengali language or are of Bengali descent.
alternative label: Lesbian Bengalis
broader: https://homosaurus.org/v3/homoit0002086
change note: Version 3.7.0
has top concept: LGBTQ+ people
in scheme: v3

Bengali gay men
type: Concept
issued: 2022-06-27
modified: 2025-02-23
comment: Gay men who speak the Bengali language or are of Bengali descent.
alternative label: Gay Bengali people
alternative label: Gay Bengalis
broader: https://homosaurus.org/v3/homoit0002086
change note: Version 3.7.0
has top concept: LGBTQ+ people
in scheme: v3

Bengali bisexual people
type: Concept
issued: 2022-06-27
modified: 2025-02-23
comment: Bisexual people who speak the Bengali language or are of Bengali descent.
alternative label: Bisexual Bengali people
alternative label: Bisexual Bengalis
broader: https://homosaurus.org/v3/homoit0002086
change note: Version 3.7.0
has top concept: LGBTQ+ people
in scheme: v3

Bengali queer people
type: Concept
issued: 2022-06-27
modified: 2025-02-23
comment: Queer people who speak the Bengali language or are of Bengali descent.
alternative label: Queer Bengali people
alternative label: Queer Bengalis
broader: https://homosaurus.org/v3/homoit0002086
change note: Version 3.7.0
has top concept: LGBTQ+ people
in scheme: v3

Bengali transgender people
type: Concept
issued: 2022-06-27
modified: 2025-02-23
comment: Transgender people who speak the Bengali language or are of Bengali descent.
alternative label: Transgender Bengali people
alternative label: Transgender Bengalis
broader: https://homosaurus.org/v3/homoit0002086
change note: Version 3.7.0
has top concept: LGBTQ+ people
in scheme: v3

Bengali intersex people
type: Concept
issued: 2022-06-27
modified: 2025-02-23
comment: Intersex people who speak the Bengali language or are of Bengali descent.
alternative label: Intersex Bengali people
alternative label: Intersex Bengalis
broader: https://homosaurus.org/v3/homoit0002086
change note: Version 3.7.0
has top concept: LGBTQ+ people
in scheme: v3

Bengali asexual people
type: Concept
issued: 2022-06-27
modified: 2025-02-23
comment: Asexual people who speak the Bengali language or are of Bengali descent.
alternative label: Asexual Bengali people
alternative label: Asexual Bengalis
broader: https://homosaurus.org/v3/homoit0002086
change note: Version 3.7.0
has top concept: LGBTQ+ people
in scheme: v3

Bhil LGBTQ+ people
type: Concept
issued: 2022-06-27
modified: 2025-02-23
comment: LGBTQ+ people who speak the Bhil language and belong to or are descended from the Bhil tribal group.
alternative label: Bheel LGBTQ+ people
alternative label: Bheel people (LGBTQ)
alternative label: Bhil people (LGBTQ)
alternative label: LGBTQ+ Bhil people
alternative label: LGBTQ+ Bhils
broader: https://homosaurus.org/v3/homoit0000860
broader: https://homosaurus.org/v3/homoit0001101
change note: Version 3.7.0
has top concept: LGBTQ+ people
in scheme: v3
narrower: https://homosaurus.org/v3/homoit0002095
narrower: https://homosaurus.org/v3/homoit0002096
narrower: https://homosaurus.org/v3/homoit0002098
narrower: https://homosaurus.org/v3/homoit0002099
narrower: https://homosaurus.org/v3/homoit0002100
narrower: https://homosaurus.org/v3/homoit0002101
narrower: https://homosaurus.org/v3/homoit0003397
narrower: https://homosaurus.org/v3/homoit0002097

Bhil lesbians
type: Concept
issued: 2022-06-27
modified: 2025-02-23
comment: Lesbians who speak the Bhil language and belong to or are descended from the Bhil tribal group.
alternative label: Bheel lesbians
alternative label: Lesbian Bhils
broader: https://homosaurus.org/v3/homoit0002094
change note: Version 3.7.0
has top concept: LGBTQ+ people
in scheme: v3

Bhil gay men
type: Concept
issued: 2022-06-27
modified: 2025-02-23
comment: Gay men who speak the Bhil language and belong to or are descended from the Bhil tribal group.
alternative label: Bheel gay men
alternative label: Gay Bhil people
alternative label: Gay Bhils
broader: https://homosaurus.org/v3/homoit0002094
change note: Version 3.7.0
has top concept: LGBTQ+ people
in scheme: v3

Bhil bisexual people
type: Concept
issued: 2022-06-27
modified: 2025-02-23
comment: Bisexual people who speak the Bhil language and belong to or are descended from the Bhil tribal group.
alternative label: Bheel bisexual people
alternative label: Bisexual Bhil people
alternative label: Bisexual Bhils
broader: https://homosaurus.org/v3/homoit0002094
change note: Version 3.7.0
has top concept: LGBTQ+ people
in scheme: v3

Bhil queer people
type: Concept
issued: 2022-06-27
modified: 2025-02-23
comment: Queer people who speak the Bhil language and belong to or are descended from the Bhil tribal group.
broader: https://homosaurus.org/v3/homoit0002094
change note: Version 3.7.0
has top concept: LGBTQ+ people
in scheme: v3
preferred label: Bheel queer people
preferred label: Queer Bhil people
preferred label: Queer Bhils

Bhil transgender people
type: Concept
issued: 2022-06-27
modified: 2025-02-23
comment: Transgender people who speak the Bhil language and belong to or are descended from the Bhil tribal group.
alternative label: Bheel transgender people
alternative label: Transgender Bhil people
alternative label: Transgender Bhils
broader: https://homosaurus.org/v3/homoit0002094
change note: Version 3.7.0
has top concept: LGBTQ+ people
in scheme: v3

Bhil intersex people
type: Concept
issued: 2022-06-27
modified: 2025-02-23
comment: Intersex people who speak the Bhil language and belong to or are descended from the Bhil tribal group.
alternative label: Bheel intersex people
alternative label: Intersex Bhil people
alternative label: Intersex Bhils
broader: https://homosaurus.org/v3/homoit0002094
change note: Version 3.7.0
has top concept: LGBTQ+ people
in scheme: v3

Bhil asexual people
type: Concept
issued: 2022-06-27
modified: 2025-02-23
comment: Asexual people who speak the Bhil language and belong to or are descended from the Bhil tribal group.
alternative label: Asexual Bhil people
alternative label: Asexual Bhils
alternative label: Bheel asexual people
broader: https://homosaurus.org/v3/homoit0002094
change note: Version 3.7.0
has top concept: LGBTQ+ people
in scheme: v3

Chakma LGBTQ+ people
type: Concept
issued: 2022-06-27
modified: 2025-02-23
comment: LGBTQ+ people who belong to or are descended from the Chakma tribal group.
alternative label: Chakma people (LGBTQ)
alternative label: LGBTQ+ Chakma people
broader: https://homosaurus.org/v3/homoit0000860
broader: https://homosaurus.org/v3/homoit0001101
change note: Version 3.7.0
has top concept: LGBTQ+ people
in scheme: v3
narrower: https://homosaurus.org/v3/homoit0002103
narrower: https://homosaurus.org/v3/homoit0002104
narrower: https://homosaurus.org/v3/homoit0002105
narrower: https://homosaurus.org/v3/homoit0002106
narrower: https://homosaurus.org/v3/homoit0002107
narrower: https://homosaurus.org/v3/homoit0002108
narrower: https://homosaurus.org/v3/homoit0002109
narrower: https://homosaurus.org/v3/homoit0003401

Chakma lesbians
type: Concept
issued: 2022-06-27
modified: 2025-02-23
comment: Lesbians who belong to or are descended from the Chakma tribal group.
broader: https://homosaurus.org/v3/homoit0002102
change note: Version 3.7.0
has top concept: LGBTQ+ people
in scheme: v3

Chakma gay men
type: Concept
issued: 2022-06-27
modified: 2025-02-23
comment: Gay men who belong to or are descended from the Chakma tribal group.
alternative label: Gay Chakma people
broader: https://homosaurus.org/v3/homoit0002102
change note: Version 3.7.0
has top concept: LGBTQ+ people
in scheme: v3

Chakma bisexual people
type: Concept
issued: 2022-06-27
modified: 2025-02-23
comment: Bisexual people who belong to or are descended from the Chakma tribal group.
alternative label: Bisexual Chakma people
broader: https://homosaurus.org/v3/homoit0002102
change note: Version 3.7.0
has top concept: LGBTQ+ people
in scheme: v3

Chakma queer people
type: Concept
issued: 2022-06-27
modified: 2025-02-23
comment: Queer people who belong to or are descended from the Chakma tribal group.
alternative label: Queer Chakma people
broader: https://homosaurus.org/v3/homoit0002102
change note: Version 3.7.0
has top concept: LGBTQ+ people
in scheme: v3

Chakma intersex people
type: Concept
issued: 2022-06-27
modified: 2025-02-23
comment: Intersex people who belong to or are descended from the Chakma tribal group.
alternative label: Intersex Chakma people
broader: https://homosaurus.org/v3/homoit0002102
change note: Version 3.7.0
has top concept: LGBTQ+ people
in scheme: v3

Chakma transgender people
type: Concept
issued: 2022-06-27
modified: 2025-02-23
comment: Transgender people who belong to or are descended from the Chakma tribal group.
alternative label: Transgender Chakma people
broader: https://homosaurus.org/v3/homoit0002102
change note: Version 3.7.0
has top concept: LGBTQ+ people
in scheme: v3

Chakma asexual people
type: Concept
issued: 2022-06-27
modified: 2025-02-23
comment: Asexual people who belong to or are descended from the Chakma tribal group.
alternative label: Asexual Chakma people
broader: https://homosaurus.org/v3/homoit0002102
change note: Version 3.7.0
has top concept: LGBTQ+ people
in scheme: v3

Kho LGBTQ+ people
type: Concept
issued: 2022-06-27
modified: 2025-02-23
comment: LGBTQ+ people who belong to or are descended from the people indigenous to the Chitral and Ghizer districts of modern-day Pakistan.
alternative label: Chitrali LGBTQ+ people
alternative label: Chitrali people (LGBTQ)
alternative label: Kho people (LGBTQ)
alternative label: LGBTQ+ Kho people
broader: https://homosaurus.org/v3/homoit0000860
broader: https://homosaurus.org/v3/homoit0001101
change note: Version 3.7.0
has top concept: LGBTQ+ people
in scheme: v3
narrower: https://homosaurus.org/v3/homoit0002111
narrower: https://homosaurus.org/v3/homoit0002112
narrower: https://homosaurus.org/v3/homoit0002113
narrower: https://homosaurus.org/v3/homoit0002114
narrower: https://homosaurus.org/v3/homoit0002115
narrower: https://homosaurus.org/v3/homoit0002116
narrower: https://homosaurus.org/v3/homoit0002117
narrower: https://homosaurus.org/v3/homoit0003415

Kho lesbians
type: Concept
issued: 2022-06-27
modified: 2025-02-23
comment: Lesbians who belong to or are descended from the people indigenous to the Chitral and Ghizer districts of modern-day Pakistan.
alternative label: Chitrali lesbians
broader: https://homosaurus.org/v3/homoit0002110
change note: Version 3.7.0
has top concept: LGBTQ+ people
in scheme: v3

Kho gay men
type: Concept
issued: 2022-06-27
modified: 2025-02-23
comment: Gay men who belong to or are descended from the people indigenous to the Chitral and Ghizer districts of modern-day Pakistan.
alternative label: Chitrali gay men
alternative label: Gay Chitrali men
alternative label: Gay Kho men
broader: https://homosaurus.org/v3/homoit0002110
change note: Version 3.7.0
has top concept: LGBTQ+ people
in scheme: v3

Kho bisexual people
type: Concept
issued: 2022-06-27
modified: 2025-02-23
comment: Bisexual individuals who belong to or are descended from the people indigenous to the Chitral and Ghizer districts of modern-day Pakistan.
alternative label: Bisexual Chitrali people
alternative label: Bisexual Kho people
alternative label: Chitrali bisexual people
broader: https://homosaurus.org/v3/homoit0002110
change note: Version 3.7.0
has top concept: LGBTQ+ people
in scheme: v3

Kho transgender people
type: Concept
issued: 2022-06-27
modified: 2025-02-23
comment: Transgender individuals who belong to or are descended from the people indigenous to the Chitral and Ghizer districts of modern-day Pakistan.
alternative label: Chitrali transgender people
alternative label: Transgender Chitrali people
alternative label: Transgender Kho people
broader: https://homosaurus.org/v3/homoit0002110
change note: Version 3.7.0
has top concept: LGBTQ+ people
in scheme: v3

Kho queer people
type: Concept
issued: 2022-06-27
modified: 2025-02-23
comment: Queer individuals who belong to or are descended from the people indigenous to the Chitral and Ghizer districts of modern-day Pakistan.
alternative label: Chitrali queer people
alternative label: Queer Chitrali people
alternative label: Queer Kho people
broader: https://homosaurus.org/v3/homoit0002110
change note: Version 3.7.0
has top concept: LGBTQ+ people
in scheme: v3

Kho intersex people
type: Concept
issued: 2022-06-27
modified: 2025-02-23
comment: Intersex individuals who belong to or are descended from the people indigenous to the Chitral and Ghizer districts of modern-day Pakistan.
alternative label: Chitrali intersex people
alternative label: Intersex Chitrali people
alternative label: Intersex Kho people
broader: https://homosaurus.org/v3/homoit0002110
change note: Version 3.7.0
has top concept: LGBTQ+ people
in scheme: v3

Kho asexual people
type: Concept
issued: 2022-06-27
modified: 2025-02-23
comment: Asexual individuals who belong to or are descended from the people indigenous to the Chitral and Ghizer districts of modern-day Pakistan.
alternative label: Asexual Chitrali people
alternative label: Asexual Kho people
alternative label: Chitrali asexual people
broader: https://homosaurus.org/v3/homoit0002110
change note: Version 3.7.0
has top concept: LGBTQ+ people
in scheme: v3

Maldivian LGBTQ+ people
type: Concept
issued: 2022-06-27
modified: 2025-02-23
comment: LGBTQ+ people who belong to or are descended from the people native to the Maldives (including the island of Minicoy) and speak the Maldivian language.
alternative label: Dhivehin LGBTQ+ people
alternative label: Dhivehin people (LGBTQ)
alternative label: LGBTQ+ Maldivians
alternative label: Maldivian people (LGBTQ)
broader: https://homosaurus.org/v3/homoit0000860
broader: https://homosaurus.org/v3/homoit0001101
change note: Version 3.7.0
has top concept: LGBTQ+ people
in scheme: v3
narrower: https://homosaurus.org/v3/homoit0002119
narrower: https://homosaurus.org/v3/homoit0002120
narrower: https://homosaurus.org/v3/homoit0002121
narrower: https://homosaurus.org/v3/homoit0002122
narrower: https://homosaurus.org/v3/homoit0002123
narrower: https://homosaurus.org/v3/homoit0002124
narrower: https://homosaurus.org/v3/homoit0002125
narrower: https://homosaurus.org/v3/homoit0003420

Maldivian lesbians
type: Concept
issued: 2022-06-27
modified: 2025-02-23
comment: Lesbians who belong to or are descended from the people native to the Maldives (including the island of Minicoy) and speak the Maldivian language.
alternative label: Dhivehin lesbians
alternative label: Lesbian Maldivians
broader: https://homosaurus.org/v3/homoit0002118
change note: Version 3.7.0
has top concept: LGBTQ+ people
in scheme: v3

Maldivian gay men
type: Concept
issued: 2022-06-27
modified: 2025-02-23
comment: Gay men who belong to or are descended from the people native to the Maldives (including the island of Minicoy) and speak the Maldivian language.
alternative label: Dhivehin gay men
alternative label: Gay Dhivehin people
alternative label: Gay Maldivian men
alternative label: Gay Maldivians
broader: https://homosaurus.org/v3/homoit0002118
change note: Version 3.7.0
has top concept: LGBTQ+ people
in scheme: v3

Maldivian bisexual people
type: Concept
issued: 2022-06-27
modified: 2025-02-23
comment: Bisexual individuals who belong to or are descended from the people native to the Maldives (including the island of Minicoy) and speak the Maldivian language.
alternative label: Bisexual Dhivehin people
alternative label: Bisexual Maldivian people
alternative label: Bisexual Maldivians
alternative label: Dhivehin bisexual people
broader: https://homosaurus.org/v3/homoit0002118
change note: Version 3.7.0
has top concept: LGBTQ+ people
in scheme: v3

Maldivian queer people
type: Concept
issued: 2022-06-27
modified: 2025-02-23
comment: Queer individuals who belong to or are descended from the people native to the Maldives (including the island of Minicoy) and speak the Maldivian language.
alternative label: Dhivehin queer people
alternative label: Queer Dhivehin people
alternative label: Queer Maldivian people
alternative label: Queer Maldivians
broader: https://homosaurus.org/v3/homoit0002118
change note: Version 3.7.0
has top concept: LGBTQ+ people
in scheme: v3

Maldivian transgender people
type: Concept
issued: 2022-06-27
modified: 2025-02-23
comment: Transgender individuals who belong to or are descended from the people native to the Maldives (including the island of Minicoy) and speak the Maldivian language.
alternative label: Dhivehin transgender people
alternative label: Transgender Dhivehin people
alternative label: Transgender Maldivian people
alternative label: Transgender Maldivians
broader: https://homosaurus.org/v3/homoit0002118
change note: Version 3.7.0
has top concept: LGBTQ+ people
in scheme: v3

Maldivian intersex people
type: Concept
issued: 2022-06-27
modified: 2025-02-23
comment: Intersex individuals who belong to or are descended from the people native to the Maldives (including the island of Minicoy) and speak the Maldivian language.
alternative label: Dhivehin intersex people
alternative label: Intersex Dhivehin people
alternative label: Intersex Maldivians
broader: https://homosaurus.org/v3/homoit0002118
change note: Version 3.7.0
has top concept: LGBTQ+ people
in scheme: v3

Maldivian asexual people
type: Concept
issued: 2022-06-27
modified: 2025-02-23
comment: Asexual individuals who belong to or are descended from the people native to the Maldives (including the island of Minicoy) and speak the Maldivian language.
alternative label: Asexual Dhivehin people
alternative label: Asexual Maldivian people
alternative label: Asexual Maldivians
alternative label: Dhivehin asexual people
broader: https://homosaurus.org/v3/homoit0002118
change note: Version 3.7.0
has top concept: LGBTQ+ people
in scheme: v3

Dogra LGBTQ+ people
type: Concept
issued: 2022-06-27
modified: 2025-02-23
comment: LGBTQ+ people who are of the Dogra people of India and Pakistan and speak the Dogri language.
alternative label: Dogra people (LGBTQ)
alternative label: Dogras (LGBTQ)
alternative label: LGBTQ+ Dogra people
alternative label: LGBTQ+ Dogras
broader: https://homosaurus.org/v3/homoit0000860
broader: https://homosaurus.org/v3/homoit0001101
change note: Version 3.7.0
has top concept: LGBTQ+ people
in scheme: v3
narrower: https://homosaurus.org/v3/homoit0002127
narrower: https://homosaurus.org/v3/homoit0002128
narrower: https://homosaurus.org/v3/homoit0002129
narrower: https://homosaurus.org/v3/homoit0002130
narrower: https://homosaurus.org/v3/homoit0002131
narrower: https://homosaurus.org/v3/homoit0002132
narrower: https://homosaurus.org/v3/homoit0002133
narrower: https://homosaurus.org/v3/homoit0003405

Dogra lesbians
type: Concept
issued: 2022-06-27
modified: 2025-02-23
comment: Lesbians who are of the Dogra people of India and Pakistan and speak the Dogri language.
alternative label: Lesbian Dogras
broader: https://homosaurus.org/v3/homoit0002126
change note: Version 3.7.0
has top concept: LGBTQ+ people
in scheme: v3

Dogra gay men
type: Concept
issued: 2022-06-27
modified: 2025-02-23
comment: Gay men who are of the Dogra people of India and Pakistan and speak the Dogri language.
alternative label: Gay Dogra men
alternative label: Gay Dogras
broader: https://homosaurus.org/v3/homoit0002126
change note: Version 3.7.0
has top concept: LGBTQ+ people
in scheme: v3

Dogra bisexual people
type: Concept
issued: 2022-06-27
modified: 2025-02-23
comment: Bisexual people who are of the Dogra people of India and Pakistan and speak the Dogri language.
alternative label: Bisexual Dogra people
alternative label: Bisexual Dogras
broader: https://homosaurus.org/v3/homoit0002126
change note: Version 3.7.0
has top concept: LGBTQ+ people
in scheme: v3

Dogra queer people
type: Concept
issued: 2022-06-27
modified: 2025-02-23
comment: Queer people who are of the Dogra people of India and Pakistan and speak the Dogri language.
alternative label: Queer Dogra people
alternative label: Queer Dogras
broader: https://homosaurus.org/v3/homoit0002126
change note: Version 3.7.0
has top concept: LGBTQ+ people
in scheme: v3

Dogra transgender people
type: Concept
issued: 2022-06-27
modified: 2025-02-23
comment: Transgender people who are of the Dogra people of India and Pakistan and speak the Dogri language.
alternative label: Transgender Dogra people
alternative label: Transgender Dogras
broader: https://homosaurus.org/v3/homoit0002126
change note: Version 3.7.0
has top concept: LGBTQ+ people
in scheme: v3

Dogra intersex people
type: Concept
issued: 2022-06-27
modified: 2025-02-23
comment: Intersex people who are of the Dogra people of India and Pakistan and speak the Dogri language.
alternative label: Intersex Dogra people
alternative label: Intersex Dogras
broader: https://homosaurus.org/v3/homoit0002126
change note: Version 3.7.0
has top concept: LGBTQ+ people
in scheme: v3

Dogra asexual people
type: Concept
issued: 2022-06-27
modified: 2025-02-23
comment: Asexual people who are of the Dogra people of India and Pakistan and speak the Dogri language.
alternative label: Asexual Dogra people
alternative label: Asexual Dogras
broader: https://homosaurus.org/v3/homoit0002126
change note: Version 3.7.0
has top concept: LGBTQ+ people
in scheme: v3

Garhwali LGBTQ+ people
type: Concept
issued: 2022-06-27
modified: 2025-02-23
comment: LGBTQ+ people who belong to or are descended from those native to Garhwal in Uttarakhand and who speak Garhwali.
alternative label: Garhwali people (LGBTQ)
alternative label: Garhwalis (LGBTQ)
alternative label: LGBTQ+ Garhwali people
alternative label: LGBTQ+ Garhwalis
broader: https://homosaurus.org/v3/homoit0000860
broader: https://homosaurus.org/v3/homoit0001101
change note: Version 3.7.0
has top concept: LGBTQ+ people
in scheme: v3
narrower: https://homosaurus.org/v3/homoit0002135
narrower: https://homosaurus.org/v3/homoit0002136
narrower: https://homosaurus.org/v3/homoit0002137
narrower: https://homosaurus.org/v3/homoit0002138
narrower: https://homosaurus.org/v3/homoit0002139
narrower: https://homosaurus.org/v3/homoit0002140
narrower: https://homosaurus.org/v3/homoit0002141
narrower: https://homosaurus.org/v3/homoit0003407

Garhwali lesbians
type: Concept
issued: 2022-06-27
modified: 2025-02-23
comment: Lesbians who belong to or are descended from the people native to Garhwal in Uttarakhand and who speak Garhwali.
alternative label: Lesbian Garhwalis
broader: https://homosaurus.org/v3/homoit0002134
change note: Version 3.7.0
has top concept: LGBTQ+ people
in scheme: v3

Garhwali gay men
type: Concept
issued: 2022-06-27
modified: 2025-02-23
comment: Gay men who belong to or are descended from the people native to Garhwal in Uttarakhand and who speak Garhwali.
alternative label: Gay Garhwali men
alternative label: Gay Garhwalis
broader: https://homosaurus.org/v3/homoit0002134
change note: Version 3.7.0
has top concept: LGBTQ+ people
in scheme: v3

Garhwali bisexual people
type: Concept
issued: 2022-06-27
modified: 2025-02-23
comment: Bisexual people who belong to or are descended from the people native to Garhwal in Uttarakhand and who speak Garhwali.
alternative label: Bisexual Garhwali people
alternative label: Bisexual Garhwalis
broader: https://homosaurus.org/v3/homoit0002134
change note: Version 3.7.0
has top concept: LGBTQ+ people
in scheme: v3

Garhwali queer people
type: Concept
issued: 2022-06-27
modified: 2025-02-23
comment: Queer people who belong to or are descended from the people native to Garhwal in Uttarakhand and who speak Garhwali.
alternative label: Queer Garhwali people
alternative label: Queer Garhwalis
broader: https://homosaurus.org/v3/homoit0002134
change note: Version 3.7.0
has top concept: LGBTQ+ people
in scheme: v3

Garhwali transgender people
type: Concept
issued: 2022-06-27
modified: 2025-02-23
comment: Transgender people who belong to or are descended from the people native to Garhwal in Uttarakhand and who speak Garhwali.
alternative label: Transgender Garhwali people
alternative label: Transgender Garhwalis
broader: https://homosaurus.org/v3/homoit0002134
change note: Version 3.7.0
has top concept: LGBTQ+ people
in scheme: v3

Garhwali intersex people
type: Concept
issued: 2022-06-27
modified: 2025-02-23
comment: Intersex people who belong to or are descended from those native to Garhwal in Uttarakhand and who speak Garhwali.
alternative label: Intersex Garhwali people
alternative label: Intersex Garhwalis
broader: https://homosaurus.org/v3/homoit0002134
change note: Version 3.7.0
has top concept: LGBTQ+ people
in scheme: v3

Garhwali asexual people
type: Concept
issued: 2022-06-27
modified: 2025-02-23
comment: Asexual people who belong to or are descended from those native to Garhwal in Uttarakhand and who speak Garhwali.
alternative label: Asexual Garhwali people
alternative label: Asexual Garhwalis
broader: https://homosaurus.org/v3/homoit0002134
change note: Version 3.7.0
has top concept: LGBTQ+ people
in scheme: v3

Actorfic
type: Concept
issued: 2022-07-04
modified: 2025-02-23
comment: Fanfiction that focuses on, incorporates, or details the relationships of real-life actors, often of the same sex or gender.
alternative label: Actor fanfic
alternative label: Actor fic
broader: https://homosaurus.org/v3/homoit0002196
change note: Version 3.7.0
has top concept: Subcultures
in scheme: v3
related: https://homosaurus.org/v3/homoit0000008
related: https://homosaurus.org/v3/homoit0000869
related: https://homosaurus.org/v3/homoit0001806

Alternate universe settings (Fanfiction)
type: Concept
issued: 2022-07-04
modified: 2025-02-23
comment: Settings alternative to the canonical universe of a text in which fanfiction might take place.
alternative label: AU (Fanfiction)
broader: https://homosaurus.org/v3/homoit0002160
change note: Version 3.7.0
has top concept: Subcultures
in scheme: v3
narrower: https://homosaurus.org/v3/homoit0002186
related: https://homosaurus.org/v3/homoit0002210

Anime and manga fandom
type: Concept
issued: 2022-07-04
modified: 2025-02-23
comment: The fan community that focuses on, incorporates, or details the relationships of characters derived from anime or manga.
alternative label: Anime and manga fan community
alternative label: Anime fandom
alternative label: Manga and anime fandom
alternative label: Manga fandom
broader: https://homosaurus.org/v3/homoit0002156
change note: Version 3.7.0
has top concept: Subcultures
in scheme: v3
narrower: https://homosaurus.org/v3/homoit0002149
narrower: https://homosaurus.org/v3/homoit0002151
narrower: https://homosaurus.org/v3/homoit0002152
narrower: https://homosaurus.org/v3/homoit0002173
narrower: https://homosaurus.org/v3/homoit0002221
narrower: https://homosaurus.org/v3/homoit0003507
related: https://homosaurus.org/v3/homoit0000828
related: https://homosaurus.org/v3/homoit0000897

Aromantic people in fandom
type: Concept
issued: 2022-07-04
modified: 2025-02-23
comment: The participation and inclusion of aromantic people in fan communities.
alternative label: Aromantics in fandom
broader: https://homosaurus.org/v3/homoit0002181
change note: Version 3.7.0
has top concept: LGBTQ+ people
in scheme: v3
related: https://homosaurus.org/v3/homoit0000067
related: https://homosaurus.org/v3/homoit0001748
related: https://homosaurus.org/v3/homoit0001753

Asexual people in fandom
type: Concept
issued: 2022-07-04
modified: 2025-02-23
comment: The participation and inclusion of asexual people in fan communities.
alternative label: Asexuals in fandom
broader: https://homosaurus.org/v3/homoit0002181
change note: Version 3.7.0
has top concept: LGBTQ+ people
in scheme: v3
related: https://homosaurus.org/v3/homoit0000071
related: https://homosaurus.org/v3/homoit0001747
related: https://homosaurus.org/v3/homoit0001754

Bandslash
type: Concept
issued: 2022-07-04
modified: 2025-02-23
comment: Fanfiction that focuses on, incorporates, or details the romantic or sexual relationships between same-gender or same-sex musicians who exist in the real world, usually men.
alternative label: Band slash
broader: https://homosaurus.org/v3/homoit0002196
change note: Version 3.7.0
has top concept: Subcultures
in scheme: v3
related: https://homosaurus.org/v3/homoit0000908
related: https://homosaurus.org/v3/homoit0001806

Bara
type: Concept
issued: 2022-07-04
modified: 2025-02-23
comment: A genre of Japanese art created primarily by gay men for other gay men that emphasizes masculinity, muscles, body fat, and hair (similar to Bears and Gym subculture in the United States).
broader: https://homosaurus.org/v3/homoit0002149
change note: Version 3.7.0
has top concept: Subcultures
in scheme: v3
related: https://homosaurus.org/v3/homoit0000105
related: https://homosaurus.org/v3/homoit0000978
related: https://homosaurus.org/v3/homoit0001654

Bara fandom
type: Concept
issued: 2022-07-04
modified: 2025-02-23
comment: The fan community that focuses on, incorporates, or details the relationships of characters from bara manga and anime.
broader: https://homosaurus.org/v3/homoit0002144
change note: Version 3.7.0
has top concept: Subcultures
in scheme: v3
narrower: https://homosaurus.org/v3/homoit0002148
related: https://homosaurus.org/v3/homoit0000105
related: https://homosaurus.org/v3/homoit0000978
related: https://homosaurus.org/v3/homoit0001654
related: https://homosaurus.org/v3/homoit0002170

Bisexual people in fandom
type: Concept
issued: 2022-07-04
modified: 2025-02-23
comment: The participation and inclusion of bisexual people in fan communities.
alternative label: Bisexuals in fandom
broader: https://homosaurus.org/v3/homoit0002181
change note: Version 3.7.0
has top concept: LGBTQ+ people
in scheme: v3
related: https://homosaurus.org/v3/homoit0000151
related: https://homosaurus.org/v3/homoit0000170
related: https://homosaurus.org/v3/homoit0001726
related: https://homosaurus.org/v3/homoit0001754
related: https://homosaurus.org/v3/homoit0002506
related: https://homosaurus.org/v3/homoit0002535

Bishounen
type: Concept
issued: 2022-07-04
modified: 2025-02-23
comment: Japanese word that means "beautiful boy" and is used to describe a particular aesthetic of androgynous male beauty. While in Japanese "bishounen" refers specifically to youths under the age of twenty and "biseinen" is used to describe beautiful adult men, English-speaking anime and manga fan communities often use "bishounen" in reference to any good-looking male character, regardless of age.
broader: https://homosaurus.org/v3/homoit0002144
change note: Version 3.7.0
has top concept: Subcultures
in scheme: v3
related: https://homosaurus.org/v3/homoit0001520
related: https://homosaurus.org/v3/homoit0002152
related: https://homosaurus.org/v3/homoit0002197
related: https://homosaurus.org/v3/homoit0002214

Boys' Love (Genre)
type: Concept
issued: 2022-07-04
modified: 2025-02-23
comment: The manga and anime genre of fictional male-male romance created for a primarily female audience; sometimes used interchangeably with "Yaoi" in English (but not in Japanese).
alternative label: BL
alternative label: Boys Love
broader: https://homosaurus.org/v3/homoit0002144
change note: Version 3.7.0
has top concept: Subcultures
in scheme: v3
narrower: https://homosaurus.org/v3/homoit0002218
narrower: https://homosaurus.org/v3/homoit0003500
related: https://homosaurus.org/v3/homoit0000557

Bury your gays
type: Concept
issued: 2022-07-04
modified: 2025-02-23
comment: The trope in fiction that requires that LGBTQ+ characters die or meet some other type of unhappy ending. The trope is also known as "dead lesbian syndrome" due to the tendency for lesbian characters and bisexual female characters to be the targets. Transgender characters have also often been subjected to this trope.
alternative label: Dead lesbian syndrome
broader: https://homosaurus.org/v3/homoit0002160
change note: Version 3.7.0
has top concept: Subcultures
in scheme: v3
related: https://homosaurus.org/v3/homoit0000443

Fanart
type: Concept
issued: 2022-07-04
modified: 2025-02-23
comment: Art created by fans that relates to media properties or other subjects of fandom.
alternative label: Fan art
broader: https://homosaurus.org/v3/homoit0002161
change note: Version 3.7.0
has top concept: Subcultures
in scheme: v3
narrower: https://homosaurus.org/v3/homoit0002201
related: https://homosaurus.org/v3/homoit0002159
related: https://homosaurus.org/v3/homoit0002204

Fandom
type: Concept
issued: 2022-07-04
modified: 2025-02-23
comment: Communities of people who are fans of a particular work or media property. Participation in fandom can include writing and reading fanfiction, creating and viewing fanart, attending conventions, cosplaying, and/or roleplaying.
broader: https://homosaurus.org/v3/homoit0001345
change note: Version 3.7.0
has top concept: Subcultures
in scheme: v3
narrower: https://homosaurus.org/v3/homoit0002144
narrower: https://homosaurus.org/v3/homoit0002157
narrower: https://homosaurus.org/v3/homoit0002158
narrower: https://homosaurus.org/v3/homoit0002161
narrower: https://homosaurus.org/v3/homoit0002167
narrower: https://homosaurus.org/v3/homoit0002171
narrower: https://homosaurus.org/v3/homoit0002181
narrower: https://homosaurus.org/v3/homoit0002190
narrower: https://homosaurus.org/v3/homoit0002194
narrower: https://homosaurus.org/v3/homoit0002199
narrower: https://homosaurus.org/v3/homoit0002203

Fandom conventions
type: Concept
issued: 2022-07-04
modified: 2025-02-23
comment: Conventions dedicated to a particular fandom or fandom as a broad category.
alternative label: Fan cons
alternative label: Fan conventions
alternative label: Fandom cons
broader: https://homosaurus.org/v3/homoit0002156
change note: Version 3.7.0
has top concept: Subcultures
in scheme: v3
narrower: https://homosaurus.org/v3/homoit0002166
narrower: https://homosaurus.org/v3/homoit0002202
related: https://homosaurus.org/v3/homoit0000861
related: https://homosaurus.org/v3/homoit0000900

Fandom terminology
type: Concept
issued: 2022-07-04
modified: 2025-02-23
comment: Jargon or slang commonly used in fan communities, such as "slash" and "shipping."
alternative label: Fan terminology
alternative label: Fan terms
alternative label: Fandom terms
broader: https://homosaurus.org/v3/homoit0002156
change note: Version 3.7.0
has top concept: Subcultures
in scheme: v3
narrower: https://homosaurus.org/v3/homoit0002208
related: https://homosaurus.org/v3/homoit0001317

Fanfiction
type: Concept
issued: 2022-07-04
modified: 2025-02-23
comment: Written works of fiction created by fans that use the characters, settings, and/or plots of other media properties in a transformative way.
alternative label: Fan fic
alternative label: Fan fiction
alternative label: Fanfic
broader: https://homosaurus.org/v3/homoit0002161
change note: Version 3.7.0
has top concept: Subcultures
in scheme: v3
narrower: https://homosaurus.org/v3/homoit0002160
narrower: https://homosaurus.org/v3/homoit0002179
narrower: https://homosaurus.org/v3/homoit0002205
narrower: https://homosaurus.org/v3/homoit0002210
related: https://homosaurus.org/v3/homoit0000443
related: https://homosaurus.org/v3/homoit0002155

Fanfiction tropes and genres
type: Concept
issued: 2022-07-04
modified: 2025-02-23
comment: Tropes and genres commonly used in fanfiction. Examples include "there was only one bed" and "enemies to lovers" romance plots.
alternative label: Fanfic tropes and genres
broader: https://homosaurus.org/v3/homoit0002159
change note: Version 3.7.0
has top concept: Subcultures
in scheme: v3
narrower: https://homosaurus.org/v3/homoit0002143
narrower: https://homosaurus.org/v3/homoit0002153
narrower: https://homosaurus.org/v3/homoit0002176
related: https://homosaurus.org/v3/homoit0000576
related: https://homosaurus.org/v3/homoit0002187

Fanworks
type: Concept
issued: 2022-07-04
modified: 2025-02-23
comment: Works, such as fanfiction or fanart, created by fans using characters, settings, and/or plots of other media properties.
alternative label: Fan works
broader: https://homosaurus.org/v3/homoit0002156
change note: Version 3.7.0
has top concept: Subcultures
in scheme: v3
narrower: https://homosaurus.org/v3/homoit0001807
narrower: https://homosaurus.org/v3/homoit0002155
narrower: https://homosaurus.org/v3/homoit0002159
narrower: https://homosaurus.org/v3/homoit0002204

Femslash
type: Concept
issued: 2022-07-04
modified: 2025-02-23
comment: A genre of fanworks in which two or more women are placed in a sexual or romantic situation with one another. Works of femslash are commonly erotic or pornographic. In recognition of the fact that the term "slash" has recently been broadened to include LGBTQ+ relationships other than those between two men, slash terms (e.g., Slash art, Slash roleplay, Slash vidding) should be used to describe specific types of femslash.
alternative label: Altfic
alternative label: F/F slash
alternative label: Femmeslash
alternative label: Girlslash
alternative label: Ladyslash
broader: https://homosaurus.org/v3/homoit0002200
change note: Version 3.7.0
has top concept: Subcultures
in scheme: v3
narrower: https://homosaurus.org/v3/homoit0000742
narrower: https://homosaurus.org/v3/homoit0001597
related: https://homosaurus.org/v3/homoit0000576
related: https://homosaurus.org/v3/homoit0002220
related: https://homosaurus.org/v3/homoit0002221

Fujoshi
type: Concept
issued: 2022-07-04
modified: 2025-02-23
comment: Japanese word that literally translates to "rotten girl" and is used to describe young women who enjoy media or fanworks focused on romantic or sexual relationships between men. Some fans self-identify as fujoshis, typically as a form of playful self-deprecation, but it can also be considered derogatory.
broader: https://homosaurus.org/v3/homoit0002218
change note: Version 3.7.0
has top concept: Subcultures
in scheme: v3

Furries
type: Concept
issued: 2022-07-04
modified: 2025-02-23
comment: Individuals who are interested in anthropomorphized animals, as well as fiction and artwork featuring anthropomorphized animals. Many furries identify with anthropomorphized animal versions of themselves, which are called fursonas.
broader: https://homosaurus.org/v3/homoit0002167
change note: Version 3.7.0
has top concept: Subcultures
in scheme: v3
narrower: https://homosaurus.org/v3/homoit0002168
narrower: https://homosaurus.org/v3/homoit0002169
narrower: https://homosaurus.org/v3/homoit0002219
related: https://homosaurus.org/v3/homoit0001241
related: https://homosaurus.org/v3/homoit0001242
related: https://homosaurus.org/v3/homoit0003082
related: https://homosaurus.org/v3/homoit0003123

Furry conventions
type: Concept
issued: 2022-07-04
modified: 2025-02-23
comment: Conventions for furries that focus on furry fanworks.
alternative label: Furry cons
broader: https://homosaurus.org/v3/homoit0002157
broader: https://homosaurus.org/v3/homoit0002167
change note: Version 3.7.0
has top concept: Subcultures
in scheme: v3
related: https://homosaurus.org/v3/homoit0000861
related: https://homosaurus.org/v3/homoit0000900

Furry fandom
type: Concept
issued: 2022-07-04
modified: 2025-02-23
comment: The fan community that focuses on, incorporates, or details anthropomorphized animals.
alternative label: Furry community
alternative label: Furry fan community
broader: https://homosaurus.org/v3/homoit0002156
change note: Version 3.7.0
has top concept: Subcultures
in scheme: v3
narrower: https://homosaurus.org/v3/homoit0002165
narrower: https://homosaurus.org/v3/homoit0002166

Fursonas
type: Concept
issued: 2022-07-04
modified: 2025-02-23
comment: Anthropomorphized animal versions of people. Fursonas, which are created by members of the furry fandom, are not necessarily animals with fur; they can also be reptiles, birds, or fictional animals, for example.
broader: https://homosaurus.org/v3/homoit0002165
change note: Version 3.7.0
has top concept: Subcultures
in scheme: v3
related: https://homosaurus.org/v3/homoit0001241

Fursuits
type: Concept
issued: 2022-07-04
modified: 2025-02-23
comment: Costumes worn by furries that represent their fursonas (i.e., anthropomorphized animal versions of themselves).
broader: https://homosaurus.org/v3/homoit0002165
change note: Version 3.7.0
has top concept: Subcultures
in scheme: v3
related: https://homosaurus.org/v3/homoit0000289
related: https://homosaurus.org/v3/homoit0001241
related: https://homosaurus.org/v3/homoit0001242
related: https://homosaurus.org/v3/homoit0001808

Gay men in fandom
type: Concept
issued: 2022-07-04
modified: 2025-02-23
comment: The participation and inclusion of gay men in fan communities.
broader: https://homosaurus.org/v3/homoit0002181
broader: https://homosaurus.org/v3/homoit0002182
change note: Version 3.7.0
has top concept: LGBTQ+ people
in scheme: v3
related: https://homosaurus.org/v3/homoit0000493
related: https://homosaurus.org/v3/homoit0000506
related: https://homosaurus.org/v3/homoit0001725
related: https://homosaurus.org/v3/homoit0002149

Gender in fandom
type: Concept
issued: 2022-07-04
modified: 2025-02-23
comment: Issues and discussions about gender in fan spaces and works.
broader: https://homosaurus.org/v3/homoit0002156
change note: Version 3.7.0
has top concept: Subcultures
in scheme: v3
narrower: https://homosaurus.org/v3/homoit0002174
narrower: https://homosaurus.org/v3/homoit0002175
narrower: https://homosaurus.org/v3/homoit0002182
narrower: https://homosaurus.org/v3/homoit0002183
narrower: https://homosaurus.org/v3/homoit0002185
narrower: https://homosaurus.org/v3/homoit0002211
narrower: https://homosaurus.org/v3/homoit0002212
narrower: https://homosaurus.org/v3/homoit0002213
narrower: https://homosaurus.org/v3/homoit0002216
related: https://homosaurus.org/v3/homoit0000576

Hentai
type: Concept
issued: 2022-07-04
modified: 2025-02-23
comment: A genre of anime and manga characterized by explicit sexual content; can also include hentai video games.
broader: https://homosaurus.org/v3/homoit0001128
broader: https://homosaurus.org/v3/homoit0002173
change note: Version 3.7.0
has top concept: Sex industry
in scheme: v3
related: https://homosaurus.org/v3/homoit0000828
related: https://homosaurus.org/v3/homoit0000859
related: https://homosaurus.org/v3/homoit0000897
related: https://homosaurus.org/v3/homoit0002217

Hentai fandom
type: Concept
issued: 2022-07-04
modified: 2025-02-23
comment: The fan community that focuses on, incorporates, or details the relationships of characters in hentai, or sexually explicit anime and manga.
broader: https://homosaurus.org/v3/homoit0002144
change note: Version 3.7.0
has top concept: Subcultures
in scheme: v3
narrower: https://homosaurus.org/v3/homoit0002172

Homophobia in fandom
type: Concept
issued: 2022-07-04
modified: 2025-02-23
comment: Issues and discussions about the presence of homophobia in fan spaces and works.
broader: https://homosaurus.org/v3/homoit0000646
broader: https://homosaurus.org/v3/homoit0002171
change note: Version 3.7.0
has top concept: LGBTQ+ phobia
in scheme: v3
related: https://homosaurus.org/v3/homoit0002181
related: https://homosaurus.org/v3/homoit0002194

Intersex people in fandom
type: Concept
issued: 2022-07-04
modified: 2025-02-23
comment: The participation and inclusion of intersex people in fan communities.
broader: https://homosaurus.org/v3/homoit0002171
broader: https://homosaurus.org/v3/homoit0002181
change note: Version 3.7.0
has top concept: Subcultures
in scheme: v3
narrower: https://homosaurus.org/v3/homoit0001752

Kink in fandom
type: Concept
issued: 2022-07-04
modified: 2025-02-23
comment: Representations of non-conventional or marginalized sexual practices in fanfiction.
alternative label: Kink in fan communities
broader: https://homosaurus.org/v3/homoit0002160
change note: Version 3.7.0
has top concept: Subcultures
in scheme: v3
related: https://homosaurus.org/v3/homoit0002181
related: https://homosaurus.org/v3/homoit0002186

Kirk/Spock
type: Concept
issued: 2022-07-04
modified: 2025-02-23
comment: The homoerotic fan pairing of Kirk and Spock from Star Trek: The Original Series. The Kirk/Spock fandom originated much of the terminology and practices associated with fandom today--for example, the word "slash" comes from the forward slash in Kirk/Spock.
alternative label: K/S
alternative label: Spirk
broader: https://homosaurus.org/v3/homoit0002198
change note: Version 3.7.0
has top concept: Subcultures
in scheme: v3
related: https://homosaurus.org/v3/homoit0000934
related: https://homosaurus.org/v3/homoit0001806
related: https://homosaurus.org/v3/homoit0002187

Lesbians in fandom
type: Concept
issued: 2022-07-04
modified: 2025-02-23
comment: The participation and inclusion of lesbians in fan communities.
alternative label: Lesbians in fan communities
broader: https://homosaurus.org/v3/homoit0002181
change note: Version 3.7.0
has top concept: LGBTQ+ people
in scheme: v3
related: https://homosaurus.org/v3/homoit0000556
related: https://homosaurus.org/v3/homoit0000742
related: https://homosaurus.org/v3/homoit0001724

LGBTQ+ fanfiction
type: Concept
issued: 2022-07-04
modified: 2025-02-23
comment: Fanfiction that primarily focuses on LGBTQ+ people, communities, and relationships, often using characters who are not stated to be LGBTQ+ in canon.
alternative label: Fan fic (LGBTQ)
alternative label: Fan fics (LGBTQ)
alternative label: Fan fiction (LGBTQ)
alternative label: Fanfiction (LGBTQ)
alternative label: LGBTQ+ fan fics
alternative label: LGBTQ+ fan fiction
alternative label: LGBTQ+ fanfics
broader: https://homosaurus.org/v3/homoit0002159
change note: Version 3.7.0
has top concept: Subcultures
in scheme: v3
related: https://homosaurus.org/v3/homoit0000443
related: https://homosaurus.org/v3/homoit0001522
related: https://homosaurus.org/v3/homoit0001723

LGBTQ+ headcanons
type: Concept
issued: 2022-07-04
modified: 2025-02-23
comment: Fans' personal interpretations of media properties and texts, particularly relating to the personalities and behaviors of characters. Use to describe headcanons that certain characters or relationships are LGBTQ+, as well as headcanons about other LGBTQ+ people and issues in the universe of the text.
alternative label: Headcanons (LGBTQ)
broader: https://homosaurus.org/v3/homoit0001149
change note: Version 3.7.0
has top concept: Queer (Verb)
in scheme: v3
related: https://homosaurus.org/v3/homoit0000443
related: https://homosaurus.org/v3/homoit0002199

LGBTQ+ people in fandom
type: Concept
issued: 2022-07-04
modified: 2025-02-23
comment: The participation and inclusion of LGBTQ+ people in fan communities.
alternative label: LGBTQ+ people in fan communities
alternative label: People in fandom (LGBTQ)
broader: https://homosaurus.org/v3/homoit0000915
broader: https://homosaurus.org/v3/homoit0002156
change note: Version 3.7.0
has top concept: LGBTQ+ people
in scheme: v3
narrower: https://homosaurus.org/v3/homoit0002145
narrower: https://homosaurus.org/v3/homoit0002146
narrower: https://homosaurus.org/v3/homoit0002150
narrower: https://homosaurus.org/v3/homoit0002170
narrower: https://homosaurus.org/v3/homoit0002175
narrower: https://homosaurus.org/v3/homoit0002178
narrower: https://homosaurus.org/v3/homoit0002185
narrower: https://homosaurus.org/v3/homoit0002193
narrower: https://homosaurus.org/v3/homoit0002211
related: https://homosaurus.org/v3/homoit0002174
related: https://homosaurus.org/v3/homoit0002176
related: https://homosaurus.org/v3/homoit0002212
related: https://homosaurus.org/v3/homoit0002213

Men in fandom
type: Concept
issued: 2022-07-04
modified: 2025-02-23
comment: The participation and inclusion of men in fan communities.
broader: https://homosaurus.org/v3/homoit0002171
change note: Version 3.7.0
has top concept: Subcultures
in scheme: v3
narrower: https://homosaurus.org/v3/homoit0002170
related: https://homosaurus.org/v3/homoit0001008

Misogyny in fandom
type: Concept
issued: 2022-07-04
modified: 2025-02-23
comment: Issues and discussions about the presence of misogyny in fan spaces and works.
alternative label: Sexism in fandom
broader: https://homosaurus.org/v3/homoit0001017
broader: https://homosaurus.org/v3/homoit0002171
change note: Version 3.7.0
has top concept: Misogyny
in scheme: v3
related: https://homosaurus.org/v3/homoit0001278
related: https://homosaurus.org/v3/homoit0002194

Mpreg
type: Concept
issued: 2022-07-04
modified: 2025-02-23
comment: The fandom trope in which cisgender men can become pregnant. This term should not be used to describe pregnant trans men.
alternative label: M-preg
broader: https://homosaurus.org/v3/homoit0002186
change note: Version 3.7.0
has top concept: Subcultures
in scheme: v3
related: https://homosaurus.org/v3/homoit0000576
related: https://homosaurus.org/v3/homoit0000859

Non-binary people in fandom
type: Concept
issued: 2022-07-04
modified: 2025-02-23
comment: The participation and inclusion of non-binary people in fan communities.
alternative label: Nonbinary people in fandom
broader: https://homosaurus.org/v3/homoit0002171
broader: https://homosaurus.org/v3/homoit0002181
change note: Version 3.7.0
has top concept: Subcultures
in scheme: v3
related: https://homosaurus.org/v3/homoit0001048

Omegaverse
type: Concept
issued: 2022-07-04
modified: 2025-02-23
comment: The alternate universe fanworks trope in which society is divided into three categories of people: alphas, betas, and omegas. Fanworks in the omegaverse often depict characters with genitalia and breeding behaviors (such as heat cycles) similar to wolves. Use to describe fanworks in the omegaverse that focus on LGBTQ+ people and issues.
alternative label: A/B/O
alternative label: ABO
alternative label: Alpha/Beta/Omega
broader: https://homosaurus.org/v3/homoit0002143
change note: Version 3.7.0
has top concept: Subcultures
in scheme: v3
narrower: https://homosaurus.org/v3/homoit0002184
related: https://homosaurus.org/v3/homoit0002176

One true pairing
type: Concept
issued: 2022-07-04
modified: 2025-02-23
comment: Slang term referring to a fan's primary "ship" or preferred relationship within a fandom.
alternative label: OTP
broader: https://homosaurus.org/v3/homoit0002189
change note: Version 3.7.0
has top concept: Subcultures
in scheme: v3
related: https://homosaurus.org/v3/homoit0002160
related: https://homosaurus.org/v3/homoit0002177

Original slash fiction
type: Concept
issued: 2022-07-04
modified: 2025-02-23
comment: Original works of creative fiction that focus on same-sex or same-gender relationships and incorporate tropes from fanfiction; includes femslash fiction.
broader: https://homosaurus.org/v3/homoit0002205
change note: Version 3.7.0
has top concept: Subcultures
in scheme: v3
related: https://homosaurus.org/v3/homoit0000443
related: https://homosaurus.org/v3/homoit0000859
related: https://homosaurus.org/v3/homoit0002217

Pairings in fandom
type: Concept
issued: 2022-07-04
modified: 2025-02-23
comment: The relationships (primarily romantic or sexual) between characters in fanworks, including relationships that are not present within the canon text.
alternative label: Fandom pairings
broader: https://homosaurus.org/v3/homoit0002199
change note: Version 3.7.0
has top concept: Subcultures
in scheme: v3
narrower: https://homosaurus.org/v3/homoit0002187
related: https://homosaurus.org/v3/homoit0001237

People of color in fandom
type: Concept
issued: 2022-07-04
modified: 2025-02-23
comment: The participation and inclusion of people of color in fan communities.
alternative label: BIPOC in fandom
broader: https://homosaurus.org/v3/homoit0002156
change note: Version 3.7.0
has top concept: Subcultures
in scheme: v3
related: https://homosaurus.org/v3/homoit0001101

Queer people in fandom
type: Concept
issued: 2022-07-04
modified: 2025-02-23
comment: The participation and inclusion of queer people in fan communities.
broader: https://homosaurus.org/v3/homoit0002181
change note: Version 3.7.0
has top concept: LGBTQ+ people
in scheme: v3
related: https://homosaurus.org/v3/homoit0001177
related: https://homosaurus.org/v3/homoit0001195
related: https://homosaurus.org/v3/homoit0001728

Racism in fandom
type: Concept
issued: 2022-07-04
modified: 2025-02-23
comment: Issues and discussions about the presence of racism in fan spaces and works.
broader: https://homosaurus.org/v3/homoit0002038
broader: https://homosaurus.org/v3/homoit0002156
change note: Version 3.7.0
has top concept: Racism
in scheme: v3
related: https://homosaurus.org/v3/homoit0002174
related: https://homosaurus.org/v3/homoit0002183
related: https://homosaurus.org/v3/homoit0002212

Rape/non-con (Content warning)
type: Concept
issued: 2022-07-04
modified: 2025-02-23
comment: A content warning applied to fanworks to signal the presence of rape, non-consensual sexual encounters, or dubiously consensual sexual encounters.
alternative label: Non-consensual (Content warning)
alternative label: Rape (Content warning)
broader: https://homosaurus.org/v3/homoit0001807
change note: Version 3.7.0
has top concept: Subcultures
in scheme: v3
related: https://homosaurus.org/v3/homoit0000302
related: https://homosaurus.org/v3/homoit0000958
related: https://homosaurus.org/v3/homoit0000959
related: https://homosaurus.org/v3/homoit0001305
related: https://homosaurus.org/v3/homoit0001350
related: https://homosaurus.org/v3/homoit0001351

Real person fiction
type: Concept
issued: 2022-07-04
modified: 2025-02-23
comment: Fanfiction about real people, such as actors or musicians; often but not always used to describe fanfiction focusing on (real or imagined) same-sex or same-gender relationships between celebrities.
alternative label: RPF
alternative label: RPS
alternative label: Real people fiction
alternative label: Real person slash
alternative label: Real person stories
broader: https://homosaurus.org/v3/homoit0002205
change note: Version 3.7.0
has top concept: Subcultures
in scheme: v3
narrower: https://homosaurus.org/v3/homoit0002142
narrower: https://homosaurus.org/v3/homoit0002147

Seme (Yaoi)
type: Concept
issued: 2022-07-04
modified: 2025-02-23
comment: Term used in yaoi or yaoi fan communities to describe the giving or dominant partner in a fictional male-male relationship.
broader: https://homosaurus.org/v3/homoit0002217
change note: Version 3.7.0
has top concept: Subcultures
in scheme: v3
related: https://homosaurus.org/v3/homoit0001376
related: https://homosaurus.org/v3/homoit0002151
related: https://homosaurus.org/v3/homoit0002152

Ship names in fandom
type: Concept
issued: 2022-07-04
modified: 2025-02-23
comment: Names used to describe common pairings in fandom. Ship names are often portmanteaus of the names of two (or more) characters in the ship (e.g., Spirk for Spock and Kirk).
alternative label: Pairing names in fandom
broader: https://homosaurus.org/v3/homoit0002199
change note: Version 3.7.0
has top concept: Subcultures
in scheme: v3
narrower: https://homosaurus.org/v3/homoit0002177

Shipping in fandom
type: Concept
issued: 2022-07-04
modified: 2025-02-23
comment: Term used to describe fans' desire to see certain characters in sexual or romantic relationships, as well as the practice of pairing those characters in fanworks. The terms "shipping" and "ship" come from "relationship."
broader: https://homosaurus.org/v3/homoit0002156
change note: Version 3.7.0
has top concept: Subcultures
in scheme: v3
narrower: https://homosaurus.org/v3/homoit0002189
narrower: https://homosaurus.org/v3/homoit0002198
related: https://homosaurus.org/v3/homoit0002180

Slash (Genre)
type: Concept
issued: 2022-07-04
modified: 2025-02-23
comment: A genre of fanworks in which two or more characters of the same sex or gender are placed in sexual or romantic situations with one another. Slash fanworks are commonly erotic or pornographic. While the term "slash" has historically been used for male/male couples only, it has been recently been broadened to include LGBTQ+ relationships other than those between two men.
broader: https://homosaurus.org/v3/homoit0002203
change note: Version 3.7.0
has top concept: Subcultures
in scheme: v3
narrower: https://homosaurus.org/v3/homoit0002162

Slash art
type: Concept
issued: 2022-07-04
modified: 2025-02-23
comment: Artwork depicting same-sex or same-gender couples that is usually erotic or pornographic in nature. Historically used for male-male couples only, but is now used more broadly; includes femslash art.
broader: https://homosaurus.org/v3/homoit0002155
broader: https://homosaurus.org/v3/homoit0002204
change note: Version 3.7.0
has top concept: Subcultures
in scheme: v3
related: https://homosaurus.org/v3/homoit0000816

Slash conventions
type: Concept
issued: 2022-07-04
modified: 2025-02-23
comment: Conventions focused on slash, or fanworks depicting same-sex or same-gender couples that are typically erotic or pornographic in nature. Historically used for male-male couples only, but is now used more broadly; includes femslash conventions.
alternative label: Slash cons
broader: https://homosaurus.org/v3/homoit0002157
broader: https://homosaurus.org/v3/homoit0002203
change note: Version 3.7.0
has top concept: Subcultures
in scheme: v3
related: https://homosaurus.org/v3/homoit0000861
related: https://homosaurus.org/v3/homoit0000900

Slash fandom
type: Concept
issued: 2022-07-04
modified: 2025-02-23
comment: The fan community that focuses on, incorporates, or details relationships between two characters of the same sex or gender (usually fictional, with "Real person fiction" as an exception). Historically used for male-male couples only, but is now used more broadly; includes femslash fandom.
alternative label: Slash fan community
broader: https://homosaurus.org/v3/homoit0002156
change note: Version 3.7.0
has top concept: Subcultures
in scheme: v3
narrower: https://homosaurus.org/v3/homoit0002200
narrower: https://homosaurus.org/v3/homoit0002202
narrower: https://homosaurus.org/v3/homoit0002204
narrower: https://homosaurus.org/v3/homoit0002205
narrower: https://homosaurus.org/v3/homoit0002208
related: https://homosaurus.org/v3/homoit0002221

Slash fanworks
type: Concept
issued: 2022-07-04
modified: 2025-02-23
comment: Works created by fans that focus on romantic or sexual relationships between characters of the same sex or gender. Typically erotic or pornographic in nature. Historically used for male-male couples only, but is now used more broadly; includes femslash fanworks.
alternative label: Slash fan works
broader: https://homosaurus.org/v3/homoit0002161
broader: https://homosaurus.org/v3/homoit0002203
change note: Version 3.7.0
has top concept: Subcultures
in scheme: v3
narrower: https://homosaurus.org/v3/homoit0002201
narrower: https://homosaurus.org/v3/homoit0002205
narrower: https://homosaurus.org/v3/homoit0002206
narrower: https://homosaurus.org/v3/homoit0002207
narrower: https://homosaurus.org/v3/homoit0002209
related: https://homosaurus.org/v3/homoit0002155
related: https://homosaurus.org/v3/homoit0002217

Slash fiction
type: Concept
issued: 2022-07-04
modified: 2025-02-23
comment: Fanfiction focusing on sexual or romantic relationships between characters of the same sex or gender that is typically erotic or pornographic in nature. Historically used for male-male couples only, but is now used more broadly; includes femslash fiction.
alternative label: Slash fan fics
alternative label: Slash fan fiction
alternative label: Slash fanfiction
alternative label: Slash fic
broader: https://homosaurus.org/v3/homoit0002159
broader: https://homosaurus.org/v3/homoit0002203
broader: https://homosaurus.org/v3/homoit0002204
change note: Version 3.7.0
has top concept: Subcultures
in scheme: v3
narrower: https://homosaurus.org/v3/homoit0002188
narrower: https://homosaurus.org/v3/homoit0002196
related: https://homosaurus.org/v3/homoit0000859

Slash manips
type: Concept
issued: 2022-07-04
modified: 2025-02-23
comment: Fan-created photo manipulations or deepfakes depicting sexual or romantic relationships between characters from various media properties. Typically erotic or pornographic in nature. Historically used for male-male couples only, but is now used more broadly; includes femslash manips.
broader: https://homosaurus.org/v3/homoit0002204
change note: Version 3.7.0
has top concept: Subcultures
in scheme: v3

Slash roleplay
type: Concept
issued: 2022-07-04
modified: 2025-02-23
comment: The act of pretending to be and behaving as a character in a sexual or romantic relationship with another character of the same sex or gender, sometimes to generate ideas for fanworks. Typically erotic or pornographic in nature. Historically used for male-male couples only, but is now used more broadly; includes femslash roleplay.
alternative label: Slash role play
broader: https://homosaurus.org/v3/homoit0002204
change note: Version 3.7.0
has top concept: Subcultures
in scheme: v3
related: https://homosaurus.org/v3/homoit0001241
related: https://homosaurus.org/v3/homoit0001242

Slash terminology
type: Concept
issued: 2022-07-04
modified: 2025-02-23
comment: Slang relating to fanworks about sexual or romantic relationships between characters of the same sex or gender. Historically used for male-male couples only, but is now used more broadly; includes femslash terminology.
alternative label: Slash terms
broader: https://homosaurus.org/v3/homoit0002158
broader: https://homosaurus.org/v3/homoit0002203
change note: Version 3.7.0
has top concept: Subcultures
in scheme: v3
related: https://homosaurus.org/v3/homoit0001317

Slash vidding
type: Concept
issued: 2022-07-04
modified: 2025-02-23
comment: Creating videos about sexual or romantic relationships between same-sex or -gender couples using scenes from television, movies, or video games. Historically used for male-male couples only, but is now used more broadly; includes femslash vidding.
broader: https://homosaurus.org/v3/homoit0002204
change note: Version 3.7.0
has top concept: Subcultures
in scheme: v3
related: https://homosaurus.org/v3/homoit0003662

Transfic
type: Concept
issued: 2022-07-04
modified: 2025-02-23
comment: Term used to describe fanfiction about trans characters, typically characters who are not stated to be transgender, transsexual, or gender diverse in the canon text
broader: https://homosaurus.org/v3/homoit0002159
change note: Version 3.7.0
has top concept: Subcultures
in scheme: v3
related: https://homosaurus.org/v3/homoit0000576
related: https://homosaurus.org/v3/homoit0001414
related: https://homosaurus.org/v3/homoit0002143

Transgender people in fandom
type: Concept
issued: 2022-07-04
modified: 2025-02-23
comment: The participation and inclusion of transgender people in fan communities.
alternative label: Trans people in fandom
broader: https://homosaurus.org/v3/homoit0002171
broader: https://homosaurus.org/v3/homoit0002181
change note: Version 3.7.0
has top concept: Subcultures
in scheme: v3
related: https://homosaurus.org/v3/homoit0001378
related: https://homosaurus.org/v3/homoit0001414
related: https://homosaurus.org/v3/homoit0001727

Transphobia in fandom
type: Concept
issued: 2022-07-04
modified: 2025-02-23
comment: Issues and discussions about the presence of transphobia in fan spaces and works.
broader: https://homosaurus.org/v3/homoit0001467
broader: https://homosaurus.org/v3/homoit0002171
change note: Version 3.7.0
has top concept: LGBTQ+ phobia
in scheme: v3
related: https://homosaurus.org/v3/homoit0002181
related: https://homosaurus.org/v3/homoit0002194

Two-Spirit people in fandom
type: Concept
issued: 2022-07-04
modified: 2025-02-23
comment: The participation and inclusion of Two-Spirit people in fan communities.
alternative label: 2S people in fandom
alternative label: Two Spirit people in fandom
alternative label: Two Spirited people in fandom
alternative label: Two-Spirited people in fandom
broader: https://homosaurus.org/v3/homoit0002171
change note: Version 3.7.0
has top concept: Subcultures
in scheme: v3
related: https://homosaurus.org/v3/homoit0001480
related: https://homosaurus.org/v3/homoit0001751
related: https://homosaurus.org/v3/homoit0002181

Uke (Yaoi)
type: Concept
issued: 2022-07-04
modified: 2025-02-23
comment: Term used in yaoi and yaoi fan communities to describe the receiving or submissive partner in a fictional male-male relationship.
broader: https://homosaurus.org/v3/homoit0002217
change note: Version 3.7.0
has top concept: Subcultures
in scheme: v3
related: https://homosaurus.org/v3/homoit0002151
related: https://homosaurus.org/v3/homoit0002152

Underage (Content warning)
type: Concept
issued: 2022-07-04
modified: 2025-02-23
comment: A content warning applied to fanworks to signal the depiction of people under the age of consent in sexual situations, either with other underage people or adults.
broader: https://homosaurus.org/v3/homoit0001807
change note: Version 3.7.0
has top concept: Subcultures
in scheme: v3
related: https://homosaurus.org/v3/homoit0000020
related: https://homosaurus.org/v3/homoit0000302

Women in fandom
type: Concept
issued: 2022-07-04
modified: 2025-02-23
comment: The participation and inclusion of women in fan communities.
broader: https://homosaurus.org/v3/homoit0002171
change note: Version 3.7.0
has top concept: Subcultures
in scheme: v3
related: https://homosaurus.org/v3/homoit0001509

Yaoi
type: Concept
issued: 2022-07-04
modified: 2025-02-23
comment: Japanese word used by English-speaking anime and manga fans to describe explicit or pornographic works featuring male-male couples that are typically created by heterosexual female authors for heterosexual female readers. Note that the Japanese meaning and usage of "yaoi" and related terms differ considerably.
broader: https://homosaurus.org/v3/homoit0002218
change note: Version 3.7.0
has top concept: Subcultures
in scheme: v3
narrower: https://homosaurus.org/v3/homoit0002197
narrower: https://homosaurus.org/v3/homoit0002214
related: https://homosaurus.org/v3/homoit0000493
related: https://homosaurus.org/v3/homoit0001598
related: https://homosaurus.org/v3/homoit0002172
related: https://homosaurus.org/v3/homoit0002188
related: https://homosaurus.org/v3/homoit0002204

Yaoi fandom
type: Concept
issued: 2022-07-04
modified: 2025-02-23
comment: The fan community that focuses on, incorporates, or details the sexual or romantic relationships between male characters from anime and manga.
broader: https://homosaurus.org/v3/homoit0002152
change note: Version 3.7.0
has top concept: Subcultures
in scheme: v3
narrower: https://homosaurus.org/v3/homoit0002164
narrower: https://homosaurus.org/v3/homoit0002217

Yiff
type: Concept
issued: 2022-07-04
modified: 2025-02-23
comment: Slang term used by members of the furry fandom to describe the act of sex.
broader: https://homosaurus.org/v3/homoit0002165
change note: Version 3.7.0
has top concept: Subcultures
in scheme: v3
related: https://homosaurus.org/v3/homoit0001267

Yuri
type: Concept
issued: 2022-07-04
modified: 2025-02-23
comment: A genre focusing on the romantic or sexual relationships between female characters from anime and manga.
broader: https://homosaurus.org/v3/homoit0002221
change note: Version 3.7.0
has top concept: Subcultures
in scheme: v3
related: https://homosaurus.org/v3/homoit0000742
related: https://homosaurus.org/v3/homoit0001597
related: https://homosaurus.org/v3/homoit0002162

Yuri fandom
type: Concept
issued: 2022-07-04
modified: 2025-02-23
comment: The fan community that focuses on, incorporates, or details the romantic or sexual relationships between female characters from anime and manga.
broader: https://homosaurus.org/v3/homoit0002144
broader: https://homosaurus.org/v3/homoit0003507
change note: Version 3.7.0
has top concept: Subcultures
in scheme: v3
narrower: https://homosaurus.org/v3/homoit0002220
related: https://homosaurus.org/v3/homoit0002162
related: https://homosaurus.org/v3/homoit0002203

Non-binary children
type: Concept
issued: 2022-07-19
modified: 2025-02-23
comment: Non-binary people who have not yet reached the age of adolescence.
alternative label: Non-binary kids
alternative label: Nonbinary children
alternative label: Nonbinary kids
broader: https://homosaurus.org/v3/homoit0000256
broader: https://homosaurus.org/v3/homoit0002223
change note: Version 3.7.0
has top concept: Family members
in scheme: v3
related: https://homosaurus.org/v3/homoit0001756

Non-binary youth
type: Concept
issued: 2022-07-19
modified: 2025-02-23
comment: Non-binary people who are between the ages of childhood and adulthood.
alternative label: Non-binary adolescents
alternative label: Non-binary teenagers
alternative label: Non-binary teens
alternative label: Nonbinary youth
broader: https://homosaurus.org/v3/homoit0001048
broader: https://homosaurus.org/v3/homoit0001521
change note: Version 3.7.0
has top concept: LGBTQ+ people
in scheme: v3
narrower: https://homosaurus.org/v3/homoit0002222

Parents of LGBTQ+ people
type: Concept
issued: 2022-07-19
modified: 2025-02-23
comment: Individuals who have one or more LGBTQ+ child.
alternative label: LGBTQ people's parents
alternative label: LGBTQ+ people's parents
alternative label: Parents of LGBTQ people
broader: https://homosaurus.org/v3/homoit0002372
change note: Version 3.7.0
has top concept: Family members
in scheme: v3
narrower: https://homosaurus.org/v3/homoit0000173
narrower: https://homosaurus.org/v3/homoit0000509
narrower: https://homosaurus.org/v3/homoit0000802
narrower: https://homosaurus.org/v3/homoit0001077
narrower: https://homosaurus.org/v3/homoit0001078
narrower: https://homosaurus.org/v3/homoit0002225
narrower: https://homosaurus.org/v3/homoit0002742
narrower: https://homosaurus.org/v3/homoit0002910

Parents of non-binary people
type: Concept
issued: 2022-07-19
modified: 2025-02-23
comment: Individuals who have one or more non-binary child.
alternative label: Non-binary people's parents
alternative label: Nonbinary people's parents
alternative label: Parents of nonbinary people
broader: https://homosaurus.org/v3/homoit0002224
change note: Version 3.7.0
has top concept: Family members
in scheme: v3

LGBTQ+ people with substance use disorders
type: Concept
issued: 2022-07-19
modified: 2025-02-23
comment: LGBTQ+ people who have been diagnosed with or regard themselves as having a substance use disorder, a medical condition that involves a pattern of substance use that is difficult to control, negatively impacts the individual's life, and results in withdrawal symptoms upon cessation. Only use to refer to individuals who describe themselves as having a substance use disorder. Follow the individual's preference for "use disorder" or "addiction" whenever possible.
alternative label: Drug addicts (LGBTQ)
alternative label: LGBTQ+ drug addicts
alternative label: LGBTQ+ people with drug addictions
alternative label: People with substance abuse disorders (LGBTQ)
broader: https://homosaurus.org/v3/homoit0000915
broader: https://homosaurus.org/v3/homoit0001550
change note: Version 3.7.0
has top concept: LGBTQ+ people
in scheme: v3
related: https://homosaurus.org/v3/homoit0000380

LGBTQ+ people in recovery groups
type: Concept
issued: 2022-07-19
modified: 2025-02-23
comment: LGBTQ+ people who are members of recovery groups, or voluntary associations of people in recovery from use disorders, conditions, or addictions.
alternative label: LGBTQ people in recovery groups
alternative label: LGBTQ+ people in 12 step programs
alternative label: People in recovery groups (LGBTQ)
broader: https://homosaurus.org/v3/homoit0000915
change note: Version 3.7.0
has top concept: LGBTQ+ people
in scheme: v3
related: https://homosaurus.org/v3/homoit0001551

LGBTQ+ people practicing sobriety
type: Concept
issued: 2022-07-19
modified: 2025-02-23
comment: LGBTQ+ people intentionally refraining from substance use (typically drugs or alcohol). Follow the individual's preference for "sobriety" or "recovery" whenever possible.
alternative label: LGBTQ+ sober people
alternative label: Sober LGBTQ+ people
alternative label: Sober people (LGBTQ)
alternative label: Sobriety (LGBTQ)
broader: https://homosaurus.org/v3/homoit0000915
change note: Version 3.7.0
has top concept: LGBTQ+ people
in scheme: v3
related: https://homosaurus.org/v3/homoit0001551

LGBTQ+ people who use substances for medical purposes
type: Concept
issued: 2022-07-19
modified: 2025-02-23
comment: LGBTQ+ people who use substances (that are typically deemed harmful or are subject to legal restriction, such as drugs or alcohol) in order to manage pain and other symptoms related to a medical condition or disability.
alternative label: People who use substances for medical purposes (LGBTQ)
broader: https://homosaurus.org/v3/homoit0000379
change note: Version 3.7.0
has top concept: LGBTQ+ people
in scheme: v3
related: https://homosaurus.org/v3/homoit0000380
related: https://homosaurus.org/v3/homoit0001854
related: https://homosaurus.org/v3/homoit0001879

Fairies (Gay culture)
type: Concept
issued: 2022-07-20
modified: 2025-02-23
comment: Pejorative term used chiefly in North America to describe gay men (or men assumed to be gay) and insult their perceived femininity. Some gay men have reclaimed this term and use it to describe themselves. Not to be confused with Faeries, the queer spiritual group.
alternative label: Fairy (Gay culture)
broader: https://homosaurus.org/v3/homoit0000878
broader: https://homosaurus.org/v3/homoit0001559
broader: https://homosaurus.org/v3/homoit0001560
change note: Version 3.7.0
has top concept: LGBTQ+ historical terms
in scheme: v3
related: https://homosaurus.org/v3/homoit0000415
related: https://homosaurus.org/v3/homoit0000487
related: https://homosaurus.org/v3/homoit0000535

Gujarati LGBTQ+ people
type: Concept
issued: 2022-07-20
modified: 2025-02-23
comment: LGBTQ+ people who reside in or are descended from those indigenous to the Indian state of Gujarat.
alternative label: Gujarati people (LGBTQ)
alternative label: Gujaratis (LGBTQ)
alternative label: LGBTQ+ Gujarati people
alternative label: LGBTQ+ Gujaratis
broader: https://homosaurus.org/v3/homoit0000860
broader: https://homosaurus.org/v3/homoit0001101
change note: Version 3.7.0
has top concept: LGBTQ+ people
in scheme: v3
narrower: https://homosaurus.org/v3/homoit0002232
narrower: https://homosaurus.org/v3/homoit0002233
narrower: https://homosaurus.org/v3/homoit0002234
narrower: https://homosaurus.org/v3/homoit0002235
narrower: https://homosaurus.org/v3/homoit0002236
narrower: https://homosaurus.org/v3/homoit0002237
narrower: https://homosaurus.org/v3/homoit0002238
narrower: https://homosaurus.org/v3/homoit0003408

Gujarati lesbians
type: Concept
issued: 2022-07-20
modified: 2025-02-23
comment: Lesbians who reside in or are descended from those indigenous to the Indian state of Gujarat.
alternative label: Lesbian Gujaratis
broader: https://homosaurus.org/v3/homoit0002231
change note: Version 3.7.0
has top concept: LGBTQ+ people
in scheme: v3

Gujarati gay men
type: Concept
issued: 2022-07-20
modified: 2025-02-23
comment: Gay men who reside in or are descended from those indigenous to the Indian state of Gujarat.
alternative label: Gay Gujarati men
alternative label: Gay Gujaratis
broader: https://homosaurus.org/v3/homoit0002231
change note: Version 3.7.0
has top concept: LGBTQ+ people
in scheme: v3

Gujarati bisexual people
type: Concept
issued: 2022-07-20
modified: 2025-02-23
comment: Bisexual people who reside in or are descended from those indigenous to the Indian state of Gujarat.
alternative label: Bisexual Gujarati people
alternative label: Bisexual Gujaratis
broader: https://homosaurus.org/v3/homoit0002231
change note: Version 3.7.0
has top concept: LGBTQ+ people
in scheme: v3

Gujarati transgender people
type: Concept
issued: 2022-07-20
modified: 2025-02-23
comment: Transgender people who reside in or are descended from those indigenous to the Indian state of Gujarat.
alternative label: Trangender Gujaratis
alternative label: Transgender Gujarati people
broader: https://homosaurus.org/v3/homoit0002231
change note: Version 3.7.0
has top concept: LGBTQ+ people
in scheme: v3

Gujarati asexual people
type: Concept
issued: 2022-07-20
modified: 2025-02-23
comment: Asexual people who reside in or are descended from those indigenous to the Indian state of Gujarat.
alternative label: Asexual Gujarati people
alternative label: Asexual Gujaratis
broader: https://homosaurus.org/v3/homoit0002231
change note: Version 3.7.0
has top concept: LGBTQ+ people
in scheme: v3

Gujarati queer people
type: Concept
issued: 2022-07-20
modified: 2025-02-23
comment: Queer people who reside in or are descended from those indigenous to the Indian state of Gujarat.
alternative label: Queer Gujarati people
alternative label: Queer Gujaratis
broader: https://homosaurus.org/v3/homoit0002231
change note: Version 3.7.0
has top concept: LGBTQ+ people
in scheme: v3

Gujarati intersex people
type: Concept
issued: 2022-07-20
modified: 2025-02-23
comment: Intersex people who reside in or are descended from those indigenous to the Indian state of Gujarat.
alternative label: Intersex Gujarati people
alternative label: Intersex Gujaratis
broader: https://homosaurus.org/v3/homoit0002231
change note: Version 3.7.0
has top concept: LGBTQ+ people
in scheme: v3

Haryanvi LGBTQ+ people
type: Concept
issued: 2022-07-28
modified: 2025-02-23
comment: LGBTQ+ people who are indigenous to or descended from those indigenous to what is now the Indian state of Haryana. This term can also apply to those who currently reside in Haryana.
alternative label: Haryanvi people (LGBTQ)
alternative label: Haryanvis (LGBTQ)
alternative label: LGBTQ+ Haryanvi people
alternative label: LGBTQ+ Haryanvis
broader: https://homosaurus.org/v3/homoit0000860
broader: https://homosaurus.org/v3/homoit0001101
change note: Version 3.7.0
has top concept: LGBTQ+ people
in scheme: v3
narrower: https://homosaurus.org/v3/homoit0002240
narrower: https://homosaurus.org/v3/homoit0002241
narrower: https://homosaurus.org/v3/homoit0002242
narrower: https://homosaurus.org/v3/homoit0002243
narrower: https://homosaurus.org/v3/homoit0002244
narrower: https://homosaurus.org/v3/homoit0002245
narrower: https://homosaurus.org/v3/homoit0002246
narrower: https://homosaurus.org/v3/homoit0003409

Haryanvi lesbians
type: Concept
issued: 2022-07-28
modified: 2025-02-23
comment: Lesbians who are indigenous to or descended from those indigenous to what is now the Indian state of Haryana. This term can also apply to those who currently reside in Haryana.
alternative label: Lesbian Haryanvis
broader: https://homosaurus.org/v3/homoit0002239
change note: Version 3.7.0
has top concept: LGBTQ+ people
in scheme: v3

Haryanvi gay men
type: Concept
issued: 2022-07-28
modified: 2025-02-23
comment: Gay men who are indigenous to or descended from those indigenous to what is now the Indian state of Haryana. This term can also apply to those who currently reside in Haryana.
alternative label: Gay Haryanvi men
alternative label: Gay Haryanvis
broader: https://homosaurus.org/v3/homoit0002239
change note: Version 3.7.0
has top concept: LGBTQ+ people
in scheme: v3

Haryanvi bisexual people
type: Concept
issued: 2022-07-28
modified: 2025-02-23
comment: Bisexual people who are indigenous to or descended from those indigenous to what is now the Indian state of Haryana. This term can also apply to those who currently reside in Haryana.
alternative label: Bisexual Haryanvi people
alternative label: Bisexual Haryanvis
broader: https://homosaurus.org/v3/homoit0002239
change note: Version 3.7.0
has top concept: LGBTQ+ people
in scheme: v3

Haryanvi transgender people
type: Concept
issued: 2022-07-28
modified: 2025-02-23
comment: Transgender people who are indigenous to or descended from those indigenous to what is now the Indian state of Haryana. This term can also apply to those who currently reside in Haryana.
alternative label: Transgender Haryanvi people
alternative label: Transgender Haryanvis
broader: https://homosaurus.org/v3/homoit0002239
change note: Version 3.7.0
has top concept: LGBTQ+ people
in scheme: v3

Haryanvi queer people
type: Concept
issued: 2022-07-28
modified: 2025-02-23
comment: Queer people who are indigenous to or descended from those indigenous to what is now the Indian state of Haryana. This term can also apply to those who currently reside in Haryana.
alternative label: Queer Haryanvi people
alternative label: Queer Haryanvis
broader: https://homosaurus.org/v3/homoit0002239
change note: Version 3.7.0
has top concept: LGBTQ+ people
in scheme: v3

Haryanvi intersex people
type: Concept
issued: 2022-07-28
modified: 2025-02-23
comment: Intersex people who are indigenous to or descended from those indigenous to what is now the Indian state of Haryana. This term can also apply to those who currently reside in Haryana.
alternative label: Intersex Haryanvi people
alternative label: Intersex Haryanvis
broader: https://homosaurus.org/v3/homoit0002239
change note: Version 3.7.0
has top concept: LGBTQ+ people
in scheme: v3

Haryanvi asexual people
type: Concept
issued: 2022-07-28
modified: 2025-02-23
comment: Asexual people who are indigenous to or descended from those indigenous to what is now the Indian state of Haryana. This term can also apply to those who currently reside in Haryana.
alternative label: Asexual Haryanvi people
alternative label: Asexual Haryanvis
broader: https://homosaurus.org/v3/homoit0002239
change note: Version 3.7.0
has top concept: LGBTQ+ people
in scheme: v3

Kalash LGBTQ+ people
type: Concept
issued: 2022-07-28
modified: 2025-02-23
comment: LGBTQ+ people who belong to the indigenous Kalasha people and reside in the Chitral District of Khyber-Pakhtunkhwa province in Pakistan.
alternative label: Kalasha (LGBTQ)
alternative label: Kalasha LGBTQ+ people
alternative label: LGBTQ+ Kalasha
broader: https://homosaurus.org/v3/homoit0000860
broader: https://homosaurus.org/v3/homoit0001101
change note: Version 3.7.0
has top concept: LGBTQ+ people
in scheme: v3
narrower: https://homosaurus.org/v3/homoit0002248
narrower: https://homosaurus.org/v3/homoit0002249
narrower: https://homosaurus.org/v3/homoit0002250
narrower: https://homosaurus.org/v3/homoit0002251
narrower: https://homosaurus.org/v3/homoit0002252
narrower: https://homosaurus.org/v3/homoit0002253
narrower: https://homosaurus.org/v3/homoit0002254
narrower: https://homosaurus.org/v3/homoit0003412

Kalash lesbians
type: Concept
issued: 2022-07-28
modified: 2025-02-23
comment: Lesbians who belong to the indigenous Kalasha people and reside in the Chitral District of Khyber-Pakhtunkhwa province in Pakistan.
alternative label: Lesbian Kalasha
broader: https://homosaurus.org/v3/homoit0002247
change note: Version 3.7.0
has top concept: LGBTQ+ people
in scheme: v3

Kalash gay men
type: Concept
issued: 2022-07-28
modified: 2025-02-23
comment: Gay men who belong to the indigenous Kalasha people and reside in the Chitral District of Khyber-Pakhtunkhwa province in Pakistan.
alternative label: Gay Kalash men
alternative label: Gay Kalasha men
broader: https://homosaurus.org/v3/homoit0002247
change note: Version 3.7.0
has top concept: LGBTQ+ people
in scheme: v3

Kalash bisexual people
type: Concept
issued: 2022-07-28
modified: 2025-02-23
comment: Bisexual people who belong to the indigenous Kalasha people and reside in the Chitral District of Khyber-Pakhtunkhwa province in Pakistan.
alternative label: Bisexual Kalash people
alternative label: Kalasha bisexual people
broader: https://homosaurus.org/v3/homoit0002247
change note: Version 3.7.0
has top concept: LGBTQ+ people
in scheme: v3

Kalash transgender people
type: Concept
issued: 2022-07-28
modified: 2025-02-23
comment: Transgender people who belong to the indigenous Kalasha people and reside in the Chitral District of Khyber-Pakhtunkhwa province in Pakistan.
alternative label: Transgender Kalash people
alternative label: Transgender Kalasha
broader: https://homosaurus.org/v3/homoit0002247
change note: Version 3.7.0
has top concept: LGBTQ+ people
in scheme: v3

Kalash queer people
type: Concept
issued: 2022-07-28
modified: 2025-02-23
comment: Queer people who belong to the indigenous Kalasha people and reside in the Chitral District of Khyber-Pakhtunkhwa province in Pakistan.
alternative label: Queer Kalash people
alternative label: Queer Kalasha
broader: https://homosaurus.org/v3/homoit0002247
change note: Version 3.7.0
has top concept: LGBTQ+ people
in scheme: v3

Kalash intersex people
type: Concept
issued: 2022-07-28
modified: 2025-02-23
comment: Intersex people who belong to the indigenous Kalasha people and reside in the Chitral District of Khyber-Pakhtunkhwa province in Pakistan.
alternative label: Intersex Kalash people
alternative label: Intersex Kalasha
broader: https://homosaurus.org/v3/homoit0002247
change note: Version 3.7.0
has top concept: LGBTQ+ people
in scheme: v3

Kalash asexual people
type: Concept
issued: 2022-07-28
modified: 2025-02-23
comment: Asexual people who belong to the indigenous Kalasha people and reside in the Chitral District of Khyber-Pakhtunkhwa province in Pakistan.
alternative label: Asexual Kalash people
alternative label: Asexual Kalasha
broader: https://homosaurus.org/v3/homoit0002247
change note: Version 3.7.0
has top concept: LGBTQ+ people
in scheme: v3

Polygamous people
type: Concept
issued: 2022-09-09
modified: 2025-02-23
comment: Individuals who engage in relationships in which the dominant partner has multiple spouses, though the marriages are not typically recognized by society or law.
broader: https://homosaurus.org/v3/homoit0001637
change note: Version 3.7.0
has top concept: Relationship minorities
in scheme: v3
related: https://homosaurus.org/v3/homoit0001081
related: https://homosaurus.org/v3/homoit0001123
related: https://homosaurus.org/v3/homoit0001124
related: https://homosaurus.org/v3/homoit0001629
related: https://homosaurus.org/v3/homoit0001659

Anti-Blackness
type: Concept
issued: 2022-09-09
modified: 2025-02-23
comment: Term used to acknowledge the particularities of racism as directed toward Black people. Anti-Blackness includes the belief that Black people possess different inherent behavioral traits that correspond to inherited attributes and are inferior to those of other races--particularly white people. Anti-Blackness also encompasses prejudice, discrimination, and antagonism (whether personal or systematic) directed toward Black people because of their race and its perceived inferiority.
alternative label: Anti Blackness
broader: https://homosaurus.org/v3/homoit0002038
change note: Version 3.7.0
has top concept: Racism
in scheme: v3
related: https://homosaurus.org/v3/homoit0001902
related: https://homosaurus.org/v3/homoit0001903
related: https://homosaurus.org/v3/homoit0001904
related: https://homosaurus.org/v3/homoit0002376
related: https://homosaurus.org/v3/homoit0003691
related: https://homosaurus.org/v3/homoit0003692

Lesbian history
type: Concept
issued: 2022-11-08
modified: 2025-02-23
comment: Past events or accounts of the past concerning lesbians, or people who might be perceived as lesbian if they were alive today.
broader: https://homosaurus.org/v3/homoit0002260
change note: Version 3.7.0
has top concept: LGBTQ+ history
in scheme: v3

Gay history
type: Concept
issued: 2022-11-08
modified: 2025-02-23
comment: Past events or accounts of the past concerning gay men, or men who might be perceived as gay if they were alive today.
broader: https://homosaurus.org/v3/homoit0002260
change note: Version 3.7.0
has top concept: LGBTQ+ history
in scheme: v3

Bisexual history
type: Concept
issued: 2022-11-08
modified: 2025-02-23
comment: Past events or accounts of the past concerning bisexual people, or people who might be perceived as bisexual if they were alive today.
broader: https://homosaurus.org/v3/homoit0002260
change note: Version 3.7.0
has top concept: LGBTQ+ history
in scheme: v3

Transgender history
type: Concept
issued: 2022-11-08
modified: 2025-02-23
comment: Past events or accounts of the past concerning transgender people, or people who might be perceived as transgender if they were alive today.
broader: https://homosaurus.org/v3/homoit0002260
change note: Version 3.7.0
has top concept: LGBTQ+ history
in scheme: v3

Queer history
type: Concept
issued: 2022-11-08
modified: 2025-02-23
comment: Past events or accounts of the past concerning queer people, or people who might be perceived as queer if they were alive today.
broader: https://homosaurus.org/v3/homoit0002260
change note: Version 3.7.0
has top concept: LGBTQ+ history
in scheme: v3

Intersex history
type: Concept
issued: 2022-11-08
modified: 2025-02-23
comment: Past events or accounts of the past concerning intersex people, or people who might be perceived as intersex if they were alive today.
broader: https://homosaurus.org/v3/homoit0002260
change note: Version 3.7.0
has top concept: LGBTQ+ history
in scheme: v3

Asexual history
type: Concept
issued: 2022-11-08
modified: 2025-02-23
comment: Past events or accounts of the past concerning asexual people, or people who might be perceived as asexual if they were alive today.
alternative label: Ace history
broader: https://homosaurus.org/v3/homoit0002260
change note: Version 3.7.0
has top concept: LGBTQ+ history
in scheme: v3

Non-binary history
type: Concept
issued: 2022-11-08
modified: 2025-02-23
comment: Past events or accounts of the past concerning non-binary people, or people who might be perceived as non-binary if they were alive today.
alternative label: Nonbinary history
broader: https://homosaurus.org/v3/homoit0002260
change note: Version 3.7.0
has top concept: LGBTQ+ history
in scheme: v3

Black feminism
type: Concept
issued: 2022-11-08
modified: 2025-02-23
comment: A form of feminism that developed in response to the failures of mainstream feminist and civil rights efforts to acknowledge the ways white supremacy and the patriarchy interact to inform the particular experiences of Black women.
alternative label: Afro feminism
alternative label: Afro-feminism
broader: https://homosaurus.org/v3/homoit0000437
change note: Version 3.7.0
has top concept: Feminism
in scheme: v3
related: https://homosaurus.org/v3/homoit0000667
related: https://homosaurus.org/v3/homoit0002038
related: https://homosaurus.org/v3/homoit0002272
related: https://homosaurus.org/v3/homoit0003170

White feminism
type: Concept
issued: 2022-11-08
modified: 2025-02-23
comment: Term used to describe (and criticize) forms of feminism that focus on the needs of white women at the expense of women of color.
broader: https://homosaurus.org/v3/homoit0000437
change note: Version 3.7.0
has top concept: Feminism
in scheme: v3
related: https://homosaurus.org/v3/homoit0000667
related: https://homosaurus.org/v3/homoit0001133
related: https://homosaurus.org/v3/homoit0002038
related: https://homosaurus.org/v3/homoit0002272

Womanism
type: Concept
issued: 2022-11-08
modified: 2025-02-23
comment: A social theory based on the history and everyday experiences of Black women. Womanism grew out of the perceived indifference of the feminist movement towards the needs of Black women, who are often excluded from the categories of "female" and "femininity" as understood by white feminists. At the core of womanism is the idea that mainstream feminism is a movement led by white women to serve white women's goals, which can be indifferent or even oppositional to the needs of Black women.
alternative label: Womanist theory
broader: https://homosaurus.org/v3/homoit0001365
change note: Version 3.7.0
has top concept: Theories
in scheme: v3
related: https://homosaurus.org/v3/homoit0000667
related: https://homosaurus.org/v3/homoit0002038
related: https://homosaurus.org/v3/homoit0002270
related: https://homosaurus.org/v3/homoit0002271
related: https://homosaurus.org/v3/homoit0003176

Transfeminism
type: Concept
issued: 2022-11-08
modified: 2025-02-23
comment: As defined by Emi Koyama, transfeminism is a movement by and for trans woman who view the liberation of trans women as essential to the liberation of all women.
alternative label: Trans feminism
broader: https://homosaurus.org/v3/homoit0000437
change note: Version 3.7.0
has top concept: Feminism
in scheme: v3
related: https://homosaurus.org/v3/homoit0000667
related: https://homosaurus.org/v3/homoit0001642
related: https://homosaurus.org/v3/homoit0001892
related: https://homosaurus.org/v3/homoit0003175

Third-wave feminism
type: Concept
issued: 2022-11-08
modified: 2025-02-23
comment: Period of feminist political activity beginning in the early 1990s that embraced diversity and individualism in women and sought to redefine what it meant to be a feminist. The third wave is characterized by the emergence of new feminist movements and theories such as intersectionality, sex positivity, ecofeminism, transfeminism, and postmodern feminism.
alternative label: Third wave feminism
broader: https://homosaurus.org/v3/homoit0000437
change note: Version 3.7.0
has top concept: Feminism
in scheme: v3
related: https://homosaurus.org/v3/homoit0003174

Sapphic identity
type: Concept
issued: 2022-11-08
modified: 2025-02-23
comment: Sexual identity or sexuality term used to describe women and, in some definitions, non-binary people who are sapphic, or attracted to women. Only use to describe individuals who describe their identity as sapphic.
alternative label: Sapphist identity
broader: https://homosaurus.org/v3/homoit0001295
change note: Version 3.7.0
has top concept: Sexual identity
in scheme: v3
related: https://homosaurus.org/v3/homoit0002277

Sapphics
type: Concept
issued: 2022-11-08
modified: 2025-02-23
comment: Women and, in some definitions, non-binary people of any sexual identity or sexuality who are attracted to women. Some but not all sapphics use the term "sapphic" to describe their sexual identity or sexuality. Only use to describe individuals who self-identify as sapphic.
alternative label: Sapphists
broader: https://homosaurus.org/v3/homoit0000915
broader: https://homosaurus.org/v3/homoit0001297
change note: Version 3.7.0
has top concept: LGBTQ+ people
in scheme: v3
related: https://homosaurus.org/v3/homoit0002276

MLM (Men Loving Men)
type: Concept
issued: 2022-11-08
modified: 2025-02-23
comment: Slang term used to describe men who have romantic and/or sexual relationships with other men; often used as an alternative to the term "Men who have sex with men." Can be used to describe men who are exclusively or primarily interested in men, as well as men who are also interested in people of other or all genders. Only use to describe people who self-identify as MLM.
alternative label: Man loving man
alternative label: Men loving men
broader: https://homosaurus.org/v3/homoit0000915
broader: https://homosaurus.org/v3/homoit0001008
broader: https://homosaurus.org/v3/homoit0001297
change note: Version 3.7.0
has top concept: LGBTQ+ people
in scheme: v3
related: https://homosaurus.org/v3/homoit0000365
related: https://homosaurus.org/v3/homoit0001254

WLW (Women Loving Women)
type: Concept
issued: 2022-11-08
modified: 2025-02-23
comment: Slang term used to describe women who have romantic and/or sexual relationships with other women. Can be used to describe women who are exclusively or primarily interested in women, as well as women who are also interested in people of other or all genders. Only use to describe people who self-identify as WLW.
alternative label: Woman loving woman
alternative label: Women loving women
broader: https://homosaurus.org/v3/homoit0000915
broader: https://homosaurus.org/v3/homoit0001297
broader: https://homosaurus.org/v3/homoit0001509
change note: Version 3.7.0
has top concept: LGBTQ+ people
in scheme: v3
related: https://homosaurus.org/v3/homoit0001254
related: https://homosaurus.org/v3/homoit0003613

Mothers of queer people
type: Concept
issued: 2022-11-10
modified: 2025-02-23
comment: Individuals who assume the role of mother to a queer person or queer people; use only for individuals who self-identify as mothers.
alternative label: Moms of queer people
alternative label: Queer people's moms
alternative label: Queer people's mothers
broader: https://homosaurus.org/v3/homoit0002348
change note: Version 3.7.0
has top concept: Family members
in scheme: v3

Cisgender youth
type: Concept
issued: 2022-11-10
modified: 2025-02-23
comment: Cisgender people who are between the ages of childhood and adulthood.
alternative label: Cis youth
alternative label: Cisgender adolescents
alternative label: Cisgender teenagers
alternative label: Cisgender teens
broader: https://homosaurus.org/v3/homoit0000271
broader: https://homosaurus.org/v3/homoit0001520
change note: Version 3.7.0
has top concept: Cisgender people
in scheme: v3
narrower: https://homosaurus.org/v3/homoit0002282
narrower: https://homosaurus.org/v3/homoit0002283
narrower: https://homosaurus.org/v3/homoit0002284

Cisgender children
type: Concept
issued: 2022-11-10
modified: 2025-02-23
comment: Children younger than 18 years who identify as cisgender.
alternative label: Cis children
alternative label: Cis kids
alternative label: Cisgender kids
broader: https://homosaurus.org/v3/homoit0000255
broader: https://homosaurus.org/v3/homoit0000271
broader: https://homosaurus.org/v3/homoit0002281
change note: Version 3.7.0
has top concept: Family members
in scheme: v3
narrower: https://homosaurus.org/v3/homoit0002283
narrower: https://homosaurus.org/v3/homoit0002284

Cisgender boys
type: Concept
issued: 2022-11-10
modified: 2025-02-23
comment: Boys (typically children or youth younger than 18) who are cisgender.
alternative label: Cis boys
broader: https://homosaurus.org/v3/homoit0000220
broader: https://homosaurus.org/v3/homoit0002281
broader: https://homosaurus.org/v3/homoit0002282
change note: Version 3.7.0
has top concept: Family members
in scheme: v3

Cisgender girls
type: Concept
issued: 2022-11-10
modified: 2025-02-23
comment: Girls (typically children or youth younger than 18) who are cisgender.
alternative label: Cis girls
broader: https://homosaurus.org/v3/homoit0000590
broader: https://homosaurus.org/v3/homoit0002281
broader: https://homosaurus.org/v3/homoit0002282
change note: Version 3.7.0
has top concept: Family members
in scheme: v3

Heterosexual children
type: Concept
issued: 2022-11-10
modified: 2025-02-23
comment: Children younger than 18 years who identify as heterosexual.
alternative label: Heterosexual kids
alternative label: Straight children
alternative label: Straight kids
broader: https://homosaurus.org/v3/homoit0000255
broader: https://homosaurus.org/v3/homoit0000627
broader: https://homosaurus.org/v3/homoit0000630
change note: Version 3.7.0
has top concept: Family members
in scheme: v3
narrower: https://homosaurus.org/v3/homoit0000621
narrower: https://homosaurus.org/v3/homoit0000623

Yan daudu
type: Concept
issued: 2022-11-10
modified: 2025-02-23
comment: Nigerian term that directly translates to "feminine men" but cannot be easily understood through Euro-American understandings of gender. The term has been used to describe people who may identify variously as feminine men, gay men, both male and female (or third gender), and/or trans. While some people self-identify as yan daudu, others consider the term a slur. Only use to describe individuals who self-identify as yan daudu.
broader: https://homosaurus.org/v3/homoit0000322
change note: Version 3.7.0
has top concept: Gender
in scheme: v3

Mustaches
type: Concept
issued: 2022-11-10
modified: 2025-02-23
comment: Facial hair on the upper lip. Includes false or drag mustaches as well as naturally grown hair.
broader: https://homosaurus.org/v3/homoit0000605
change note: Version 3.7.0
has top concept: Sex (Body)
in scheme: v3
narrower: https://homosaurus.org/v3/homoit0002288
preferred label: Moustaches

Cookie dusters
type: Concept
issued: 2022-11-10
modified: 2025-02-23
comment: Slang term for mustaches or facial hair on the upper lip, particularly that of lesbians.
alternative label: Muff ticklers
alternative label: Pussy dusters
alternative label: Womb brooms
broader: https://homosaurus.org/v3/homoit0002287
change note: Version 3.7.0
has top concept: Sex (Body)
in scheme: v3
related: https://homosaurus.org/v3/homoit0000779

Chemsex
type: Concept
issued: 2022-11-10
modified: 2025-02-23
comment: Sexual activities that include the use of drugs, typically to trigger sexual arousal, increase sexual pleasure, and/or facilitate sexual encounters that last several hours or days.
broader: https://homosaurus.org/v3/homoit0001267
change note: Version 3.7.0
has top concept: Sex (Act)
in scheme: v3
related: https://homosaurus.org/v3/homoit0000399
related: https://homosaurus.org/v3/homoit0001235

Gender equality
type: Concept
issued: 2022-11-10
modified: 2025-02-23
comment: The state of equal ease of access to resources and opportunities regardless of gender, including economic participation and decision-making, as well as the state of valuing different behaviors, aspirations, and needs equally, regardless of gender.
broader: https://homosaurus.org/v3/homoit0000652
change note: Version 3.7.0
has top concept: Human rights
in scheme: v3
related: https://homosaurus.org/v3/homoit0000437
related: https://homosaurus.org/v3/homoit0000438

Asexual youth
type: Concept
issued: 2022-11-10
modified: 2025-02-23
comment: Asexual people who are between the ages of childhood and adulthood.
alternative label: Ace youth
alternative label: Asexual adolescents
alternative label: Asexual teenagers
alternative label: Asexual teens
broader: https://homosaurus.org/v3/homoit0000071
broader: https://homosaurus.org/v3/homoit0001521
change note: Version 3.7.0
has top concept: Sexual minorities
in scheme: v3
related: https://homosaurus.org/v3/homoit0002478

Piblings
type: Concept
issued: 2022-11-10
modified: 2025-02-23
comment: Gender-neutral term used to refer to the siblings or siblings-in-law of one's parents; an alternative to "aunts" or "uncles."
broader: https://homosaurus.org/v3/homoit0000421
change note: Version 3.7.0
has top concept: Family members
in scheme: v3

Niblings
type: Concept
issued: 2022-11-10
modified: 2025-02-23
comment: Gender-neutral term used to refer to the children of one's sibling; an alternative to "nephews" or "nieces."
broader: https://homosaurus.org/v3/homoit0000421
change note: Version 3.7.0
has top concept: Family members
in scheme: v3

Kashmiri LGBTQ+ people
type: Concept
issued: 2022-11-15
modified: 2025-02-23
comment: LGBTQ+ people who live in or are descended from those native to the Kashmir Valley in the Indian subcontinent.
alternative label: LGBTQ+ Kashmiri people
alternative label: LGBTQ+ Kashmiris
broader: https://homosaurus.org/v3/homoit0000860
broader: https://homosaurus.org/v3/homoit0001101
change note: Version 3.7.0
has top concept: LGBTQ+ people
in scheme: v3
narrower: https://homosaurus.org/v3/homoit0002296
narrower: https://homosaurus.org/v3/homoit0002297
narrower: https://homosaurus.org/v3/homoit0002298
narrower: https://homosaurus.org/v3/homoit0002299
narrower: https://homosaurus.org/v3/homoit0002300
narrower: https://homosaurus.org/v3/homoit0002301
narrower: https://homosaurus.org/v3/homoit0002302
narrower: https://homosaurus.org/v3/homoit0003414

Kashmiri lesbians
type: Concept
issued: 2022-11-15
modified: 2025-02-23
comment: Lesbians who live in or are descended from those native to the Kashmir Valley in the Indian subcontinent.
alternative label: Lesbian Kashmiris
broader: https://homosaurus.org/v3/homoit0002295
change note: Version 3.7.0
has top concept: LGBTQ+ people
in scheme: v3

Kashmiri gay men
type: Concept
issued: 2022-11-15
modified: 2025-02-23
comment: Gay men who live in or are descended from those native to the Kashmir Valley in the Indian subcontinent.
alternative label: Gay Kashmiri men
alternative label: Gay Kashmiris
broader: https://homosaurus.org/v3/homoit0002295
change note: Version 3.7.0
has top concept: LGBTQ+ people
in scheme: v3

Kashmiri bisexual people
type: Concept
issued: 2022-11-15
modified: 2025-02-23
comment: Bisexual people who live in or are descended from those native to the Kashmir Valley in the Indian subcontinent.
alternative label: Bisexual Kashmiri people
alternative label: Bisexual Kashmiris
broader: https://homosaurus.org/v3/homoit0002295
change note: Version 3.7.0
has top concept: LGBTQ+ people
in scheme: v3

Kashmiri queer people
type: Concept
issued: 2022-11-15
modified: 2025-02-23
comment: Queer people who live in or are descended from those native to the Kashmir Valley in the Indian subcontinent.
alternative label: Queer Kashmiri people
alternative label: Queer Kashmiris
broader: https://homosaurus.org/v3/homoit0002295
change note: Version 3.7.0
has top concept: LGBTQ+ people
in scheme: v3

Kashmiri transgender people
type: Concept
issued: 2022-11-15
modified: 2025-02-23
comment: Transgender people who live in or are descended from those native to the Kashmir Valley in the Indian subcontinent.
alternative label: Transgender Kashmiri people
alternative label: Transgender Kashmiris
broader: https://homosaurus.org/v3/homoit0002295
change note: Version 3.7.0
has top concept: LGBTQ+ people
in scheme: v3

Kashmiri intersex people
type: Concept
issued: 2022-11-15
modified: 2025-02-23
comment: Intersex people who live in or are descended from those native to the Kashmir Valley in the Indian subcontinent.
alternative label: Intersex Kashmiri people
alternative label: Intersex Kashmiris
broader: https://homosaurus.org/v3/homoit0002295
change note: Version 3.7.0
has top concept: LGBTQ+ people
in scheme: v3

Kashmiri asexual people
type: Concept
issued: 2022-11-15
modified: 2025-02-23
comment: Asexual people who live in or are descended from those native to the Kashmir Valley in the Indian subcontinent.
alternative label: Asexual Kashmiri people
alternative label: Asexual Kashmiris
broader: https://homosaurus.org/v3/homoit0002295
change note: Version 3.7.0
has top concept: LGBTQ+ people
in scheme: v3

Konkan LGBTQ+ people
type: Concept
issued: 2022-11-15
modified: 2025-02-23
comment: LGBTQ+ people who are from or descended from those native to the Konkan region of the Indian subcontinent, and who speak any of the dialects of the Konkani language.
alternative label: LGBTQ+ Konkani
broader: https://homosaurus.org/v3/homoit0000860
broader: https://homosaurus.org/v3/homoit0001101
change note: Version 3.7.0
has top concept: LGBTQ+ people
in scheme: v3
narrower: https://homosaurus.org/v3/homoit0002304
narrower: https://homosaurus.org/v3/homoit0002305
narrower: https://homosaurus.org/v3/homoit0002306
narrower: https://homosaurus.org/v3/homoit0002307
narrower: https://homosaurus.org/v3/homoit0002308
narrower: https://homosaurus.org/v3/homoit0002309
narrower: https://homosaurus.org/v3/homoit0002310
narrower: https://homosaurus.org/v3/homoit0003416

Konkan lesbians
type: Concept
issued: 2022-11-15
modified: 2025-02-23
comment: Lesbians who are from or descended from those native to the Konkan region of the Indian subcontinent, and who speak any of the dialects of the Konkani language.
alternative label: Lesbian Konkane
alternative label: Lesbian Konkani
broader: https://homosaurus.org/v3/homoit0002303
change note: Version 3.7.0
has top concept: LGBTQ+ people
in scheme: v3

Konkan gay men
type: Concept
issued: 2022-11-15
modified: 2025-02-23
comment: Gay men who are from or descended from those native to the Konkan region of the Indian subcontinent, and who speak any of the dialects of the Konkani language.
alternative label: Gay Konkani men
alternative label: Gay Konkano men
broader: https://homosaurus.org/v3/homoit0002303
change note: Version 3.7.0
has top concept: LGBTQ+ people
in scheme: v3

Konkan bisexual people
type: Concept
issued: 2022-11-15
modified: 2025-02-23
comment: Bisexual people who are from or descended from those native to the Konkan region of the Indian subcontinent, and who speak any of the dialects of the Konkani language.
alternative label: Bisexual Konkani
broader: https://homosaurus.org/v3/homoit0002303
change note: Version 3.7.0
has top concept: LGBTQ+ people
in scheme: v3

Konkan queer people
type: Concept
issued: 2022-11-15
modified: 2025-02-23
comment: Queer people who are from or descended from those native to the Konkan region of the Indian subcontinent, and who speak any of the dialects of the Konkani language.
alternative label: Queer Konkani
broader: https://homosaurus.org/v3/homoit0002303
change note: Version 3.7.0
has top concept: LGBTQ+ people
in scheme: v3

Konkan transgender people
type: Concept
issued: 2022-11-15
modified: 2025-02-23
comment: Transgender people who are from or descended from those native to the Konkan region of the Indian subcontinent, and who speak any of the dialects of the Konkani language.
alternative label: Transgender Konkani
broader: https://homosaurus.org/v3/homoit0002303
change note: Version 3.7.0
has top concept: LGBTQ+ people
in scheme: v3

Konkan intersex people
type: Concept
issued: 2022-11-15
modified: 2025-02-23
comment: Intersex people who are from or descended from those native to the Konkan region of the Indian subcontinent, and who speak any of the dialects of the Konkani language.
alternative label: Intersex Konkani
broader: https://homosaurus.org/v3/homoit0002303
change note: Version 3.7.0
has top concept: LGBTQ+ people
in scheme: v3

Konkan asexual people
type: Concept
issued: 2022-11-15
modified: 2025-02-23
comment: Asexual people who are from or descended from those native to the Konkan region of the Indian subcontinent, and who speak any of the dialects of the Konkani language.
alternative label: Asexual Konkani
broader: https://homosaurus.org/v3/homoit0002303
change note: Version 3.7.0
has top concept: LGBTQ+ people
in scheme: v3

Kumaoni LGBTQ+ people
type: Concept
issued: 2022-11-15
modified: 2025-02-23
comment: LGBTQ+ people who live mostly in Kumaon region in the Indian Himalayas. They might also speak the Kumaoni language as their first language.
alternative label: Kumain LGBTQ+ people
alternative label: Kumaiye LGBTQ+ people
alternative label: LGBTQ+ Kumaoni people
broader: https://homosaurus.org/v3/homoit0000860
broader: https://homosaurus.org/v3/homoit0001101
change note: Version 3.7.0
has top concept: LGBTQ+ people
in scheme: v3
narrower: https://homosaurus.org/v3/homoit0002312
narrower: https://homosaurus.org/v3/homoit0002313
narrower: https://homosaurus.org/v3/homoit0002314
narrower: https://homosaurus.org/v3/homoit0002315
narrower: https://homosaurus.org/v3/homoit0002316
narrower: https://homosaurus.org/v3/homoit0002317
narrower: https://homosaurus.org/v3/homoit0002318
narrower: https://homosaurus.org/v3/homoit0003417

Kumaoni lesbians
type: Concept
issued: 2022-11-15
modified: 2025-02-23
comment: Lesbians who live mostly in Kumaon region in the Indian Himalayas. They might also speak the Kumaoni language as their first language.
alternative label: Kumain lesbians
alternative label: Kumaiye lesbians
broader: https://homosaurus.org/v3/homoit0002311
change note: Version 3.7.0
has top concept: LGBTQ+ people
in scheme: v3

Kumaoni gay men
type: Concept
issued: 2022-11-15
modified: 2025-02-23
comment: Gay men who live mostly in Kumaon region in the Indian Himalayas. They might also speak the Kumaoni language as their first language.
alternative label: Kumain gay men
alternative label: Kumaiye gay men
broader: https://homosaurus.org/v3/homoit0002311
change note: Version 3.7.0
has top concept: LGBTQ+ people
in scheme: v3

Kumaoni bisexual people
type: Concept
issued: 2022-11-15
modified: 2025-02-23
comment: Bisexual people who live mostly in Kumaon region in the Indian Himalayas. They might also speak the Kumaoni language as their first language.
alternative label: Kumain bisexual people
alternative label: Kumaiye bisexual people
broader: https://homosaurus.org/v3/homoit0002311
change note: Version 3.7.0
has top concept: LGBTQ+ people
in scheme: v3

Kumaoni transgender people
type: Concept
issued: 2022-11-15
modified: 2025-02-23
comment: Transgender people who live mostly in Kumaon region in the Indian Himalayas. They might also speak the Kumaoni language as their first language.
alternative label: Kumain transgender people
alternative label: Kumaiye transgender people
broader: https://homosaurus.org/v3/homoit0002311
change note: Version 3.7.0
has top concept: LGBTQ+ people
in scheme: v3

Kumaoni queer people
type: Concept
issued: 2022-11-15
modified: 2025-02-23
comment: Queer people who live mostly in Kumaon region in the Indian Himalayas. They might also speak the Kumaoni language as their first language.
alternative label: Kumain queer people
alternative label: Kumaiye queer people
broader: https://homosaurus.org/v3/homoit0002311
change note: Version 3.7.0
has top concept: LGBTQ+ people
in scheme: v3

Kumaoni intersex people
type: Concept
issued: 2022-11-15
modified: 2025-02-23
comment: Intersex people who live mostly in Kumaon region in the Indian Himalayas. They might also speak the Kumaoni language as their first language.
alternative label: Kumain intersex people
alternative label: Kumaiye intersex people
broader: https://homosaurus.org/v3/homoit0002311
change note: Version 3.7.0
has top concept: LGBTQ+ people
in scheme: v3

Kumaoni asexual people
type: Concept
issued: 2022-11-15
modified: 2025-02-23
comment: Asexual people who live mostly in Kumaon region in the Indian Himalayas. They might also speak the Kumaoni language as their first language.
alternative label: Kumain asexual people
alternative label: Kumaiye asexual people
broader: https://homosaurus.org/v3/homoit0002311
change note: Version 3.7.0
has top concept: LGBTQ+ people
in scheme: v3

Kutchi LGBTQ+ people
type: Concept
issued: 2022-11-15
modified: 2025-02-23
comment: LGBTQ+ people who are from or are descended from those native to the Kutch district of the Indian state of Gujarat and the Sindh region of Pakistan.
alternative label: LGBTQ+ Kutchi people
broader: https://homosaurus.org/v3/homoit0000860
broader: https://homosaurus.org/v3/homoit0001101
change note: Version 3.7.0
has top concept: LGBTQ+ people
in scheme: v3
narrower: https://homosaurus.org/v3/homoit0002320
narrower: https://homosaurus.org/v3/homoit0002321
narrower: https://homosaurus.org/v3/homoit0002322
narrower: https://homosaurus.org/v3/homoit0002323
narrower: https://homosaurus.org/v3/homoit0002324
narrower: https://homosaurus.org/v3/homoit0002325
narrower: https://homosaurus.org/v3/homoit0002326
narrower: https://homosaurus.org/v3/homoit0003418

Kutchi lesbians
type: Concept
issued: 2022-11-15
modified: 2025-02-23
comment: Lesbians who are from or are descended from those native to the the Kutch district of the Indian state of Gujarat and the Sindh region of Pakistan.
alternative label: Lesbian Kutchi people
broader: https://homosaurus.org/v3/homoit0002319
change note: Version 3.7.0
has top concept: LGBTQ+ people
in scheme: v3

Kutchi gay men
type: Concept
issued: 2022-11-15
modified: 2025-02-23
comment: Gay men who are from or are descended from those native to the the Kutch district of the Indian state of Gujarat and the Sindh region of Pakistan.
alternative label: Gay Kutchi men
broader: https://homosaurus.org/v3/homoit0002319
change note: Version 3.7.0
has top concept: LGBTQ+ people
in scheme: v3

Kutchi bisexual people
type: Concept
issued: 2022-11-15
modified: 2025-02-23
comment: Bisexual people who are from or are descended from those native to the the Kutch district of the Indian state of Gujarat and the Sindh region of Pakistan.
alternative label: Bisexual Kutchi people
broader: https://homosaurus.org/v3/homoit0002319
change note: Version 3.7.0
has top concept: LGBTQ+ people
in scheme: v3

Kutchi queer people
type: Concept
issued: 2022-11-15
modified: 2025-02-23
comment: Queer people who are from or are descended from those native to the the Kutch district of the Indian state of Gujarat and the Sindh region of Pakistan.
alternative label: Queer Kutchi people
broader: https://homosaurus.org/v3/homoit0002319
change note: Version 3.7.0
has top concept: LGBTQ+ people
in scheme: v3

Kutchi intersex people
type: Concept
issued: 2022-11-15
modified: 2025-02-23
comment: Intersex people who are from or are descended from those native to the the Kutch district of the Indian state of Gujarat and the Sindh region of Pakistan.
alternative label: Intersex Kutchi people
broader: https://homosaurus.org/v3/homoit0002319
change note: Version 3.7.0
has top concept: LGBTQ+ people
in scheme: v3

Kutchi transgender people
type: Concept
issued: 2022-11-15
modified: 2025-02-23
comment: Transgender people who are from or are descended from those native to the the Kutch district of the Indian state of Gujarat and the Sindh region of Pakistan.
alternative label: Transgender Kutchi people
broader: https://homosaurus.org/v3/homoit0002319
change note: Version 3.7.0
has top concept: LGBTQ+ people
in scheme: v3

Kutchi asexual people
type: Concept
issued: 2022-11-15
modified: 2025-02-23
comment: Asexual people who are from or are descended from those native to the Kutch district of the Indian state of Gujarat and the Sindh region of Pakistan.
alternative label: Asexual Kutchi people
broader: https://homosaurus.org/v3/homoit0002319
change note: Version 3.7.0
has top concept: LGBTQ+ people
in scheme: v3

LGBTQ+ cinema
type: Concept
issued: 2022-11-15
modified: 2025-02-23
comment: Term that encompasses LGBTQ+ filmmaking, the LGBTQ+ film industry, and film as an art form within LGBTQ+ culture. For specific movies created by or representing LGBTQ+ people, use the term "LGBTQ+ films."
alternative label: Cinema (LGBTQ)
alternative label: Film (LGBTQ)
alternative label: LGBTQ+ film
broader: https://homosaurus.org/v3/homoit0000816
change note: Version 3.7.0
has top concept: Subcultures
in scheme: v3
narrower: https://homosaurus.org/v3/homoit0000869
narrower: https://homosaurus.org/v3/homoit0002328
narrower: https://homosaurus.org/v3/homoit0002330
narrower: https://homosaurus.org/v3/homoit0003160
narrower: https://homosaurus.org/v3/homoit0003700
related: https://homosaurus.org/v3/homoit0000867
related: https://homosaurus.org/v3/homoit0000868

Lesbian cinema
type: Concept
issued: 2022-11-15
modified: 2025-02-23
comment: Term that encompasses lesbian filmmaking, the lesbian film industry, and film as an art form within lesbian culture. For specific movies created by or representing lesbians, use the term "Lesbian films."
alternative label: Lesbian film
broader: https://homosaurus.org/v3/homoit0002327
change note: Version 3.7.0
has top concept: Subcultures
in scheme: v3
narrower: https://homosaurus.org/v3/homoit0002329

Lesbian films
type: Concept
issued: 2022-11-15
modified: 2025-02-23
comment: Motion pictures, or movies, created by lesbian directors, depicting lesbians, or that are regarded as important within lesbian culture.
alternative label: Lesbian movies
broader: https://homosaurus.org/v3/homoit0000869
broader: https://homosaurus.org/v3/homoit0002328
change note: Version 3.7.0
has top concept: Subcultures
in scheme: v3
narrower: https://homosaurus.org/v3/homoit0000765

Gay cinema
type: Concept
issued: 2022-11-15
modified: 2025-02-23
comment: Term that encompasses gay filmmaking, the gay film industry, and film as an art form within gay culture. For specific movies created by or representing gay men, use the term "Gay films."
alternative label: Gay film
broader: https://homosaurus.org/v3/homoit0002327
change note: Version 3.7.0
has top concept: Subcultures
in scheme: v3
narrower: https://homosaurus.org/v3/homoit0002331

Gay films
type: Concept
issued: 2022-11-15
modified: 2025-02-23
comment: Motion pictures, or movies, created by gay directors, depicting gay men, or that are regarded as important within gay culture.
alternative label: Gay movies
broader: https://homosaurus.org/v3/homoit0000869
broader: https://homosaurus.org/v3/homoit0002330
change note: Version 3.7.0
has top concept: Subcultures
in scheme: v3
narrower: https://homosaurus.org/v3/homoit0000520

Two-Spirit history
type: Concept
issued: 2022-11-15
modified: 2025-02-23
comment: Past events or accounts of the past concerning Two-Spirit people, or people who might be perceived as Two-Spirit if they were alive today.
alternative label: 2S history
alternative label: Two Spirit history
alternative label: Two Spirited history
alternative label: Two-Spirited history
broader: https://homosaurus.org/v3/homoit0002260
change note: Version 3.7.0
has top concept: LGBTQ+ history
in scheme: v3

Black asexual people
type: Concept
issued: 2022-12-13
modified: 2025-02-23
comment: Black people who are asexual. Use only for individuals who self-identity as Black. Follow the individual’s preference for African American or Black whenever possible.
alternative label: Asexual Black people
alternative label: Black ace people
broader: https://homosaurus.org/v3/homoit0000208
change note: Version 3.7.0
has top concept: LGBTQ+ people
in scheme: v3
narrower: https://homosaurus.org/v3/homoit0002893
narrower: https://homosaurus.org/v3/homoit0002894
narrower: https://homosaurus.org/v3/homoit0002896
narrower: https://homosaurus.org/v3/homoit0002898

African American asexual people
type: Concept
issued: 2022-12-13
modified: 2025-02-23
comment: Asexual people of African descent born in the United States or asexual people born in African countries who live in or have a strong connection to the United States. Use for individuals who self-identity as African American. Follow the individual’s preference for African American or Black whenever possible.
alternative label: African American ace people
alternative label: Asexual African American people
alternative label: Asexual African Americans
broader: https://homosaurus.org/v3/homoit0000015
change note: Version 3.7.0
has top concept: LGBTQ+ people
in scheme: v3

Adopted LGBTQ+ people
type: Concept
issued: 2022-12-13
modified: 2025-02-23
comment: LGBTQ+ people who were adopted, whether or not by LGBTQ+ parents.
alternative label: Adopted people (LGBTQ)
alternative label: LGBTQ+ adopted people
broader: https://homosaurus.org/v3/homoit0000915
change note: Version 3.7.0
has top concept: LGBTQ+ people
in scheme: v3

LGBTQ+ fathers
type: Concept
issued: 2022-12-13
modified: 2025-02-23
comment: LGBTQ+ people who are fathers.
alternative label: Dads (LGBTQ)
alternative label: Fathers (LGBTQ)
alternative label: LGBTQ+ dads
broader: https://homosaurus.org/v3/homoit0000423
broader: https://homosaurus.org/v3/homoit0001075
change note: Version 3.7.0
has top concept: Family members
in scheme: v3
narrower: https://homosaurus.org/v3/homoit0001413
narrower: https://homosaurus.org/v3/homoit0002338
narrower: https://homosaurus.org/v3/homoit0002339
narrower: https://homosaurus.org/v3/homoit0002340
narrower: https://homosaurus.org/v3/homoit0002341
narrower: https://homosaurus.org/v3/homoit0002741
narrower: https://homosaurus.org/v3/homoit0002792

Bisexual fathers
type: Concept
issued: 2022-12-13
modified: 2025-02-23
comment: Bisexual people who are fathers.
alternative label: Bisexual dads
broader: https://homosaurus.org/v3/homoit0002337
change note: Version 3.7.0
has top concept: Family members
in scheme: v3

Gay fathers
type: Concept
issued: 2022-12-13
modified: 2025-02-23
comment: Gay men who are fathers.
alternative label: Gay dads
broader: https://homosaurus.org/v3/homoit0002337
change note: Version 3.7.0
has top concept: Family members
in scheme: v3

Lesbian fathers
type: Concept
issued: 2022-12-13
modified: 2025-02-23
comment: Lesbians who are fathers. This includes non-binary people who have children and identify as fathers, as well as trans women who had children before transitioning and still identify as fathers to those children. Do not use to describe lesbian parents unless they self-identify as fathers.
alternative label: Lesbian dads
broader: https://homosaurus.org/v3/homoit0002337
change note: Version 3.7.0
has top concept: Family members
in scheme: v3

Queer fathers
type: Concept
issued: 2022-12-13
modified: 2025-02-23
comment: Queer people who are fathers.
alternative label: Queer dads
broader: https://homosaurus.org/v3/homoit0002337
change note: Version 3.7.0
has top concept: Family members
in scheme: v3

Fathers of LGBTQ+ people
type: Concept
issued: 2022-12-13
modified: 2025-02-23
comment: People who act as a father to one or more LGBTQ+ person. For fathers who are themselves LGBTQ+, use the term "LGBTQ+ fathers."
alternative label: Dads of LGBTQ+ people
broader: https://homosaurus.org/v3/homoit0000423
change note: Version 3.7.0
has top concept: Family members
in scheme: v3
narrower: https://homosaurus.org/v3/homoit0000424
narrower: https://homosaurus.org/v3/homoit0000425
narrower: https://homosaurus.org/v3/homoit0000426
narrower: https://homosaurus.org/v3/homoit0000427
narrower: https://homosaurus.org/v3/homoit0000428
narrower: https://homosaurus.org/v3/homoit0002766
narrower: https://homosaurus.org/v3/homoit0002907
narrower: https://homosaurus.org/v3/homoit0003406

LGBTQ+ mothers
type: Concept
issued: 2022-12-13
modified: 2025-02-23
comment: LGBTQ+ people who are mothers.
alternative label: LGBTQ+ moms
alternative label: Moms (LGBTQ)
alternative label: Mothers (LGBTQ)
broader: https://homosaurus.org/v3/homoit0001021
broader: https://homosaurus.org/v3/homoit0001075
change note: Version 3.7.0
has top concept: Family members
in scheme: v3
narrower: https://homosaurus.org/v3/homoit0001422
narrower: https://homosaurus.org/v3/homoit0002344
narrower: https://homosaurus.org/v3/homoit0002345
narrower: https://homosaurus.org/v3/homoit0002346
narrower: https://homosaurus.org/v3/homoit0002347
narrower: https://homosaurus.org/v3/homoit0002795
narrower: https://homosaurus.org/v3/homoit0002916

Bisexual mothers
type: Concept
issued: 2022-12-13
modified: 2025-02-23
comment: Bisexual people who are mothers.
alternative label: Bisexual moms
broader: https://homosaurus.org/v3/homoit0002343
change note: Version 3.7.0
has top concept: Family members
in scheme: v3

Gay mothers
type: Concept
issued: 2022-12-13
modified: 2025-02-23
comment: Gay men who are mothers. This includes trans men who had children before transitioning and still identify as mothers to those children. Do not use to describe gay parents unless they self-identify as mothers.
alternative label: Gay moms
broader: https://homosaurus.org/v3/homoit0002343
change note: Version 3.7.0
has top concept: Family members
in scheme: v3

Lesbian mothers
type: Concept
issued: 2022-12-13
modified: 2025-02-23
comment: Lesbians who are mothers.
alternative label: Lesbian moms
broader: https://homosaurus.org/v3/homoit0002343
change note: Version 3.7.0
has top concept: Family members
in scheme: v3

Queer mothers
type: Concept
issued: 2022-12-13
modified: 2025-02-23
comment: Queer people who are mothers.
alternative label: Queer moms
broader: https://homosaurus.org/v3/homoit0002343
change note: Version 3.7.0
has top concept: Family members
in scheme: v3

Mothers of LGBTQ+ people
type: Concept
issued: 2022-12-13
modified: 2025-02-23
comment: People who act as a mother to one or more LGBTQ+ person. For mothers who are themselves LGBTQ+, use the term "LGBTQ+ mothers."
alternative label: Moms of LGBTQ+ people
broader: https://homosaurus.org/v3/homoit0001021
change note: Version 3.7.0
has top concept: Family members
in scheme: v3
narrower: https://homosaurus.org/v3/homoit0001022
narrower: https://homosaurus.org/v3/homoit0001023
narrower: https://homosaurus.org/v3/homoit0001024
narrower: https://homosaurus.org/v3/homoit0001025
narrower: https://homosaurus.org/v3/homoit0002280
narrower: https://homosaurus.org/v3/homoit0002909
narrower: https://homosaurus.org/v3/homoit0002962

LGBTQ+ siblings
type: Concept
issued: 2022-12-13
modified: 2025-02-23
comment: LGBTQ+ people who have siblings.
alternative label: Siblings (LGBTQ)
broader: https://homosaurus.org/v3/homoit0000915
broader: https://homosaurus.org/v3/homoit0001310
change note: Version 3.7.0
has top concept: LGBTQ+ people
in scheme: v3
related: https://homosaurus.org/v3/homoit0002623

Siblings of LGBTQ+ people
type: Concept
issued: 2022-12-13
modified: 2025-02-23
comment: People who share a sibling relationship with one or more LGBTQ+ person. For siblings who are themselves LGBTQ+, use the term "LGBTQ+ siblings."
broader: https://homosaurus.org/v3/homoit0001310
change note: Version 3.7.0
has top concept: Family members
in scheme: v3

Daughters
type: Concept
issued: 2022-12-13
modified: 2025-02-23
comment: People who are daughters.
broader: https://homosaurus.org/v3/homoit0000421
change note: Version 3.7.0
has top concept: Family members
in scheme: v3
narrower: https://homosaurus.org/v3/homoit0000330
narrower: https://homosaurus.org/v3/homoit0002352

Daughters of LGBTQ+ people
type: Concept
issued: 2022-12-13
modified: 2025-02-23
comment: Daughters who have one or more LGBTQ+ parent. For daughters who are themselves LGBTQ+, use the term "LGBTQ+ daughters."
broader: https://homosaurus.org/v3/homoit0002351
change note: Version 3.7.0
has top concept: Family members
in scheme: v3
narrower: https://homosaurus.org/v3/homoit0000331
narrower: https://homosaurus.org/v3/homoit0000332
narrower: https://homosaurus.org/v3/homoit0000333
narrower: https://homosaurus.org/v3/homoit0000334
narrower: https://homosaurus.org/v3/homoit0000335
narrower: https://homosaurus.org/v3/homoit0002765
narrower: https://homosaurus.org/v3/homoit0002906
narrower: https://homosaurus.org/v3/homoit0003404

Sons
type: Concept
issued: 2022-12-13
modified: 2025-02-23
comment: People who are sons.
broader: https://homosaurus.org/v3/homoit0000421
change note: Version 3.7.0
has top concept: Family members
in scheme: v3
narrower: https://homosaurus.org/v3/homoit0001329
narrower: https://homosaurus.org/v3/homoit0002355
narrower: https://homosaurus.org/v3/homoit0003244

Sons of LGBTQ+ people
type: Concept
issued: 2022-12-13
modified: 2025-02-23
comment: Sons who have one or more LGBTQ+ parent. For sons who are themselves LGBTQ+, use the term "LGBTQ+ sons."
broader: https://homosaurus.org/v3/homoit0002353
change note: Version 3.7.0
has top concept: Family members
in scheme: v3
narrower: https://homosaurus.org/v3/homoit0001330
narrower: https://homosaurus.org/v3/homoit0001331
narrower: https://homosaurus.org/v3/homoit0001332
narrower: https://homosaurus.org/v3/homoit0001333
narrower: https://homosaurus.org/v3/homoit0001334
narrower: https://homosaurus.org/v3/homoit0002745
narrower: https://homosaurus.org/v3/homoit0002914

LGBTQ+ grandchildren
type: Concept
issued: 2022-12-13
modified: 2025-02-23
comment: LGBTQ+ people who are grandchildren.
alternative label: Grandchildren (LGBTQ)
broader: https://homosaurus.org/v3/homoit0000601
broader: https://homosaurus.org/v3/homoit0000915
change note: Version 3.7.0
has top concept: Family members
in scheme: v3

Grandchildren of LGBTQ+ people
type: Concept
issued: 2022-12-13
modified: 2025-02-23
comment: People who have one or more LGBTQ+ grandparent. For grandchildren who are themselves LGBTQ+, use the term "LGBTQ+ grandchildren."
broader: https://homosaurus.org/v3/homoit0000601
change note: Version 3.7.0
has top concept: Family members
in scheme: v3

LGBTQ+ grandparents
type: Concept
issued: 2022-12-13
modified: 2025-02-23
comment: LGBTQ+ people who are grandparents.
alternative label: Grandparents (LGBTQ)
broader: https://homosaurus.org/v3/homoit0000602
broader: https://homosaurus.org/v3/homoit0000915
change note: Version 3.7.0
has top concept: Family members
in scheme: v3
related: https://homosaurus.org/v3/homoit0002586

Grandparents of LGBTQ+ people
type: Concept
issued: 2022-12-13
modified: 2025-02-23
comment: People who have one or more LGBTQ+ grandchild. For grandparents who are themselves LGBTQ+, use the term "LGBTQ+ grandparents."
broader: https://homosaurus.org/v3/homoit0000602
change note: Version 3.7.0
has top concept: Family members
in scheme: v3

LGBTQ+ family members
type: Concept
issued: 2022-12-13
modified: 2025-02-23
comment: Family members who are LGBTQ+.
alternative label: Family members (LGBTQ)
broader: https://homosaurus.org/v3/homoit0000421
broader: https://homosaurus.org/v3/homoit0000915
change note: Version 3.7.0
has top concept: Family members
in scheme: v3

Family members of LGBTQ+ people
type: Concept
issued: 2022-12-13
modified: 2025-02-23
comment: People who have one or more LGBTQ+ family member. For family members who are themselves LGBTQ+, use the term "LGBTQ+ family members."
broader: https://homosaurus.org/v3/homoit0000421
change note: Version 3.7.0
has top concept: Family members
in scheme: v3

Lesbian children
type: Concept
issued: 2022-12-13
modified: 2025-02-23
comment: Lesbians who have not yet reached the age of adolescence.
alternative label: Lesbian kids
broader: https://homosaurus.org/v3/homoit0000256
change note: Version 3.7.0
has top concept: Family members
in scheme: v3
related: https://homosaurus.org/v3/homoit0000743

Gay children
type: Concept
issued: 2022-12-13
modified: 2025-02-23
comment: Gay people who have not yet reached the age of adolescence.
alternative label: Gay kids
broader: https://homosaurus.org/v3/homoit0000256
change note: Version 3.7.0
has top concept: Family members
in scheme: v3
related: https://homosaurus.org/v3/homoit0000479

Partners of LGBTQ+ people
type: Concept
issued: 2022-12-13
modified: 2025-02-23
comment: Individuals who have one ore more romantic, sexual, or play partner who is LGBTQ+.
broader: https://homosaurus.org/v3/homoit0002365
change note: Version 3.7.0
has top concept: Partners
in scheme: v3
narrower: https://homosaurus.org/v3/homoit0001084
narrower: https://homosaurus.org/v3/homoit0001086
narrower: https://homosaurus.org/v3/homoit0001087
narrower: https://homosaurus.org/v3/homoit0001088
narrower: https://homosaurus.org/v3/homoit0001089
narrower: https://homosaurus.org/v3/homoit0002743
narrower: https://homosaurus.org/v3/homoit0002911

Lesbian partners
type: Concept
issued: 2022-12-13
modified: 2025-02-23
comment: Lesbians who are the romantic, sexual, or play partners of another person or people.
broader: https://homosaurus.org/v3/homoit0001083
change note: Version 3.7.0
has top concept: LGBTQ+ families
in scheme: v3

Gay partners
type: Concept
issued: 2022-12-13
modified: 2025-02-23
comment: Gay men who are the romantic, sexual, or play partners of another person or people.
broader: https://homosaurus.org/v3/homoit0001083
change note: Version 3.7.0
has top concept: LGBTQ+ families
in scheme: v3

Bisexual partners
type: Concept
issued: 2022-12-13
modified: 2025-02-23
comment: Bisexual people who are the romantic, sexual, or play partners of another person or people.
broader: https://homosaurus.org/v3/homoit0001083
change note: Version 3.7.0
has top concept: LGBTQ+ families
in scheme: v3

Transgender partners
type: Concept
issued: 2022-12-13
modified: 2025-02-23
comment: Transgender people who are the romantic, sexual, or play partners of another person or people.
broader: https://homosaurus.org/v3/homoit0001083
change note: Version 3.7.0
has top concept: LGBTQ+ families
in scheme: v3

Queer partners
type: Concept
issued: 2022-12-13
modified: 2025-02-23
comment: Queer people who are the romantic, sexual, or play partners of another person or people.
broader: https://homosaurus.org/v3/homoit0001083
change note: Version 3.7.0
has top concept: LGBTQ+ families
in scheme: v3

Parents
type: Concept
issued: 2022-12-13
modified: 2025-02-23
comment: People who act as parents to one or more people.
broader: https://homosaurus.org/v3/homoit0000421
change note: Version 3.7.0
has top concept: Family members
in scheme: v3
narrower: https://homosaurus.org/v3/homoit0000010
narrower: https://homosaurus.org/v3/homoit0000121
narrower: https://homosaurus.org/v3/homoit0000452
narrower: https://homosaurus.org/v3/homoit0001075
narrower: https://homosaurus.org/v3/homoit0001076
narrower: https://homosaurus.org/v3/homoit0001764
narrower: https://homosaurus.org/v3/homoit0002224

Police entrapment of LGBTQ+ people
type: Concept
issued: 2023-01-13
modified: 2025-02-23
comment: A practice in which law enforcement agents or agents of the state coerce an LGBTQ+ person to commit a "crime" they would have otherwise been unlikely or unwilling to commit. Legal definitions of entrapment vary widely depending on the jurisdiction, but the term is often used colloquially to refer to police acting dishonestly or in bad faith, as well as policing focused on anticipating and inducing crime, rather than responding to reports of crime.
broader: https://homosaurus.org/v3/homoit0001120
broader: https://homosaurus.org/v3/homoit0002373
change note: Version 3.7.0
has top concept: Harassment
in scheme: v3

Police harassment of LGBTQ+ people
type: Concept
issued: 2023-01-13
modified: 2025-02-23
comment: Any of various forms of inappropriate conduct, illegal actions, or abuses of power undertaken by law enforcement agents or agents of the state against LGBTQ+ members of the public. This includes but is not limited to racial, ethnic, and other forms of profiling; unwarranted surveillance, searches, and seizure; selective enforcement; excessive use of force; sexual misconduct; intimidation and witness tampering; falsification of evidence; coerced confessions; false arrests and imprisonment; and bribing or lobbying.
alternative label: Mistreatment of LGBTQ+ people by police
alternative label: Harassment of LGBTQ+ people by police
alternative label: Police brutality toward LGBTQ+ people
alternative label: Police misconduct toward LGBTQ+ people
alternative label: Police mistreatment of LGBTQ+ people
broader: https://homosaurus.org/v3/homoit0001121
broader: https://homosaurus.org/v3/homoit0002373
change note: Version 3.7.0
has top concept: Harassment
in scheme: v3
narrower: https://homosaurus.org/v3/homoit0002376
narrower: https://homosaurus.org/v3/homoit0002377

Police harassment of Black LGBTQ+ people
type: Concept
issued: 2023-01-13
modified: 2025-02-23
comment: Any of various forms of inappropriate conduct, illegal actions, or abuses of power undertaken by law enforcement agents or agents of the state against Black LGBTQ+ members of the public. This includes but is not limited to racial, ethnic, and other forms of profiling; unwarranted surveillance, searches, and seizure; selective enforcement; excessive use of force; sexual misconduct; intimidation and witness tampering; falsification of evidence; coerced confessions; false arrests and imprisonment; and bribing or lobbying.
broader: https://homosaurus.org/v3/homoit0002375
change note: Version 3.7.0
has top concept: Harassment
in scheme: v3
related: https://homosaurus.org/v3/homoit0000208
related: https://homosaurus.org/v3/homoit0002257
related: https://homosaurus.org/v3/homoit0002397

Police harassment of Indigenous LGBTQ+ people
type: Concept
issued: 2023-01-13
modified: 2025-02-23
comment: Any of various forms of inappropriate conduct, illegal actions, or abuses of power undertaken by law enforcement agents or agents of the state against Indigenous LGBTQ+ members of the public. This includes but is not limited to racial, ethnic, and other forms of profiling; unwarranted surveillance, searches, and seizure; selective enforcement; excessive use of force; sexual misconduct; intimidation and witness tampering; falsification of evidence; coerced confessions; false arrests and imprisonment; and bribing or lobbying.
broader: https://homosaurus.org/v3/homoit0002375
change note: Version 3.7.0
has top concept: Harassment
in scheme: v3
related: https://homosaurus.org/v3/homoit0000886
related: https://homosaurus.org/v3/homoit0002397

Police violence toward LGBTQ+ people
type: Concept
issued: 2023-01-13
modified: 2025-02-23
comment: Any of various forms of police violence aimed toward LGBTQ+ people.
alternative label: Police abuse toward LGBTQ+ people
alternative label: Police torture of LGBTQ+ people
broader: https://homosaurus.org/v3/homoit0000059
broader: https://homosaurus.org/v3/homoit0002373
change note: Version 3.7.0
has top concept: Anti-LGBTQ+ violence
in scheme: v3
narrower: https://homosaurus.org/v3/homoit0002381
narrower: https://homosaurus.org/v3/homoit0002395

LGBTQ+ criminalization
type: Concept
issued: 2023-01-13
modified: 2025-02-23
comment: Criminalization of existing or identifying as an LGBTQ+ person, being perceived as LGBTQ+, or engaging in any of various actions considered to be linked to LGBTQ+ status.
alternative label: Criminalization of LGBTQ+ people
broader: https://homosaurus.org/v3/homoit0000314
change note: Version 3.7.0
has top concept: Law
in scheme: v3
narrower: https://homosaurus.org/v3/homoit0002380
related: https://homosaurus.org/v3/homoit0000356

Criminalization of homosexuality
type: Concept
issued: 2023-01-13
modified: 2025-02-23
comment: Criminalization of acts considered to be sexual or romantic between individuals perceived as being of the same gender category in a given sociocultural context.
alternative label: Criminalization of same-gender relations
alternative label: Criminalization of same-sex relations
broader: https://homosaurus.org/v3/homoit0002379
change note: Version 3.7.0
has top concept: Law
in scheme: v3
related: https://homosaurus.org/v3/homoit0001326

Police raids on LGBTQ+-related establishments
type: Concept
issued: 2023-01-13
modified: 2025-02-23
comment: Unexpected and unannounced entry into and searches of establishments owned or frequented by LGBTQ+ people by law enforcement officers with the aim of using surprise to seize evidence or arrest suspects. Police raids may be undertaken legally using a search warrant or through exigent circumstances, such as probable cause, though the latter is highly subjective and civilians often have little resources to appeal illegal raids.
alternative label: Anti-LGBTQ+ police raids
alternative label: Police raids on LGBTQ+ establishments
alternative label: Police raids on LGBTQ+ venues
alternative label: Police raids to LGBTQ+ venues
broader: https://homosaurus.org/v3/homoit0001122
broader: https://homosaurus.org/v3/homoit0002378
change note: Version 3.7.0
has top concept: Harassment
in scheme: v3
narrower: https://homosaurus.org/v3/homoit0002382
narrower: https://homosaurus.org/v3/homoit0002383
narrower: https://homosaurus.org/v3/homoit0002384
narrower: https://homosaurus.org/v3/homoit0002385
related: https://homosaurus.org/v3/homoit0001735
related: https://homosaurus.org/v3/homoit0001741

Police raids on LGBTQ+ bathhouses
type: Concept
issued: 2023-01-13
modified: 2025-02-23
comment: Unexpected and unannounced entry into and searches of bathouses, saunas, or spas owned or frequented by LGBTQ+ people by law enforcement officers with the aim of using surprise to seize evidence or arrest suspects. Police raids may be undertaken legally using a search warrant or through exigent circumstances, such as probable cause, though the latter is highly subjective and civilians often have little resources to appeal illegal raids.
broader: https://homosaurus.org/v3/homoit0002381
change note: Version 3.7.0
has top concept: Harassment
in scheme: v3
related: https://homosaurus.org/v3/homoit0000475

Police raids on LGBTQ+ meeting places
type: Concept
issued: 2023-01-13
modified: 2025-02-23
comment: Unexpected and unannounced entry into and searches of meeting places owned or frequented by LGBTQ+ people, including individuals' residences, businesses, and other institutions, by law enforcement officers with the aim of using surprise to seize evidence or arrest suspects. Police raids may be undertaken legally using a search warrant or through exigent circumstances, such as probable cause, though the latter is highly subjective and civilians often have little resources to appeal illegal raids.
broader: https://homosaurus.org/v3/homoit0002381
change note: Version 3.7.0
has top concept: Harassment
in scheme: v3

Police raids on LGBTQ+ bars
type: Concept
issued: 2023-01-13
modified: 2025-02-23
comment: Unexpected and unannounced entry into and searches of drinking establishments owned or frequented by LGBTQ+ people by law enforcement officers with the aim of using surprise to seize evidence or arrest suspects. Police raids may be undertaken legally using a search warrant or through exigent circumstances, such as probable cause, though the latter is highly subjective and civilians often have little resources to appeal illegal raids.
broader: https://homosaurus.org/v3/homoit0002381
change note: Version 3.7.0
has top concept: Harassment
in scheme: v3
related: https://homosaurus.org/v3/homoit0000100

Police raids on LGBTQ+ nightclubs
type: Concept
issued: 2023-01-13
modified: 2025-02-23
comment: Unexpected and unannounced entry into and searches of nightclubs owned or frequented by LGBTQ+ people by law enforcement officers with the aim of using surprise to seize evidence or arrest suspects. Police raids may be undertaken legally using a search warrant or through exigent circumstances, such as probable cause, though the latter is highly subjective and civilians often have little resources to appeal illegal raids.
broader: https://homosaurus.org/v3/homoit0002381
change note: Version 3.7.0
has top concept: Harassment
in scheme: v3
related: https://homosaurus.org/v3/homoit0000909

Non-binary parents
type: Concept
issued: 2023-01-13
modified: 2025-02-23
comment: Parents who are non-binary.
broader: https://homosaurus.org/v3/homoit0001048
broader: https://homosaurus.org/v3/homoit0001075
change note: Version 3.7.0
has top concept: LGBTQ+ people
in scheme: v3

Criminalization of gender non-conformity
type: Concept
issued: 2023-01-13
modified: 2025-02-23
comment: Criminalization of any expression of gender considered to be nonconforming in a given sociocultural context.
broader: https://homosaurus.org/v3/homoit0000314
change note: Version 3.7.0
has top concept: Law
in scheme: v3
narrower: https://homosaurus.org/v3/homoit0002389
related: https://homosaurus.org/v3/homoit0001922

Criminalization of cross-dressing
type: Concept
issued: 2023-01-13
modified: 2025-02-23
comment: Criminalization of any expression of gender considered to be cross-dressing in a given sociocultural context.
broader: https://homosaurus.org/v3/homoit0002388
change note: Version 3.7.0
has top concept: Law
in scheme: v3

Defund the police movement
type: Concept
issued: 2023-01-13
modified: 2025-02-23
comment: Primarily a U.S. American and Canadian movement which supports divesting funds from, or abolition of, police departments (and often police structures generally) and reallocating them to non-policing forms of public safety and community support, such as social services, youth services, housing, education, healthcare and other community resources.
alternative label: Defund the Police
alternative label: Movement to defund police
broader: https://homosaurus.org/v3/homoit0001322
change note: Version 3.7.0
has top concept: Social movements
in scheme: v3
related: https://homosaurus.org/v3/homoit0001119
related: https://homosaurus.org/v3/homoit0002391

Police abolitionist movement
type: Concept
issued: 2023-01-13
modified: 2025-02-23
comment: A primarily U.S. American and Canadian political movement that advocates replacing policing with other systems of public safety. Police abolitionists believe that policing, as a system, is inherently flawed and cannot be reformed—a view that rejects the ideology of police reformists. While reformists seek to address the ways in which policing occurs, abolitionists seek to transform policing altogether through a process of disbanding, disempowering, and disarming the police. Abolitionists argue that the institution of policing is deeply rooted in a history of white supremacy and settler colonialism and that it is inseparable from a pre-existing racial capitalist order, and thus believe a reformist approach to policing will always fail.
alternative label: Abolishing the police movement
broader: https://homosaurus.org/v3/homoit0001322
change note: Version 3.7.0
has top concept: Social movements
in scheme: v3
related: https://homosaurus.org/v3/homoit0001119
related: https://homosaurus.org/v3/homoit0002390

Identification of LGBTQ+ people by police
type: Concept
issued: 2023-01-13
modified: 2025-02-23
comment: Identification of LGBTQ+ people, or people believed to be LGBTQ+, by police using any of various tools and mechanisms, many of which are pseudoscientific in nature. Such data is then used to entrap and prosecute LGBTQ+ persons, especially in areas where being LGBTQ+ is still criminalized.
broader: https://homosaurus.org/v3/homoit0002373
change note: Version 3.7.0
has top concept: Police interactions with LGBTQ+ people
in scheme: v3
narrower: https://homosaurus.org/v3/homoit0002393
related: https://homosaurus.org/v3/homoit0001065

Digital identification of LGBTQ+ people by police
type: Concept
issued: 2023-01-13
modified: 2025-02-23
comment: Identification of LGBTQ+ people, or people believed to be LGBTQ+, by police using digital tools, such as phone records, mobile applications, facial identification algorithms, and artificial intelligence technologies. Such data is then used to entrap and prosecute LGBTQ+ persons, especially in areas where being LGBTQ+ is still criminalized.
alternative label: Digital stop and search to identify LGBTQ+ people
alternative label: Identification of LGBTQ+ people by police using phone data
alternative label: Police use of digital tools to identify LGBTQ+ people
broader: https://homosaurus.org/v3/homoit0002392
change note: Version 3.7.0
has top concept: Police interactions with LGBTQ+ people
in scheme: v3
related: https://homosaurus.org/v3/homoit0000846
related: https://homosaurus.org/v3/homoit0000847

Attitudes of LGBTQ+ people toward police
type: Concept
issued: 2023-01-13
modified: 2025-02-23
comment: Attitudes and assessments of feelings, relationships, and interactions between LGBTQ+ people and police.
alternative label: LGBTQ+ viewpoints on police
alternative label: LGBTQ+ views of police
alternative label: Perceptions of police by LGBTQ+ communities
alternative label: Perceptions of police by LGBTQ+ people
broader: https://homosaurus.org/v3/homoit0002373
change note: Version 3.7.0
has top concept: Police interactions with LGBTQ+ people
in scheme: v3

Shootings of LGBTQ+ people by police
type: Concept
issued: 2023-01-13
modified: 2025-02-23
comment: Shooting of LGBTQ+ individuals or individuals perceived as being LGBTQ+ by police officers.
broader: https://homosaurus.org/v3/homoit0002378
change note: Version 3.7.0
has top concept: Anti-LGBTQ+ violence
in scheme: v3

Performative LGBTQ+ activism by police
type: Concept
issued: 2023-01-13
modified: 2025-02-23
comment: LGBTQ+ activism undertaken by police organizations and institutions which intends to increase the social capital of such institutions, rather than to actually serve LGBTQ+ communities.
alternative label: Gay copaganda
alternative label: LGBTQ+ copaganda
alternative label: Pinkwashing by police officers
alternative label: Pride patches on police uniforms
alternative label: Rainbow colored patrol cars
alternative label: Rainbow hate crime cars
alternative label: Rainbow-hued police cars
alternative label: Rainbow-painted police cars
alternative label: Rainbow-washing by police officers
broader: https://homosaurus.org/v3/homoit0002373
change note: Version 3.7.0
has top concept: Police interactions with LGBTQ+ people
in scheme: v3
related: https://homosaurus.org/v3/homoit0000006

Black Lives Matter movement
type: Concept
issued: 2023-01-13
modified: 2025-02-23
comment: A primarily U.S. American and Canadian decentralized political and social movement advocating for non-violent civil disobedience in protest against incidents of police brutality and all racially motivated violence against Black people. The broader movement and its related organizations typically advocate against police violence towards Black people, as well as for various other policy changes considered to be related to Black liberation.
alternative label: BLM
alternative label: Black Lives Matter
alternative label: BlackLivesMatter
alternative label: Movement for Black Lives
broader: https://homosaurus.org/v3/homoit0001322
change note: Version 3.7.0
has top concept: Social movements
in scheme: v3
narrower: https://homosaurus.org/v3/homoit0002399
related: https://homosaurus.org/v3/homoit0000208

Black Trans Lives Matter movement
type: Concept
issued: 2023-01-13
modified: 2025-02-23
comment: A part of the Black Lives Matter movement which specifically advocates for Black trans people (especially Black trans women) and fights for racial equity and Black liberation.
alternative label: BTLM Movement
alternative label: BTLM
broader: https://homosaurus.org/v3/homoit0002398
change note: Version 3.7.0
has top concept: Social movements
in scheme: v3
related: https://homosaurus.org/v3/homoit0000208
related: https://homosaurus.org/v3/homoit0001396

Aromantic comics
type: Concept
issued: 2023-01-14
modified: 2025-02-23
comment: Works consisting of sequential images often accompanied by text; use in reference to comics focusing on aromantic characters or themes.
broader: https://homosaurus.org/v3/homoit0000841
change note: Version 3.7.0
has top concept: Subcultures
in scheme: v3

Aromantic poetry
type: Concept
issued: 2023-01-17
modified: 2025-02-23
comment: Literary work, typically written in verse, that focuses on aromantic characters, themes, or identity.
broader: https://homosaurus.org/v3/homoit0001118
change note: Version 3.7.0
has top concept: Subcultures
in scheme: v3
related: https://homosaurus.org/v3/homoit0001748
related: https://homosaurus.org/v3/homoit0002449

Intersex comics
type: Concept
issued: 2023-01-17
modified: 2025-02-23
comment: Works consisting of sequential images often accompanied by text; use in reference to comics focusing on intersexual characters or themes.
broader: https://homosaurus.org/v3/homoit0000841
change note: Version 3.7.0
has top concept: Subcultures
in scheme: v3

Intersex poetry
type: Concept
issued: 2023-01-17
modified: 2025-02-23
comment: Literary work, typically written in verse, that focuses on intersex characters, themes, or identity.
broader: https://homosaurus.org/v3/homoit0001118
change note: Version 3.7.0
has top concept: Subcultures
in scheme: v3

Asexual comics
type: Concept
issued: 2023-01-17
modified: 2025-02-23
comment: Works consisting of sequential images often accompanied by text; use in reference to comics focusing on asexual characters or themes.
broader: https://homosaurus.org/v3/homoit0000841
change note: Version 3.7.0
has top concept: Subcultures
in scheme: v3

Asexual poetry
type: Concept
issued: 2023-01-17
modified: 2025-02-23
comment: Literary work, typically written in verse, that focuses on asexual characters, themes, or identity.
broader: https://homosaurus.org/v3/homoit0001118
change note: Version 3.7.0
has top concept: Subcultures
in scheme: v3
related: https://homosaurus.org/v3/homoit0001747
related: https://homosaurus.org/v3/homoit0002467

Demisexual comics
type: Concept
issued: 2023-01-17
modified: 2025-02-23
comment: Works consisting of sequential images often accompanied by text; use in reference to comics focusing on demisexual characters or themes.
broader: https://homosaurus.org/v3/homoit0000841
change note: Version 3.7.0
has top concept: Subcultures
in scheme: v3

Demisexual fiction
type: Concept
issued: 2023-01-17
modified: 2025-02-23
comment: Written works describing imagined events or people; use in reference to fictional works focusing on demisexual characters or themes.
broader: https://homosaurus.org/v3/homoit0000443
change note: Version 3.7.0
has top concept: Subcultures
in scheme: v3
narrower: https://homosaurus.org/v3/homoit0002420
narrower: https://homosaurus.org/v3/homoit0002426
narrower: https://homosaurus.org/v3/homoit0002430
narrower: https://homosaurus.org/v3/homoit0002436
narrower: https://homosaurus.org/v3/homoit0002438
narrower: https://homosaurus.org/v3/homoit0002444
related: https://homosaurus.org/v3/homoit0002484
related: https://homosaurus.org/v3/homoit0002487

Demisexual poetry
type: Concept
issued: 2023-01-17
modified: 2025-02-23
comment: Literary work, typically written in verse, that focuses on demisexual characters, themes, or identity.
broader: https://homosaurus.org/v3/homoit0001118
change note: Version 3.7.0
has top concept: Subcultures
in scheme: v3
related: https://homosaurus.org/v3/homoit0002484
related: https://homosaurus.org/v3/homoit0002487

Asexual erotic literature
type: Concept
issued: 2023-01-17
modified: 2025-02-23
comment: Literary works that have erotic or sexual elements; use in reference to erotic literature focusing on asexual characters or themes.
broader: https://homosaurus.org/v3/homoit0000859
change note: Version 3.7.0
has top concept: Erotica
in scheme: v3

Intersex erotic literature
type: Concept
issued: 2023-01-17
modified: 2025-02-23
comment: Literary works that have erotic or sexual elements; use in reference to erotic literature focusing on intersex characters or themes.
broader: https://homosaurus.org/v3/homoit0000859
change note: Version 3.7.0
has top concept: Erotica
in scheme: v3

Demisexual erotic literature
type: Concept
issued: 2023-01-17
modified: 2025-02-23
comment: Literary works that have erotic or sexual elements; use in reference to erotic literature focusing on demisexual characters or themes.
broader: https://homosaurus.org/v3/homoit0000859
change note: Version 3.7.0
has top concept: Erotica
in scheme: v3

Asexual fantasy fiction
type: Concept
issued: 2023-01-17
modified: 2025-02-23
comment: Genre that uses magic and other supernatural phenomena as a primary element of plot, theme, and/or setting; use for fantasy fiction focusing on asexual characters or themes.
broader: https://homosaurus.org/v3/homoit0000865
broader: https://homosaurus.org/v3/homoit0001754
change note: Version 3.7.0
has top concept: Subcultures
in scheme: v3

Aromantic fantasy fiction
type: Concept
issued: 2023-01-24
modified: 2025-02-23
comment: Genre that uses magic and other supernatural phenomena as a primary element of plot, theme, and/or setting; use for fantasy fiction focusing on aromantic characters or themes.
broader: https://homosaurus.org/v3/homoit0000865
broader: https://homosaurus.org/v3/homoit0001753
change note: Version 3.7.0
has top concept: Subcultures
in scheme: v3

Intersex fantasy fiction
type: Concept
issued: 2023-01-24
modified: 2025-02-23
comment: Genre that uses magic and other supernatural phenomena as a primary element of plot, theme, and/or setting; use for fantasy fiction focusing on intersex characters or themes.
broader: https://homosaurus.org/v3/homoit0000865
broader: https://homosaurus.org/v3/homoit0001752
change note: Version 3.7.0
has top concept: Subcultures
in scheme: v3

Demisexual fantasy fiction
type: Concept
issued: 2023-01-24
modified: 2025-02-23
comment: Genre that uses magic and other supernatural phenomena as a primary element of plot, theme, and/or setting; use for fantasy fiction focusing on demisexual characters or themes.
broader: https://homosaurus.org/v3/homoit0000865
broader: https://homosaurus.org/v3/homoit0002407
change note: Version 3.7.0
has top concept: Subcultures
in scheme: v3

Asexual graphic novels
type: Concept
issued: 2023-01-24
modified: 2025-02-23
comment: Works consisting of sequential images often accompanied by text that generally contain stand-alone stories; used in reference to graphic novels focusing on asexual characters or themes.
broader: https://homosaurus.org/v3/homoit0000874
change note: Version 3.7.0
has top concept: Subcultures
in scheme: v3

Demisexual graphic novels
type: Concept
issued: 2023-01-24
modified: 2025-02-23
comment: Works consisting of sequential images often accompanied by text that generally contain stand-alone stories; used in reference to graphic novels focusing on demisexual characters or themes.
broader: https://homosaurus.org/v3/homoit0000874
change note: Version 3.7.0
has top concept: Subcultures
in scheme: v3

Aromantic graphic novels
type: Concept
issued: 2023-01-24
modified: 2025-02-23
comment: Works consisting of sequential images often accompanied by text that generally contain stand-alone stories; used in reference to graphic novels focusing on aromantic characters or themes.
broader: https://homosaurus.org/v3/homoit0000874
change note: Version 3.7.0
has top concept: Subcultures
in scheme: v3

Intersex graphic novels
type: Concept
issued: 2023-01-24
modified: 2025-02-23
comment: Works consisting of sequential images often accompanied by text that generally contain stand-alone stories; used in reference to graphic novels focusing on intersex characters or themes.
broader: https://homosaurus.org/v3/homoit0000874
change note: Version 3.7.0
has top concept: Subcultures
in scheme: v3

Demisexual horror fiction
type: Concept
issued: 2023-01-24
modified: 2025-02-23
comment: Written works of fiction intended to frighten, scare, or disgust; use in reference to horror fiction focusing on demisexual characters or themes.
broader: https://homosaurus.org/v3/homoit0001580
broader: https://homosaurus.org/v3/homoit0002407
change note: Version 3.7.0
has top concept: Subcultures
in scheme: v3

Aromantic horror fiction
type: Concept
issued: 2023-01-24
modified: 2025-02-23
comment: Written works of fiction intended to frighten, scare, or disgust; use in reference to horror fiction focusing on aromantic characters or themes.
broader: https://homosaurus.org/v3/homoit0001580
broader: https://homosaurus.org/v3/homoit0001753
change note: Version 3.7.0
has top concept: Subcultures
in scheme: v3

Intersex horror fiction
type: Concept
issued: 2023-01-24
modified: 2025-02-23
comment: Written works of fiction intended to frighten, scare, or disgust; use in reference to horror fiction focusing on intersex characters or themes.
broader: https://homosaurus.org/v3/homoit0001580
broader: https://homosaurus.org/v3/homoit0001752
change note: Version 3.7.0
has top concept: Subcultures
in scheme: v3

Asexual mystery and detective fiction
type: Concept
issued: 2023-01-24
modified: 2025-02-23
comment: Written literary works about the investigation of crime or the work of detectives; use in reference to mystery and detective fiction focusing on asexual characters and themes.
broader: https://homosaurus.org/v3/homoit0000852
broader: https://homosaurus.org/v3/homoit0001754
change note: Version 3.7.0
has top concept: Subcultures
in scheme: v3

Demisexual mystery and detective fiction
type: Concept
issued: 2023-01-24
modified: 2025-02-23
comment: Written literary works about the investigation of crime or the work of detectives; use in reference to mystery and detective fiction focusing on demisexual characters and themes.
broader: https://homosaurus.org/v3/homoit0000852
broader: https://homosaurus.org/v3/homoit0002407
change note: Version 3.7.0
has top concept: Subcultures
in scheme: v3

Aromantic mystery and detective fiction
type: Concept
issued: 2023-01-24
modified: 2025-02-23
comment: Written literary works about the investigation of crime or the work of detectives; use in reference to mystery and detective fiction focusing on aromantic characters and themes.
broader: https://homosaurus.org/v3/homoit0000852
broader: https://homosaurus.org/v3/homoit0001753
change note: Version 3.7.0
has top concept: Subcultures
in scheme: v3

Intersex mystery and detective fiction
type: Concept
issued: 2023-01-24
modified: 2025-02-23
comment: Written literary works about the investigation of crime or the work of detectives; use in reference to mystery and detective fiction focusing on intersex characters and themes.
broader: https://homosaurus.org/v3/homoit0000852
broader: https://homosaurus.org/v3/homoit0001752
change note: Version 3.7.0
has top concept: Subcultures
in scheme: v3

Asexual romance fiction
type: Concept
issued: 2023-01-24
modified: 2025-02-23
comment: Works of fiction revolving around romantic and/or sexual relationships between the main characters; use in reference to romance fiction focusing on asexual characters.
broader: https://homosaurus.org/v3/homoit0001586
broader: https://homosaurus.org/v3/homoit0001754
change note: Version 3.7.0
has top concept: Subcultures
in scheme: v3

Aromantic romance fiction
type: Concept
issued: 2023-01-24
modified: 2025-02-23
comment: Works of fiction revolving around romantic and/or sexual relationships between the main characters; use in reference to romance fiction focusing on aromantic characters.
broader: https://homosaurus.org/v3/homoit0001586
broader: https://homosaurus.org/v3/homoit0001753
change note: Version 3.7.0
has top concept: Subcultures
in scheme: v3

Intersex romance fiction
type: Concept
issued: 2023-01-24
modified: 2025-02-23
comment: Works of fiction revolving around romantic and/or sexual relationships between the main characters; use in reference to romance fiction focusing on intersex characters.
broader: https://homosaurus.org/v3/homoit0001586
broader: https://homosaurus.org/v3/homoit0001752
change note: Version 3.7.0
has top concept: Subcultures
in scheme: v3

Demisexual romance fiction
type: Concept
issued: 2023-01-24
modified: 2025-02-23
comment: Works of fiction revolving around romantic and/or sexual relationships between the main characters; use in reference to romance fiction focusing on demisexual characters.
broader: https://homosaurus.org/v3/homoit0001586
broader: https://homosaurus.org/v3/homoit0002407
change note: Version 3.7.0
has top concept: Subcultures
in scheme: v3

Asexual science fiction
type: Concept
issued: 2023-01-24
modified: 2025-02-23
comment: Written literary work about imaginative or futuristic concepts incorporating science, technology, space, time travel, and other speculative elements; use in reference to science fiction focusing on asexual characters or themes.
broader: https://homosaurus.org/v3/homoit0000934
broader: https://homosaurus.org/v3/homoit0001754
change note: Version 3.7.0
has top concept: Subcultures
in scheme: v3

Demisexual science fiction
type: Concept
issued: 2023-01-24
modified: 2025-02-23
comment: Written literary work about imaginative or futuristic concepts incorporating science, technology, space, time travel, and other speculative elements; use in reference to science fiction focusing on demisexual characters or themes.
broader: https://homosaurus.org/v3/homoit0000934
broader: https://homosaurus.org/v3/homoit0002407
change note: Version 3.7.0
has top concept: Subcultures
in scheme: v3

Aromantic science fiction
type: Concept
issued: 2023-01-24
modified: 2025-02-23
comment: Written literary work about imaginative or futuristic concepts incorporating science, technology, space, time travel, and other speculative elements; use in reference to science fiction focusing on aromantic characters or themes.
broader: https://homosaurus.org/v3/homoit0000934
broader: https://homosaurus.org/v3/homoit0001753
change note: Version 3.7.0
has top concept: Subcultures
in scheme: v3

Intersex science fiction
type: Concept
issued: 2023-01-24
modified: 2025-02-23
comment: Written literary work about imaginative or futuristic concepts incorporating science, technology, space, time travel, and other speculative elements; use in reference to science fiction focusing on intersex characters or themes.
broader: https://homosaurus.org/v3/homoit0000934
broader: https://homosaurus.org/v3/homoit0001752
change note: Version 3.7.0
has top concept: Subcultures
in scheme: v3

Asexual short stories
type: Concept
issued: 2023-01-24
modified: 2025-02-23
comment: Written literary works that are short in length and detail a self-contained incident or concept; use in reference to short stories focusing on asexual characters or themes.
broader: https://homosaurus.org/v3/homoit0001608
change note: Version 3.7.0
has top concept: Subcultures
in scheme: v3

Aromantic short stories
type: Concept
issued: 2023-01-24
modified: 2025-02-23
comment: Written literary works that are short in length and detail a self-contained incident or concept; use in reference to short stories focusing on aromantic characters or themes.
broader: https://homosaurus.org/v3/homoit0001608
change note: Version 3.7.0
has top concept: Subcultures
in scheme: v3

Intersex short stories
type: Concept
issued: 2023-01-24
modified: 2025-02-23
comment: Written literary works that are short in length and detail a self-contained incident or concept; use in reference to short stories focusing on intersex characters or themes.
broader: https://homosaurus.org/v3/homoit0001608
change note: Version 3.7.0
has top concept: Subcultures
in scheme: v3

Demisexual short stories
type: Concept
issued: 2023-01-24
modified: 2025-02-23
comment: Written literary works that are short in length and detail a self-contained incident or concept; use in reference to short stories focusing on demisexual characters or themes.
broader: https://homosaurus.org/v3/homoit0001608
broader: https://homosaurus.org/v3/homoit0002407
change note: Version 3.7.0
has top concept: Subcultures
in scheme: v3

Transgender films
type: Concept
issued: 2023-03-17
modified: 2025-02-23
comment: Motion pictures, or movies, created by transgender directors, depicting transgender people, or that are regarded as important within transgender culture.
broader: https://homosaurus.org/v3/homoit0000869
change note: Version 3.7.0
has top concept: Subcultures
in scheme: v3

Queer films
type: Concept
issued: 2023-03-17
modified: 2025-02-23
comment: Motion pictures, or movies, created by queer directors, depicting queer people, or that are regarded as important within queer culture.
broader: https://homosaurus.org/v3/homoit0000869
change note: Version 3.7.0
has top concept: Subcultures
in scheme: v3

Bisexual films
type: Concept
issued: 2023-03-17
modified: 2025-02-23
comment: Motion pictures, or movies, created by bisexual directors, depicting bisexual people, or that are regarded as important within bisexual culture.
broader: https://homosaurus.org/v3/homoit0000869
change note: Version 3.7.0
has top concept: Subcultures
in scheme: v3

Aromantic literature
type: Concept
issued: 2023-03-20
modified: 2025-02-23
comment: Written literary works about aromanticism, aromantic characters, or aromantic themes.
broader: https://homosaurus.org/v3/homoit0000972
change note: Version 3.7.0
has top concept: Subcultures
in scheme: v3
related: https://homosaurus.org/v3/homoit0001748
related: https://homosaurus.org/v3/homoit0002401
related: https://homosaurus.org/v3/homoit0002452

Aromantic erotic literature
type: Concept
issued: 2023-03-20
modified: 2025-02-23
comment: Literary works with erotic or sexual elements; use in reference to erotic literature focusing on aromantic characters or themes.
broader: https://homosaurus.org/v3/homoit0000859
change note: Version 3.7.0
has top concept: Erotica
in scheme: v3

Aromantic drama
type: Concept
issued: 2023-03-20
modified: 2025-02-23
comment: Works of fiction written to be performed; use in reference to dramatic works focusing on aromantic characters or themes.
broader: https://homosaurus.org/v3/homoit0000376
change note: Version 3.7.0
has top concept: Subcultures
in scheme: v3
related: https://homosaurus.org/v3/homoit0002449
related: https://homosaurus.org/v3/homoit0002453

Aromantic theater
type: Concept
issued: 2023-03-20
modified: 2025-02-23
comment: Works in the performance arts that focus on aromantic characters, communities, or issues.
broader: https://homosaurus.org/v3/homoit0001363
change note: Version 3.7.0
has top concept: LGBTQ+ theater
in scheme: v3
related: https://homosaurus.org/v3/homoit0002452

Aromantic youth
type: Concept
issued: 2023-03-20
modified: 2025-02-23
comment: Aromantic people who are between the ages of childhood and adulthood.
broader: https://homosaurus.org/v3/homoit0001521
change note: Version 3.7.0
has top concept: Youth
in scheme: v3
related: https://homosaurus.org/v3/homoit0000880
related: https://homosaurus.org/v3/homoit0002461

Aromantic youth literature
type: Concept
issued: 2023-03-23
modified: 2025-02-23
comment: Written literary works for an audience of readers from 12-18 years of age, also known as young adult literature or YA; use in reference to youth literature focusing on aromantic characters or themes.
broader: https://homosaurus.org/v3/homoit0001522
change note: Version 3.7.0
has top concept: Subcultures
in scheme: v3
related: https://homosaurus.org/v3/homoit0002460

Aromantic history
type: Concept
issued: 2023-03-23
modified: 2025-02-23
comment: Past events or accounts of the past concerning aromantic people, or people who might be perceived as aromantic if they were alive today.
broader: https://homosaurus.org/v3/homoit0002260
change note: Version 3.7.0
has top concept: LGBTQ+ history
in scheme: v3

Aromantic autobiographies
type: Concept
issued: 2023-03-23
modified: 2025-02-23
comment: Accounts of aromantic peoples' lives written by those people. For written accounts of aromantic people's lives that were not written by the subject, use "Aromantic biographies."
broader: https://homosaurus.org/v3/homoit0001729
change note: Version 3.7.0
has top concept: LGBTQ+ autobiographies
in scheme: v3
related: https://homosaurus.org/v3/homoit0001730
related: https://homosaurus.org/v3/homoit0001731
related: https://homosaurus.org/v3/homoit0001748
related: https://homosaurus.org/v3/homoit0002464

Aromantic biographies
type: Concept
issued: 2023-03-23
modified: 2025-02-23
comment: Written accounts of the lives of aromantic people. For written accounts of aromantic people's lives written by the subject, use "Aromantic autobiographies."
broader: https://homosaurus.org/v3/homoit0001614
change note: Version 3.7.0
has top concept: LGBTQ+ biographies
in scheme: v3
related: https://homosaurus.org/v3/homoit0001748
related: https://homosaurus.org/v3/homoit0002463

Aromantic literary criticism
type: Concept
issued: 2023-03-23
modified: 2025-02-23
comment: The study, evaluation, and interpretation of literary works focusing on aromantic characters or themes; can also include interpretation of literature through the lens and frameworks of aromantic studies.
broader: https://homosaurus.org/v3/homoit0001602
change note: Version 3.7.0
has top concept: LGBTQ+ literary criticism
in scheme: v3
related: https://homosaurus.org/v3/homoit0001603
related: https://homosaurus.org/v3/homoit0001604
related: https://homosaurus.org/v3/homoit0001605
related: https://homosaurus.org/v3/homoit0001606
related: https://homosaurus.org/v3/homoit0001607
related: https://homosaurus.org/v3/homoit0001748

Asexual literature
type: Concept
issued: 2023-03-23
modified: 2025-02-23
comment: Written literary works about asexuality, asexual characters, or asexual themes.
broader: https://homosaurus.org/v3/homoit0000972
change note: Version 3.7.0
has top concept: Subcultures
in scheme: v3
related: https://homosaurus.org/v3/homoit0001747
related: https://homosaurus.org/v3/homoit0001754
related: https://homosaurus.org/v3/homoit0002405
related: https://homosaurus.org/v3/homoit0002468

Asexual drama
type: Concept
issued: 2023-03-23
modified: 2025-02-23
comment: Works of fiction written to be performed; use in reference to dramatic works focusing on asexual characters or themes.
broader: https://homosaurus.org/v3/homoit0000376
change note: Version 3.7.0
has top concept: Subcultures
in scheme: v3
related: https://homosaurus.org/v3/homoit0002467
related: https://homosaurus.org/v3/homoit0002469

Asexual theater
type: Concept
issued: 2023-03-23
modified: 2025-02-23
comment: Works in the performance arts that focus on asexual characters, communities, or issues.
broader: https://homosaurus.org/v3/homoit0001363
change note: Version 3.7.0
has top concept: LGBTQ+ theater
in scheme: v3
related: https://homosaurus.org/v3/homoit0002468

Asexual horror fiction
type: Concept
issued: 2023-03-23
modified: 2025-02-23
comment: Written works of fiction intended to frighten, scare, or disgust; use in reference to horror fiction focusing on asexual characters or themes.
broader: https://homosaurus.org/v3/homoit0001580
change note: Version 3.7.0
has top concept: Subcultures
in scheme: v3

Asexual youth literature
type: Concept
issued: 2023-03-23
modified: 2025-02-23
comment: Written literary works for an audience of readers from 12-18 years of age, also known as young adult literature or YA; use in reference to youth literature focusing on asexual characters or themes.
broader: https://homosaurus.org/v3/homoit0001522
change note: Version 3.7.0
has top concept: Subcultures
in scheme: v3
related: https://homosaurus.org/v3/homoit0002292

Asexual autobiographies
type: Concept
issued: 2023-03-24
modified: 2025-02-23
comment: Accounts of asexual peoples' lives written by those people. For written accounts of asexual people's lives that were not written by the subject, use "Asexual biographies."
broader: https://homosaurus.org/v3/homoit0001729
change note: Version 3.7.0
has top concept: LGBTQ+ autobiographies
in scheme: v3
related: https://homosaurus.org/v3/homoit0001730
related: https://homosaurus.org/v3/homoit0001731
related: https://homosaurus.org/v3/homoit0001747
related: https://homosaurus.org/v3/homoit0002481

Asexual biographies
type: Concept
issued: 2023-03-24
modified: 2025-02-23
comment: Written accounts of the lives of asexual people. For written accounts of asexual people's lives written by the subject, use "Asexual autobiographies."
broader: https://homosaurus.org/v3/homoit0001614
change note: Version 3.7.0
has top concept: LGBTQ+ biographies
in scheme: v3
related: https://homosaurus.org/v3/homoit0001747
related: https://homosaurus.org/v3/homoit0002480

Asexual literary criticism
type: Concept
issued: 2023-03-26
modified: 2025-02-23
comment: The study, evaluation, and interpretation of literary works focusing on asexual characters or themes; can also include interpretation of literature through the lens and frameworks of asexual studies.
broader: https://homosaurus.org/v3/homoit0001602
change note: Version 3.7.0
has top concept: LGBTQ+ literary criticism
in scheme: v3
related: https://homosaurus.org/v3/homoit0001603
related: https://homosaurus.org/v3/homoit0001604
related: https://homosaurus.org/v3/homoit0001605
related: https://homosaurus.org/v3/homoit0001606
related: https://homosaurus.org/v3/homoit0001607
related: https://homosaurus.org/v3/homoit0001747

Demisexual literature
type: Concept
issued: 2023-03-26
modified: 2025-02-23
comment: Written literary works about demisexuality, demisexual characters, or demisexual themes.
broader: https://homosaurus.org/v3/homoit0000972
change note: Version 3.7.0
has top concept: Subcultures
in scheme: v3
related: https://homosaurus.org/v3/homoit0002407
related: https://homosaurus.org/v3/homoit0002408
related: https://homosaurus.org/v3/homoit0002485
related: https://homosaurus.org/v3/homoit0002487

Demisexual drama
type: Concept
issued: 2023-03-26
modified: 2025-02-23
comment: Works of fiction written to be performed; use in reference to dramatic works focusing on demisexual characters or themes.
broader: https://homosaurus.org/v3/homoit0000376
change note: Version 3.7.0
has top concept: Subcultures
in scheme: v3
related: https://homosaurus.org/v3/homoit0002484
related: https://homosaurus.org/v3/homoit0002486

Demisexual theater
type: Concept
issued: 2023-03-26
modified: 2025-02-23
comment: Works in the performance arts that focus on demisexual characters, communities, or issues.
broader: https://homosaurus.org/v3/homoit0001363
change note: Version 3.7.0
has top concept: LGBTQ+ theater
in scheme: v3
related: https://homosaurus.org/v3/homoit0002485

Demisexual authors
type: Concept
issued: 2023-03-26
modified: 2025-02-23
comment: Demisexual creators of written works.
broader: https://homosaurus.org/v3/homoit0001723
change note: Version 3.7.0
has top concept: LGBTQ+ people
in scheme: v3
related: https://homosaurus.org/v3/homoit0002407
related: https://homosaurus.org/v3/homoit0002408
related: https://homosaurus.org/v3/homoit0002484
related: https://homosaurus.org/v3/homoit0002491
related: https://homosaurus.org/v3/homoit0002492
related: https://homosaurus.org/v3/homoit0002493

Demisexual history
type: Concept
issued: 2023-03-26
modified: 2025-02-23
comment: Past events or accounts of the past concerning demisexual people, or people who might be perceived as demisexual if they were alive today.
broader: https://homosaurus.org/v3/homoit0002260
change note: Version 3.7.0
has top concept: LGBTQ+ history
in scheme: v3

Demisexual youth
type: Concept
issued: 2023-03-28
modified: 2025-02-23
comment: Demisexual people between the ages of childhood and adulthood.
broader: https://homosaurus.org/v3/homoit0001521
change note: Version 3.7.0
has top concept: Youth
in scheme: v3
related: https://homosaurus.org/v3/homoit0002490

Demisexual youth literature
type: Concept
issued: 2023-03-28
modified: 2025-02-23
comment: Written literary works for an audience of readers from 12-18 years of age, also known as young adult literature or YA; use in reference to youth literature focusing on demisexual characters or themes.
broader: https://homosaurus.org/v3/homoit0001522
change note: Version 3.7.0
has top concept: Subcultures
in scheme: v3
related: https://homosaurus.org/v3/homoit0002489

Demisexual autobiographies
type: Concept
issued: 2023-03-28
modified: 2025-02-23
comment: Accounts of demisexual peoples' lives written by those people. For written accounts of demisexual people's lives that were not written by the subject, use "Demisexual biographies."
broader: https://homosaurus.org/v3/homoit0001729
change note: Version 3.7.0
has top concept: LGBTQ+ autobiographies
in scheme: v3
related: https://homosaurus.org/v3/homoit0002487
related: https://homosaurus.org/v3/homoit0002492

Demisexual biographies
type: Concept
issued: 2023-03-28
modified: 2025-02-23
comment: Written accounts of the lives of demisexual people. For written accounts of demisexual people's lives written by the subject, use "Demisexual autobiographies."
broader: https://homosaurus.org/v3/homoit0001614
change note: Version 3.7.0
has top concept: LGBTQ+ biographies
in scheme: v3
related: https://homosaurus.org/v3/homoit0002487
related: https://homosaurus.org/v3/homoit0002491

Demisexual literary criticism
type: Concept
issued: 2023-03-28
modified: 2025-02-23
comment: The study, evaluation, and interpretation of literary works focusing on demisexual characters or themes; can also include interpretation of literature through the lens and frameworks of demisexual studies.
broader: https://homosaurus.org/v3/homoit0001602
change note: Version 3.7.0
has top concept: LGBTQ+ literary criticism
in scheme: v3
related: https://homosaurus.org/v3/homoit0002487

Megasexual erotic literature
type: Concept
issued: 2023-03-29
modified: 2025-02-23
comment: Literary works with erotic or sexual elements; use in reference to erotic literature focusing on megasexual characters or themes.
broader: https://homosaurus.org/v3/homoit0000859
change note: Version 3.7.0
has top concept: Erotica
in scheme: v3

Megasexual fantasy fiction
type: Concept
issued: 2023-03-29
modified: 2025-02-23
comment: Written works that include magical or fantastical elements; use in reference to fantasy fiction focusing on megasexual characters or themes.
broader: https://homosaurus.org/v3/homoit0000865
change note: Version 3.7.0
has top concept: Subcultures
in scheme: v3

Megasexual horror fiction
type: Concept
issued: 2023-03-29
modified: 2025-02-23
comment: Written works of fiction intended to frighten, scare, or disgust; use in reference to horror fiction focusing on megasexual characters or themes.
broader: https://homosaurus.org/v3/homoit0001580
change note: Version 3.7.0
has top concept: Subcultures
in scheme: v3

Megasexual mystery and detective fiction
type: Concept
issued: 2023-03-29
modified: 2025-02-23
comment: Written literary works about the investigation of crime or the work of detectives; use in reference to mystery and detective fiction focusing on megasexual characters or themes.
broader: https://homosaurus.org/v3/homoit0000852
change note: Version 3.7.0
has top concept: Subcultures
in scheme: v3

Megasexual romance fiction
type: Concept
issued: 2023-03-29
modified: 2025-02-23
comment: Written literary work focusing on romantic relationships and love between people; use in reference to romance fiction focusing on megasexual characters or themes.
broader: https://homosaurus.org/v3/homoit0001586
change note: Version 3.7.0
has top concept: Subcultures
in scheme: v3

Megasexual science fiction
type: Concept
issued: 2023-03-29
modified: 2025-02-23
comment: Written literary works about imaginative or futuristic concepts incorporating science, technology, space, time travel, and other speculative elements; use in reference to science fiction focusing on megasexual characters or themes.
broader: https://homosaurus.org/v3/homoit0000934
change note: Version 3.7.0
has top concept: Subcultures
in scheme: v3

Megasexual short stories
type: Concept
issued: 2023-03-29
modified: 2025-02-23
comment: Written literary works that are short in length and detail a self-contained incident or concept; use in reference to short stories focusing on megasexual characters or themes.
broader: https://homosaurus.org/v3/homoit0001608
change note: Version 3.7.0
has top concept: Subcultures
in scheme: v3

Megasexual drama
type: Concept
issued: 2023-03-29
modified: 2025-02-23
comment: Works of fiction written to be performed; use in reference to dramatic works focusing on megasexual characters or themes.
broader: https://homosaurus.org/v3/homoit0000376
change note: Version 3.7.0
has top concept: Subcultures
in scheme: v3
related: https://homosaurus.org/v3/homoit0002502
related: https://homosaurus.org/v3/homoit0002507

Megasexual theater
type: Concept
issued: 2023-03-29
modified: 2025-02-23
comment: Works in the performance arts that focus on megasexual characters, communities, or issues.
broader: https://homosaurus.org/v3/homoit0001363
change note: Version 3.7.0
has top concept: LGBTQ+ theater
in scheme: v3
related: https://homosaurus.org/v3/homoit0002501

Megasexual comics
type: Concept
issued: 2023-03-29
modified: 2025-02-23
comment: Works consisting of sequential images often accompanied by text; use in reference to comics focusing on megasexual characters or themes.
broader: https://homosaurus.org/v3/homoit0000841
change note: Version 3.7.0
has top concept: Subcultures
in scheme: v3

Megasexual history
type: Concept
issued: 2023-03-29
modified: 2025-02-23
comment: Past events or accounts of the past concerning megasexual people, or people who might be perceived as megasexual if they were alive today.
broader: https://homosaurus.org/v3/homoit0002260
change note: Version 3.7.0
has top concept: LGBTQ+ history
in scheme: v3

Megasexual authors
type: Concept
issued: 2023-04-11
modified: 2025-02-23
comment: Megasexual creators of written works.
broader: https://homosaurus.org/v3/homoit0001723
change note: Version 3.7.0
has top concept: LGBTQ+ people
in scheme: v3
related: https://homosaurus.org/v3/homoit0002506
related: https://homosaurus.org/v3/homoit0002507
related: https://homosaurus.org/v3/homoit0002508
related: https://homosaurus.org/v3/homoit0002511
related: https://homosaurus.org/v3/homoit0002512
related: https://homosaurus.org/v3/homoit0002513

Megasexual fiction
type: Concept
issued: 2023-04-11
modified: 2025-02-23
comment: Written works describing imagined events or people; use in reference to fictional works focusing on megasexual characters or themes.
broader: https://homosaurus.org/v3/homoit0000443
change note: Version 3.7.0
has top concept: Subcultures
in scheme: v3
related: https://homosaurus.org/v3/homoit0000157
related: https://homosaurus.org/v3/homoit0002150
related: https://homosaurus.org/v3/homoit0002505
related: https://homosaurus.org/v3/homoit0002507
related: https://homosaurus.org/v3/homoit0002508

Megasexual literature
type: Concept
issued: 2023-04-11
modified: 2025-02-23
comment: Written literary works about megasexuality, megasexual characters, or megasexual themes.
broader: https://homosaurus.org/v3/homoit0000972
change note: Version 3.7.0
has top concept: Subcultures
in scheme: v3
related: https://homosaurus.org/v3/homoit0002501
related: https://homosaurus.org/v3/homoit0002505
related: https://homosaurus.org/v3/homoit0002506
related: https://homosaurus.org/v3/homoit0002508

Megasexual poetry
type: Concept
issued: 2023-04-11
modified: 2025-02-23
comment: Literary works, typically written in verse, that focus on megasexual characters, themes, or identity.
broader: https://homosaurus.org/v3/homoit0001118
change note: Version 3.7.0
has top concept: Subcultures
in scheme: v3
related: https://homosaurus.org/v3/homoit0002505
related: https://homosaurus.org/v3/homoit0002506
related: https://homosaurus.org/v3/homoit0002507

Megasexual youth
type: Concept
issued: 2023-04-11
modified: 2025-02-23
comment: Megasexual people between the ages of childhood and adulthood.
broader: https://homosaurus.org/v3/homoit0001521
change note: Version 3.7.0
has top concept: Youth
in scheme: v3
related: https://homosaurus.org/v3/homoit0002510

Megasexual youth literature
type: Concept
issued: 2023-04-11
modified: 2025-02-23
comment: Written literary works for an audience of readers from 12-18 years of age, also known as young adult literature or YA; use in reference to youth literature focusing on megasexual characters or themes.
broader: https://homosaurus.org/v3/homoit0001522
change note: Version 3.7.0
has top concept: Subcultures
in scheme: v3
related: https://homosaurus.org/v3/homoit0002509

Megasexual autobiographies
type: Concept
issued: 2023-04-11
modified: 2025-02-23
comment: Accounts of megasexual peoples' lives written by those people. For written accounts of megasexual people's lives that were not written by the subject, use "Megasexual biographies."
broader: https://homosaurus.org/v3/homoit0001729
change note: Version 3.7.0
has top concept: LGBTQ+ autobiographies
in scheme: v3
related: https://homosaurus.org/v3/homoit0002505
related: https://homosaurus.org/v3/homoit0002512

Megasexual biographies
type: Concept
issued: 2023-04-11
modified: 2025-02-23
comment: Written accounts of the lives of megasexual people. For written accounts of megasexual people's lives written by the subject, use "Megasexual autobiographies."
broader: https://homosaurus.org/v3/homoit0001614
change note: Version 3.7.0
has top concept: LGBTQ+ biographies
in scheme: v3
related: https://homosaurus.org/v3/homoit0002505
related: https://homosaurus.org/v3/homoit0002511

Megasexual literary criticism
type: Concept
issued: 2023-04-11
modified: 2025-02-23
comment: The study, evaluation, and interpretation of literary works focusing on megasexual characters or themes; can also include interpretation of literature through the lens and frameworks of megasexual studies.
broader: https://homosaurus.org/v3/homoit0001602
change note: Version 3.7.0
has top concept: LGBTQ+ literary criticism
in scheme: v3
related: https://homosaurus.org/v3/homoit0002505

Romantic relationships
type: Concept
issued: 2023-04-11
modified: 2025-02-23
comment: Ongoing connections between two or more individuals involving romantic behaviors or activities.
broader: https://homosaurus.org/v3/homoit0001237
change note: Version 3.7.0
has top concept: LGBTQ+ relationships
in scheme: v3

Greyromantic erotic literature
type: Concept
issued: 2023-04-11
modified: 2025-02-23
comment: Literary works with erotic or sexual elements; use in reference to erotic literature focusing on greyromantic erotic literature characters or themes.
broader: https://homosaurus.org/v3/homoit0000859
change note: Version 3.7.0
has top concept: Erotica
in scheme: v3

Greyromantic fantasy fiction
type: Concept
issued: 2023-04-11
modified: 2025-02-23
comment: Written works that include magical or fantastical elements; use in reference to fantasy fiction focusing on greyromantic characters or themes.
broader: https://homosaurus.org/v3/homoit0000865
change note: Version 3.7.0
has top concept: Subcultures
in scheme: v3

Greyromantic horror fiction
type: Concept
issued: 2023-04-11
modified: 2025-02-23
comment: Written works of fiction intended to frighten, scare, or disgust; use in reference to horror fiction focusing on greyromantic characters or themes.
broader: https://homosaurus.org/v3/homoit0001580
change note: Version 3.7.0
has top concept: Subcultures
in scheme: v3

Greyromantic mystery and detective fiction
type: Concept
issued: 2023-04-11
modified: 2025-02-23
comment: Written literary works about the investigation of crime or the work of detectives; use in reference to mystery and detective fiction focusing on greyromantic characters or themes.
broader: https://homosaurus.org/v3/homoit0000852
change note: Version 3.7.0
has top concept: Subcultures
in scheme: v3

Greyromantic romance fiction
type: Concept
issued: 2023-04-11
modified: 2025-02-23
comment: Written literary work focusing on romantic relationships and love between people; use in reference to romance fiction focusing on greyromantic characters or themes.
broader: https://homosaurus.org/v3/homoit0001586
change note: Version 3.7.0
has top concept: Subcultures
in scheme: v3

Greyromantic science fiction
type: Concept
issued: 2023-04-11
modified: 2025-02-23
comment: Written literary works about imaginative or futuristic concepts incorporating science, technology, space, time travel, and other speculative elements; use in reference to science fiction focusing on greyromantic characters or themes.
broader: https://homosaurus.org/v3/homoit0000934
change note: Version 3.7.0
has top concept: Subcultures
in scheme: v3

Greyromantic short stories
type: Concept
issued: 2023-04-11
modified: 2025-02-23
comment: Written literary works that are short in length and detail a self-contained incident or concept; use in reference to short stories focusing on greyromantic characters or themes.
broader: https://homosaurus.org/v3/homoit0001608
change note: Version 3.7.0
has top concept: Subcultures
in scheme: v3

Greyromantic drama
type: Concept
issued: 2023-04-11
modified: 2025-02-23
comment: Works of fiction written to be performed; use in reference to dramatic works focusing on greyromantic characters or themes.
broader: https://homosaurus.org/v3/homoit0000376
change note: Version 3.7.0
has top concept: Subcultures
in scheme: v3
related: https://homosaurus.org/v3/homoit0002523
related: https://homosaurus.org/v3/homoit0002537

Greyromantic theater
type: Concept
issued: 2023-04-11
modified: 2025-02-23
comment: Works in the performance arts that focus on greyromantic characters, communities, or issues.
broader: https://homosaurus.org/v3/homoit0001363
change note: Version 3.7.0
has top concept: LGBTQ+ theater
in scheme: v3
related: https://homosaurus.org/v3/homoit0002522

Greyromantic comics
type: Concept
issued: 2023-04-11
modified: 2025-02-23
comment: Works consisting of sequential images often accompanied by text; use in reference to comics focusing on greyromantic characters or themes.
broader: https://homosaurus.org/v3/homoit0000841
change note: Version 3.7.0
has top concept: Subcultures
in scheme: v3

Greyromantic history
type: Concept
issued: 2023-04-11
modified: 2025-02-23
comment: Past events or accounts of the past concerning greyromantic people, or people who might be perceived as greyromantic if they were alive today.
broader: https://homosaurus.org/v3/homoit0002260
change note: Version 3.7.0
has top concept: LGBTQ+ history
in scheme: v3

Armenian LGBTQ+ people
type: Concept
issued: 2023-04-11
modified: 2025-02-23
comment: LGBTQ+ people who are ethnically Armenian.
alternative label: LGBTQ+ Armenians
broader: https://homosaurus.org/v3/homoit0000860
change note: Version 3.7.0
has top concept: LGBTQ+ people
in scheme: v3
narrower: https://homosaurus.org/v3/homoit0002527
narrower: https://homosaurus.org/v3/homoit0002528
narrower: https://homosaurus.org/v3/homoit0002529
narrower: https://homosaurus.org/v3/homoit0002530
narrower: https://homosaurus.org/v3/homoit0002531
narrower: https://homosaurus.org/v3/homoit0002532
narrower: https://homosaurus.org/v3/homoit0002533

Armenian gay men
type: Concept
issued: 2023-04-11
modified: 2025-02-23
comment: Gay men who are ethnically Armenian.
alternative label: Gay Armenians
broader: https://homosaurus.org/v3/homoit0002526
change note: Version 3.7.0
has top concept: LGBTQ+ people
in scheme: v3

Armenian lesbians
type: Concept
issued: 2023-04-11
modified: 2025-02-23
comment: Lesbians who are ethnically Armenian.
alternative label: Lesbian Armenians
broader: https://homosaurus.org/v3/homoit0002526
change note: Version 3.7.0
has top concept: LGBTQ+ people
in scheme: v3

Armenian bisexual people
type: Concept
issued: 2023-04-11
modified: 2025-02-23
comment: Bisexual people who are ethnically Armenian.
alternative label: Bisexual Armenians
broader: https://homosaurus.org/v3/homoit0002526
change note: Version 3.7.0
has top concept: LGBTQ+ people
in scheme: v3

Armenian queer people
type: Concept
issued: 2023-04-11
modified: 2025-02-23
comment: Queer people who are ethnically Armenian.
alternative label: Queer Armenians
broader: https://homosaurus.org/v3/homoit0002526
change note: Version 3.7.0
has top concept: LGBTQ+ people
in scheme: v3

Armenian transgender people
type: Concept
issued: 2023-04-11
modified: 2025-02-23
comment: Transgender people who are ethnically Armenian.
alternative label: Transgender Armenians
broader: https://homosaurus.org/v3/homoit0002526
change note: Version 3.7.0
has top concept: LGBTQ+ people
in scheme: v3

Armenian intersex people
type: Concept
issued: 2023-04-11
modified: 2025-02-23
comment: Intersex people who are ethnically Armenian.
alternative label: Intersex Armenians
broader: https://homosaurus.org/v3/homoit0002526
change note: Version 3.7.0
has top concept: LGBTQ+ people
in scheme: v3

Armenian asexual people
type: Concept
issued: 2023-04-11
modified: 2025-02-23
comment: Asexual people who are ethnically Armenian.
alternative label: Asexual Armenians
broader: https://homosaurus.org/v3/homoit0002526
change note: Version 3.7.0
has top concept: LGBTQ+ people
in scheme: v3

Greyromantic authors
type: Concept
issued: 2023-04-11
modified: 2025-02-23
comment: Greyromantic creators of written works.
broader: https://homosaurus.org/v3/homoit0001723
change note: Version 3.7.0
has top concept: LGBTQ+ people
in scheme: v3
related: https://homosaurus.org/v3/homoit0002535
related: https://homosaurus.org/v3/homoit0002536
related: https://homosaurus.org/v3/homoit0002537
related: https://homosaurus.org/v3/homoit0002540
related: https://homosaurus.org/v3/homoit0002541
related: https://homosaurus.org/v3/homoit0002542

Greyromantic fiction
type: Concept
issued: 2023-04-11
modified: 2025-02-23
comment: Written works describing imagined events or people; use in reference to fictional works focusing on greyromantic characters or themes.
broader: https://homosaurus.org/v3/homoit0000443
change note: Version 3.7.0
has top concept: Subcultures
in scheme: v3
related: https://homosaurus.org/v3/homoit0000139
related: https://homosaurus.org/v3/homoit0000151
related: https://homosaurus.org/v3/homoit0000157
related: https://homosaurus.org/v3/homoit0001752
related: https://homosaurus.org/v3/homoit0001754
related: https://homosaurus.org/v3/homoit0002150
related: https://homosaurus.org/v3/homoit0002534
related: https://homosaurus.org/v3/homoit0002537

Greyromantic poetry
type: Concept
issued: 2023-04-11
modified: 2025-02-23
comment: Literary works, typically written in verse, that focus on greyromantic characters, themes, or identity.
broader: https://homosaurus.org/v3/homoit0001118
change note: Version 3.7.0
has top concept: Subcultures
in scheme: v3
related: https://homosaurus.org/v3/homoit0002534
related: https://homosaurus.org/v3/homoit0002537

Greyromantic literature
type: Concept
issued: 2023-04-11
modified: 2025-02-23
comment: Written literary works about greyromanticism, greyromantic characters, or greyromantic themes.
broader: https://homosaurus.org/v3/homoit0000972
change note: Version 3.7.0
has top concept: Subcultures
in scheme: v3
related: https://homosaurus.org/v3/homoit0002522
related: https://homosaurus.org/v3/homoit0002534
related: https://homosaurus.org/v3/homoit0002535
related: https://homosaurus.org/v3/homoit0002536

Greyromantic youth
type: Concept
issued: 2023-04-11
modified: 2025-02-23
comment: Greyromantic people between the ages of childhood and adulthood.
broader: https://homosaurus.org/v3/homoit0001521
change note: Version 3.7.0
has top concept: Youth
in scheme: v3
related: https://homosaurus.org/v3/homoit0002539

Greyromantic youth literature
type: Concept
issued: 2023-04-11
modified: 2025-02-23
comment: Written literary works for an audience of readers from 12-18 years of age, also known as young adult literature or YA; use in reference to youth literature focusing on greyromantic characters or themes.
broader: https://homosaurus.org/v3/homoit0001522
change note: Version 3.7.0
has top concept: Subcultures
in scheme: v3
related: https://homosaurus.org/v3/homoit0002538

Greyromantic autobiographies
type: Concept
issued: 2023-04-11
modified: 2025-02-23
comment: Accounts of greyromantic peoples' lives written by those people. For written accounts of greyromantic people's lives that were not written by the subject, use "Greyromantic biographies."
broader: https://homosaurus.org/v3/homoit0001729
change note: Version 3.7.0
has top concept: LGBTQ+ autobiographies
in scheme: v3
related: https://homosaurus.org/v3/homoit0001730
related: https://homosaurus.org/v3/homoit0001731
related: https://homosaurus.org/v3/homoit0002534
related: https://homosaurus.org/v3/homoit0002541

Greyromantic biographies
type: Concept
issued: 2023-04-11
modified: 2025-02-23
comment: Written accounts of the lives of greyromantic people. For written accounts of greyromantic people's lives written by the subject, use "Greyromantic autobiographies."
broader: https://homosaurus.org/v3/homoit0001614
change note: Version 3.7.0
has top concept: LGBTQ+ biographies
in scheme: v3
related: https://homosaurus.org/v3/homoit0002534
related: https://homosaurus.org/v3/homoit0002540

Greyromantic literary criticism
type: Concept
issued: 2023-04-11
modified: 2025-02-23
comment: The study, evaluation, and interpretation of literary works focusing on greyromantic characters or themes; can also include interpretation of literature through the lens and frameworks of greyromantic studies.
broader: https://homosaurus.org/v3/homoit0001602
change note: Version 3.7.0
has top concept: LGBTQ+ literary criticism
in scheme: v3
related: https://homosaurus.org/v3/homoit0001603
related: https://homosaurus.org/v3/homoit0001604
related: https://homosaurus.org/v3/homoit0001605
related: https://homosaurus.org/v3/homoit0001606
related: https://homosaurus.org/v3/homoit0001607
related: https://homosaurus.org/v3/homoit0002534

LGBTQ+ erotic films
type: Concept
issued: 2023-04-12
modified: 2025-02-23
comment: Erotic films or movies, created by LGBTQ+ directors, depicting LGBTQ+ people, or that are regarded as important within LGBTQ+ culture. Use a more specific narrower term where applicable.
broader: https://homosaurus.org/v3/homoit0000869
change note: Version 3.7.0
has top concept: Subcultures
in scheme: v3
narrower: https://homosaurus.org/v3/homoit0002546
narrower: https://homosaurus.org/v3/homoit0002547
narrower: https://homosaurus.org/v3/homoit0002548
narrower: https://homosaurus.org/v3/homoit0002549
narrower: https://homosaurus.org/v3/homoit0002550
narrower: https://homosaurus.org/v3/homoit0002551
narrower: https://homosaurus.org/v3/homoit0002552
narrower: https://homosaurus.org/v3/homoit0002553
narrower: https://homosaurus.org/v3/homoit0002554
related: https://homosaurus.org/v3/homoit0000013
related: https://homosaurus.org/v3/homoit0002545
related: https://homosaurus.org/v3/homoit0002579

Two-Spirit erotic films
type: Concept
issued: 2023-04-12
modified: 2025-02-23
comment: Erotic films or movies, created by Two-Spirit directors, depicting Two-Spirit people, or that are regarded as important within Two-Spirit culture.
alternative label: 2S erotic films
alternative label: Two Spirit erotic films
alternative label: Two Spirited erotic films
alternative label: Two-Spirited erotic films
broader: https://homosaurus.org/v3/homoit0002560
change note: Version 3.7.0
has top concept: Two-Spirit films
in scheme: v3
narrower: https://homosaurus.org/v3/homoit0002555
related: https://homosaurus.org/v3/homoit0002544

Lesbian erotic films
type: Concept
issued: 2023-04-12
modified: 2025-02-23
comment: Erotic films or movies, created by lesbian directors, depicting lesbian people, or that are regarded as important within lesbian culture.
broader: https://homosaurus.org/v3/homoit0002544
broader: https://homosaurus.org/v3/homoit0002607
change note: Version 3.7.0
has top concept: Subcultures
in scheme: v3
related: https://homosaurus.org/v3/homoit0000765

Gay erotic films
type: Concept
issued: 2023-04-12
modified: 2025-02-23
comment: Erotic films or movies, created by gay directors, depicting gay people, or that are regarded as important within gay culture.
broader: https://homosaurus.org/v3/homoit0002544
broader: https://homosaurus.org/v3/homoit0002608
change note: Version 3.7.0
has top concept: Subcultures
in scheme: v3
related: https://homosaurus.org/v3/homoit0000520

Bisexual erotic films
type: Concept
issued: 2023-04-12
modified: 2025-02-23
comment: Erotic films or movies, created by bisexual directors, depicting bisexual people, or that are regarded as important within bisexual culture.
broader: https://homosaurus.org/v3/homoit0002544
broader: https://homosaurus.org/v3/homoit0002609
change note: Version 3.7.0
has top concept: Subcultures
in scheme: v3
related: https://homosaurus.org/v3/homoit0000176

Transgender erotic films
type: Concept
issued: 2023-04-12
modified: 2025-02-23
comment: Erotic films or movies, created by transgender directors, depicting transgender people, or that are regarded as important within transgender culture.
broader: https://homosaurus.org/v3/homoit0002544
broader: https://homosaurus.org/v3/homoit0002610
change note: Version 3.7.0
has top concept: Subcultures
in scheme: v3
related: https://homosaurus.org/v3/homoit0001435

Queer erotic films
type: Concept
issued: 2023-04-12
modified: 2025-02-23
comment: Erotic films or movies, created by queer directors, depicting queer people, or that are regarded as important within queer culture.
broader: https://homosaurus.org/v3/homoit0002544
broader: https://homosaurus.org/v3/homoit0002611
change note: Version 3.7.0
has top concept: Subcultures
in scheme: v3
related: https://homosaurus.org/v3/homoit0001199

Intersex erotic films
type: Concept
issued: 2023-04-12
modified: 2025-02-23
comment: Erotic films or movies, created by intersex directors, depicting intersex people, or that are regarded as important within intersex culture.
broader: https://homosaurus.org/v3/homoit0002544
broader: https://homosaurus.org/v3/homoit0002612
change note: Version 3.7.0
has top concept: Subcultures
in scheme: v3
related: https://homosaurus.org/v3/homoit0002556

Aromantic erotic films
type: Concept
issued: 2023-04-12
modified: 2025-02-23
comment: Erotic films or movies, created by aromantic directors, depicting aromantic people, or that are regarded as important within aromantic culture.
broader: https://homosaurus.org/v3/homoit0002544
broader: https://homosaurus.org/v3/homoit0002613
change note: Version 3.7.0
has top concept: Subcultures
in scheme: v3
related: https://homosaurus.org/v3/homoit0002557

Asexual erotic films
type: Concept
issued: 2023-04-12
modified: 2025-02-23
comment: Erotic films or movies, created by asexual directors, depicting asexual people, or that are regarded as important within asexual culture.
broader: https://homosaurus.org/v3/homoit0002544
broader: https://homosaurus.org/v3/homoit0002614
change note: Version 3.7.0
has top concept: Subcultures
in scheme: v3
related: https://homosaurus.org/v3/homoit0002558

Demisexual erotic films
type: Concept
issued: 2023-04-12
modified: 2025-02-23
comment: Erotic films or movies, created by demisexual directors, depicting demisexual people, or that are regarded as important within demisexual culture.
broader: https://homosaurus.org/v3/homoit0002544
broader: https://homosaurus.org/v3/homoit0002615
change note: Version 3.7.0
has top concept: Subcultures
in scheme: v3
related: https://homosaurus.org/v3/homoit0002559

Two-Spirit porn films
type: Concept
issued: 2023-04-12
modified: 2025-02-23
comment: Erotic or sexually explicit films featuring Two-Spirit people.
alternative label: 2S porn films
alternative label: Two Spirit porn films
alternative label: Two spirited porn films
broader: https://homosaurus.org/v3/homoit0002545
change note: Version 3.7.0
has top concept: Two-Spirit films
in scheme: v3
related: https://homosaurus.org/v3/homoit0000013

Intersex porn films
type: Concept
issued: 2023-04-12
modified: 2025-02-23
comment: Erotic or sexually explicit films featuring intersex people.
broader: https://homosaurus.org/v3/homoit0002612
change note: Version 3.7.0
has top concept: Subcultures
in scheme: v3
related: https://homosaurus.org/v3/homoit0002551

Aromantic porn films
type: Concept
issued: 2023-04-12
modified: 2025-02-23
comment: Erotic or sexually explicit films featuring aromantic people.
broader: https://homosaurus.org/v3/homoit0002613
change note: Version 3.7.0
has top concept: Subcultures
in scheme: v3
related: https://homosaurus.org/v3/homoit0002552

Asexual porn films
type: Concept
issued: 2023-04-12
modified: 2025-02-23
comment: Erotic or sexually explicit films featuring asexual people.
broader: https://homosaurus.org/v3/homoit0002614
change note: Version 3.7.0
has top concept: Subcultures
in scheme: v3
related: https://homosaurus.org/v3/homoit0002553

Demisexual porn films
type: Concept
issued: 2023-04-12
modified: 2025-02-23
comment: Erotic or sexually explicit films featuring demisexual people.
broader: https://homosaurus.org/v3/homoit0000013
broader: https://homosaurus.org/v3/homoit0002615
change note: Version 3.7.0
has top concept: Subcultures
in scheme: v3
related: https://homosaurus.org/v3/homoit0002554

Intersex films
type: Concept
issued: 2023-04-12
modified: 2025-02-23
comment: Motion pictures, or movies, created by intersex directors, depicting intersex people, or that are regarded as important within intersex culture.
broader: https://homosaurus.org/v3/homoit0000869
change note: Version 3.7.0
has top concept: Subcultures
in scheme: v3

Aromantic films
type: Concept
issued: 2023-04-12
modified: 2025-02-23
comment: Motion pictures, or movies, created by aromantic directors, depicting aromantic people, or that are regarded as important within aromantic culture.
broader: https://homosaurus.org/v3/homoit0000869
change note: Version 3.7.0
has top concept: Subcultures
in scheme: v3

Asexual films
type: Concept
issued: 2023-04-12
modified: 2025-02-23
comment: Motion pictures, or movies, created by asexual directors, depicting asexual people, or that are regarded as important within asexual culture.
broader: https://homosaurus.org/v3/homoit0000869
change note: Version 3.7.0
has top concept: Subcultures
in scheme: v3

Demisexual films
type: Concept
issued: 2023-04-12
modified: 2025-02-23
comment: Motion pictures, or movies, created by demisexual directors, depicting demisexual people, or that are regarded as important within demisexual culture.
broader: https://homosaurus.org/v3/homoit0000869
change note: Version 3.7.0
has top concept: Subcultures
in scheme: v3

Non-binary fiction
type: Concept
issued: 2023-04-12
modified: 2025-02-23
comment: Written works describing imagined events or people; use in reference to fictional works focusing on non-binary characters or themes.
broader: https://homosaurus.org/v3/homoit0000443
change note: Version 3.7.0
has top concept: Subcultures
in scheme: v3
narrower: https://homosaurus.org/v3/homoit0002566
narrower: https://homosaurus.org/v3/homoit0002567
narrower: https://homosaurus.org/v3/homoit0002568
narrower: https://homosaurus.org/v3/homoit0002570
narrower: https://homosaurus.org/v3/homoit0002571

Non-binary romance fiction
type: Concept
issued: 2023-04-12
modified: 2025-02-23
comment: Written works of fiction revolving around romantic and/or sexual relationships between the main characters; use in reference to romance fiction focusing on non-binary characters.
broader: https://homosaurus.org/v3/homoit0001586
broader: https://homosaurus.org/v3/homoit0002565
change note: Version 3.7.0
has top concept: Subcultures
in scheme: v3

Non-binary mystery and detective fiction
type: Concept
issued: 2023-04-12
modified: 2025-02-23
comment: Written literary works about the investigation of crime or the work of detectives; use in reference to mystery and detective fiction focusing on non-binary characters or themes.
broader: https://homosaurus.org/v3/homoit0000852
broader: https://homosaurus.org/v3/homoit0002565
change note: Version 3.7.0
has top concept: Subcultures
in scheme: v3

Non-binary horror fiction
type: Concept
issued: 2023-04-12
modified: 2025-02-23
comment: Written works of fiction intended to frighten, scare, or disgust; use in reference to horror fiction focusing on non-binary characters or themes.
broader: https://homosaurus.org/v3/homoit0001580
broader: https://homosaurus.org/v3/homoit0002565
change note: Version 3.7.0
has top concept: Subcultures
in scheme: v3

Non-binary graphic novels
type: Concept
issued: 2023-04-12
modified: 2025-02-23
comment: Works consisting of sequential images often accompanied by text that generally contain stand-alone stories; used in reference to graphic novels focusing on non-binary characters or themes.
broader: https://homosaurus.org/v3/homoit0000874
change note: Version 3.7.0
has top concept: Subcultures
in scheme: v3

Non-binary science fiction
type: Concept
issued: 2023-04-12
modified: 2025-02-23
comment: Written literary work about imaginative or futuristic concepts incorporating science, technology, space, time travel, and other speculative elements; use in reference to science fiction focusing on non-binary characters or themes.
broader: https://homosaurus.org/v3/homoit0000934
broader: https://homosaurus.org/v3/homoit0002565
change note: Version 3.7.0
has top concept: Subcultures
in scheme: v3

Non-binary fantasy fiction
type: Concept
issued: 2023-04-12
modified: 2025-02-23
comment: Genre that uses magic and other supernatural phenomena as a primary element of plot, theme, and/or setting; use for fantasy fiction focusing on non-binary characters or themes.
broader: https://homosaurus.org/v3/homoit0000865
broader: https://homosaurus.org/v3/homoit0002565
change note: Version 3.7.0
has top concept: Subcultures
in scheme: v3

Non-binary erotic literature
type: Concept
issued: 2023-04-12
modified: 2025-02-23
comment: Literary works that have erotic or sexual elements; use in reference to erotic literature focusing on non-binary characters or themes.
broader: https://homosaurus.org/v3/homoit0000859
change note: Version 3.7.0
has top concept: Erotica
in scheme: v3

Non-binary porn films
type: Concept
issued: 2023-04-12
modified: 2025-02-23
comment: Erotic or sexually explicit films featuring non-binary people.
broader: https://homosaurus.org/v3/homoit0000013
change note: Version 3.7.0
has top concept: Subcultures
in scheme: v3

Non-binary short stories
type: Concept
issued: 2023-04-12
modified: 2025-02-23
comment: Written literary works that are short in length and detail a self-contained incident or concept; use in reference to short stories focusing on non-binary characters or themes.
broader: https://homosaurus.org/v3/homoit0001608
change note: Version 3.7.0
has top concept: Subcultures
in scheme: v3

Non-binary comics
type: Concept
issued: 2023-04-12
modified: 2025-02-23
comment: Works consisting of sequential images often accompanied by text; use in reference to comics focusing on non-binary characters or themes.
broader: https://homosaurus.org/v3/homoit0000841
change note: Version 3.7.0
has top concept: Subcultures
in scheme: v3

Non-binary poetry
type: Concept
issued: 2023-04-12
modified: 2025-02-23
comment: Literary work, typically written in verse, that focuses on non-binary characters, themes, or identity.
broader: https://homosaurus.org/v3/homoit0001118
change note: Version 3.7.0
has top concept: Subcultures
in scheme: v3

Queercrip
type: Concept
issued: 2023-04-12
modified: 2025-02-23
comment: A portmanteau of two reclaimed terms (queer and crip) used to indicate that a person or a thing belongs to both queer and crip communities, often used to indicate unity or shared struggles. This term may also appear as "cripqueer" to emphasize the crip identity before the queer one.
alternative label: Cripqueer
broader: https://homosaurus.org/v3/homoit0001559
change note: Version 3.7.0
has top concept: LGBTQ+ slang
in scheme: v3
related: https://homosaurus.org/v3/homoit0001149
related: https://homosaurus.org/v3/homoit0001195
related: https://homosaurus.org/v3/homoit0001854
related: https://homosaurus.org/v3/homoit0001879
related: https://homosaurus.org/v3/homoit0001891

69ing
type: Concept
issued: 2023-04-12
modified: 2025-02-23
comment: 69ing refers to an act of shared oral sex between two people simultaneously giving and receiving oral sex, said to look similar to the number 69.
alternative label: 69'ing
alternative label: 69-ing
alternative label: 69
alternative label: Sixty-Nining
broader: https://homosaurus.org/v3/homoit0000593
change note: Version 3.7.0
has top concept: Sex (Act)
in scheme: v3
related: https://homosaurus.org/v3/homoit0000212
related: https://homosaurus.org/v3/homoit0000239

LGBTQ+ erotic art
type: Concept
issued: 2023-04-12
modified: 2025-02-23
comment: Umbrella term for different forms of creative activity dealing with or engaging with erotic themes, including visual, material, and performing art, by LGBTQ+ artists or about LGBTQ+ topics and communities. Use a more specific term if possible.
broader: https://homosaurus.org/v3/homoit0000816
change note: Version 3.7.0
has top concept: Subcultures
in scheme: v3
narrower: https://homosaurus.org/v3/homoit0000013
narrower: https://homosaurus.org/v3/homoit0002607
narrower: https://homosaurus.org/v3/homoit0002608
narrower: https://homosaurus.org/v3/homoit0002609
narrower: https://homosaurus.org/v3/homoit0002610
narrower: https://homosaurus.org/v3/homoit0002611
narrower: https://homosaurus.org/v3/homoit0002612
narrower: https://homosaurus.org/v3/homoit0002613
narrower: https://homosaurus.org/v3/homoit0002614
narrower: https://homosaurus.org/v3/homoit0002615
related: https://homosaurus.org/v3/homoit0001052
related: https://homosaurus.org/v3/homoit0002544
related: https://homosaurus.org/v3/homoit0002606

Appropriation of Indigenous identity
type: Concept
issued: 2023-04-14
modified: 2025-02-23
comment: A form of cultural appropriation and race shifting involving false claims of citizenship, belonging, and/or descent from Indigenous people in North America. Not to be confused with disconnected or reconnecting descendants.
alternative label: Pretendians
broader: https://homosaurus.org/v3/homoit0002582
change note: Version 3.7.0
has top concept: Appropriation of marginalized identities
in scheme: v3
narrower: https://homosaurus.org/v3/homoit0002581

Appropriation of Two-Spirit identity
type: Concept
issued: 2023-04-14
modified: 2025-02-23
comment: A form of cultural appropriation involving identification with Two-Spirit identity by people who cannot claim citizenship, belonging, and/or descent from Indigenous people in North America.
broader: https://homosaurus.org/v3/homoit0002580
change note: Version 3.7.0
has top concept: Appropriation of marginalized identities
in scheme: v3
related: https://homosaurus.org/v3/homoit0001914

Queerspawn
type: Concept
issued: 2023-04-14
modified: 2025-02-23
comment: People with one or more queer parent or caregiver, usually for self-identification. Queerspawn is believed to have been coined in 1995 or 1996 by Stefan Lynch for use in zine published by COLAGE, a U.S. based organization dedicated to supporting people with one or more LGBTQ+ caregiver.
broader: https://homosaurus.org/v3/homoit0000260
broader: https://homosaurus.org/v3/homoit0001317
change note: Version 3.7.0
has top concept: Family members
in scheme: v3
related: https://homosaurus.org/v3/homoit0000262
related: https://homosaurus.org/v3/homoit0001176
related: https://homosaurus.org/v3/homoit0001194

Bothies
type: Concept
issued: 2023-04-14
modified: 2025-02-23
comment: People who have two or more LGBTQ+ parents or caregivers. Includes individuals born to or adopted by people in a heterosexual relationship who later came out as LGBTQ+, as well as individuals born to or adopted by LGBTQ+ people who came together to create their own families, such as lesbian couples who choose to conceive with friends who are gay men. For use in a Canadian and United States context.
broader: https://homosaurus.org/v3/homoit0000260
broader: https://homosaurus.org/v3/homoit0001317
change note: Version 3.7.0
has top concept: Family members
in scheme: v3
related: https://homosaurus.org/v3/homoit0000420
related: https://homosaurus.org/v3/homoit0001075

LGBTQ+ children of LGBTQ+ parents
type: Concept
issued: 2023-04-14
modified: 2025-02-23
comment: Term used to describe people who are LGBTQ+ and have at least one LGBTQ+ parent or caregiver.
alternative label: Second generation (LGBTQ+ families)
broader: https://homosaurus.org/v3/homoit0000260
broader: https://homosaurus.org/v3/homoit0000915
change note: Version 3.7.0
has top concept: Family members
in scheme: v3
related: https://homosaurus.org/v3/homoit0000420
related: https://homosaurus.org/v3/homoit0000752

LGBTQ+ family generations
type: Concept
issued: 2023-04-14
modified: 2025-02-23
comment: Refers to families with LGBTQ+ individuals in multiple generations.
broader: https://homosaurus.org/v3/homoit0000420
change note: Version 3.7.0
has top concept: LGBTQ+ families
in scheme: v3
related: https://homosaurus.org/v3/homoit0000260
related: https://homosaurus.org/v3/homoit0001075
related: https://homosaurus.org/v3/homoit0001430
related: https://homosaurus.org/v3/homoit0002358

People with transgender parents
type: Concept
issued: 2023-04-14
modified: 2025-02-23
comment: People who have one or more transgender parent or caregiver.
alternative label: KOT (Kids of Trans)
alternative label: Kids of Trans
alternative label: PTP
alternative label: People with trans parents
alternative label: Transpawn
broader: https://homosaurus.org/v3/homoit0000261
change note: Version 3.7.0
has top concept: Family members
in scheme: v3
related: https://homosaurus.org/v3/homoit0001412
related: https://homosaurus.org/v3/homoit0001430

Culturally queer
type: Concept
issued: 2023-04-14
modified: 2025-02-23
comment: Term used to describe the feeling shared by many people with queer parents or caregivers that they grew up immersed in queer culture, including queer traditions, celebrations, media, and language.
broader: https://homosaurus.org/v3/homoit0001832
change note: Version 3.7.0
has top concept: Subcultures
in scheme: v3
related: https://homosaurus.org/v3/homoit0000262
related: https://homosaurus.org/v3/homoit0001176
related: https://homosaurus.org/v3/homoit0001195

Gender role stereotypes
type: Concept
issued: 2023-04-14
modified: 2025-02-23
comment: Widely held but oversimplified and often offensive ideas regarding gender roles, which are socially-determined rules or standards for gendered behaviors. Use the term "Gender roles" to describe gender roles as a whole, rather than stereotypes related to them.
alternative label: Gender stereotypes
broader: https://homosaurus.org/v3/homoit0000577
change note: Version 3.7.0
has top concept: Role behavior
in scheme: v3
related: https://homosaurus.org/v3/homoit0000563
related: https://homosaurus.org/v3/homoit0000568
related: https://homosaurus.org/v3/homoit0000575

Internalized lesbophobia
type: Concept
issued: 2023-04-14
modified: 2025-02-23
comment: The phenomenon in which lesbians internalize or adopt lesbophobic beliefs (i.e., negative perceptions of and intolerance toward lesbians and lesbianism) as a result of being raised or socialized within a lesbophobic environment or culture.
broader: https://homosaurus.org/v3/homoit0000803
broader: https://homosaurus.org/v3/homoit0002590
change note: Version 3.7.0
has top concept: LGBTQ+ phobia
in scheme: v3
narrower: https://homosaurus.org/v3/homoit0003092

Internalized biphobia
type: Concept
issued: 2023-04-14
modified: 2025-02-23
comment: The phenomenon in which bisexual people internalize or adopt biphobic beliefs (i.e., negative perceptions of and intolerance toward bisexual people and bisexuality) as a result of being raised or socialized within a biphobic environment or culture.
broader: https://homosaurus.org/v3/homoit0000117
broader: https://homosaurus.org/v3/homoit0002590
change note: Version 3.7.0
has top concept: LGBTQ+ phobia
in scheme: v3
narrower: https://homosaurus.org/v3/homoit0003094

Internalized transphobia
type: Concept
issued: 2023-04-14
modified: 2025-02-23
comment: The phenomenon in which transgender people internalize or adopt transphobic beliefs (i.e., negative perceptions of and intolerance toward transgender people and trans identities) as a result of being raised or socialized within a transphobic environment or culture.
broader: https://homosaurus.org/v3/homoit0001467
broader: https://homosaurus.org/v3/homoit0002590
change note: Version 3.7.0
has top concept: LGBTQ+ phobia
in scheme: v3
narrower: https://homosaurus.org/v3/homoit0003095

Internalized queerphobia
type: Concept
issued: 2023-04-14
modified: 2025-02-23
comment: The phenomenon in which queer people internalize or adopt queerphobic beliefs (i.e., negative perceptions of and intolerance toward queer people and queerness) as a result of being raised or socialized within a queerphobic environment or culture.
broader: https://homosaurus.org/v3/homoit0001229
broader: https://homosaurus.org/v3/homoit0002590
change note: Version 3.7.0
has top concept: LGBTQ+ phobia
in scheme: v3
narrower: https://homosaurus.org/v3/homoit0003096

Internalized intersexphobia
type: Concept
issued: 2023-04-14
modified: 2025-02-23
comment: The phenomenon in which intersex people internalize or adopt intersexphobic beliefs (i.e., negative perceptions of and intolerance toward intersex people and intersex variations) as a result of being raised or socialized within a intersexphobic environment or culture.
alternative label: Internalized interphobia
broader: https://homosaurus.org/v3/homoit0000666
broader: https://homosaurus.org/v3/homoit0002590
change note: Version 3.7.0
has top concept: LGBTQ+ phobia
in scheme: v3
narrower: https://homosaurus.org/v3/homoit0003097

Transgender art
type: Concept
issued: 2023-04-14
modified: 2025-02-23
comment: Term for different forms of creative activity, including visual, material, and performing arts, by transgender artists or about transgender topics and communities.
broader: https://homosaurus.org/v3/homoit0000816
change note: Version 3.7.0
has top concept: Subcultures
in scheme: v3
related: https://homosaurus.org/v3/homoit0002610

Gay art
type: Concept
issued: 2023-04-14
modified: 2025-02-23
comment: Umbrella term for different forms of creative activity, including visual, material, and performing arts, by gay artists or about gay topics and communities. Use a more specific term if possible.
broader: https://homosaurus.org/v3/homoit0000816
change note: Version 3.7.0
has top concept: Subcultures
in scheme: v3
related: https://homosaurus.org/v3/homoit0002608

Lesbian art
type: Concept
issued: 2023-04-14
modified: 2025-02-23
comment: Term for different forms of creative activity, including visual, material, and performing arts, by lesbian artists or about lesbian topics and communities.
broader: https://homosaurus.org/v3/homoit0000816
change note: Version 3.7.0
has top concept: Subcultures
in scheme: v3
related: https://homosaurus.org/v3/homoit0002607

Bisexual art
type: Concept
issued: 2023-04-14
modified: 2025-02-23
comment: Term for different forms of creative activity, including visual, material, and performing arts, by bisexual artists or about bisexual topics and communities.
broader: https://homosaurus.org/v3/homoit0000816
change note: Version 3.7.0
has top concept: Subcultures
in scheme: v3
related: https://homosaurus.org/v3/homoit0002609

Queer art
type: Concept
issued: 2023-04-14
modified: 2025-02-23
comment: Term for different forms of creative activity, including visual, material, and performing arts, by queer artists or about queer topics and communities.
broader: https://homosaurus.org/v3/homoit0000816
change note: Version 3.7.0
has top concept: Subcultures
in scheme: v3
narrower: https://homosaurus.org/v3/homoit0003614
related: https://homosaurus.org/v3/homoit0002611

Intersex art
type: Concept
issued: 2023-04-14
modified: 2025-02-23
comment: Term for different forms of creative activity, including visual, material, and performing arts, by intersex artists or about intersex topics and communities.
broader: https://homosaurus.org/v3/homoit0000816
change note: Version 3.7.0
has top concept: Subcultures
in scheme: v3
related: https://homosaurus.org/v3/homoit0002612

Aromantic art
type: Concept
issued: 2023-04-14
modified: 2025-02-23
comment: Term for different forms of creative activity, including visual, material, and performing arts, by aromantic artists or about aromantic topics and communities.
broader: https://homosaurus.org/v3/homoit0000816
change note: Version 3.7.0
has top concept: Subcultures
in scheme: v3
related: https://homosaurus.org/v3/homoit0002613

Asexual art
type: Concept
issued: 2023-04-14
modified: 2025-02-23
comment: Term for different forms of creative activity, including visual, material, and performing arts, by asexual artists or about asexual topics and communities.
broader: https://homosaurus.org/v3/homoit0000816
change note: Version 3.7.0
has top concept: Subcultures
in scheme: v3
related: https://homosaurus.org/v3/homoit0002614

Demisexual art
type: Concept
issued: 2023-04-14
modified: 2025-02-23
comment: Term for different forms of creative activity, including visual, material, and performing arts, by demisexual artists or about demisexual topics and communities.
broader: https://homosaurus.org/v3/homoit0000816
change note: Version 3.7.0
has top concept: Subcultures
in scheme: v3
related: https://homosaurus.org/v3/homoit0002615

Two-Spirit erotic art
type: Concept
issued: 2023-04-14
modified: 2025-02-23
comment: Erotic art, created by Two-Spirit artists, depicting Two-Spirit people, or that are regarded as important within Two-Spirit culture.
alternative label: 2S erotic art
alternative label: Two Spirit erotic art
alternative label: Two Spirited erotic art
alternative label: Two-Spirited erotic art
broader: https://homosaurus.org/v3/homoit0002597
change note: Version 3.7.0
has top concept: Two-Spirit art
in scheme: v3
related: https://homosaurus.org/v3/homoit0002579

Lesbian erotic art
type: Concept
issued: 2023-04-14
modified: 2025-02-23
comment: Erotic art, created by lesbian artists, depicting lesbian people, or that are regarded as important within lesbian culture.
broader: https://homosaurus.org/v3/homoit0002579
change note: Version 3.7.0
has top concept: Subcultures
in scheme: v3
narrower: https://homosaurus.org/v3/homoit0000765
narrower: https://homosaurus.org/v3/homoit0002546
related: https://homosaurus.org/v3/homoit0002599

Gay erotic art
type: Concept
issued: 2023-04-14
modified: 2025-02-23
comment: Erotic art, created by gay artists, depicting gay people, or that are regarded as important within gay culture.
broader: https://homosaurus.org/v3/homoit0002579
change note: Version 3.7.0
has top concept: Subcultures
in scheme: v3
narrower: https://homosaurus.org/v3/homoit0000520
narrower: https://homosaurus.org/v3/homoit0002547
related: https://homosaurus.org/v3/homoit0002598

Bisexual erotic art
type: Concept
issued: 2023-04-14
modified: 2025-02-23
comment: Erotic art, created by bisexual artists, depicting bisexual people, or that are regarded as important within bisexual culture.
broader: https://homosaurus.org/v3/homoit0002579
change note: Version 3.7.0
has top concept: Subcultures
in scheme: v3
narrower: https://homosaurus.org/v3/homoit0000176
narrower: https://homosaurus.org/v3/homoit0002548
related: https://homosaurus.org/v3/homoit0002600

Transgender erotic art
type: Concept
issued: 2023-04-14
modified: 2025-02-23
comment: Erotic art, created by transgender artists, depicting transgender people, or that are regarded as important within transgender culture.
broader: https://homosaurus.org/v3/homoit0002579
change note: Version 3.7.0
has top concept: Subcultures
in scheme: v3
narrower: https://homosaurus.org/v3/homoit0001435
narrower: https://homosaurus.org/v3/homoit0002549
related: https://homosaurus.org/v3/homoit0002596

Queer erotic art
type: Concept
issued: 2023-04-14
modified: 2025-02-23
comment: Erotic art, created by queer artists, depicting queer people, or that are regarded as important within queer culture.
broader: https://homosaurus.org/v3/homoit0002579
change note: Version 3.7.0
has top concept: Subcultures
in scheme: v3
narrower: https://homosaurus.org/v3/homoit0001199
narrower: https://homosaurus.org/v3/homoit0002550
related: https://homosaurus.org/v3/homoit0002601

Intersex erotic art
type: Concept
issued: 2023-04-14
modified: 2025-02-23
comment: Erotic art, created by intersex artists, depicting intersex people, or that are regarded as important within intersex culture.
broader: https://homosaurus.org/v3/homoit0002579
change note: Version 3.7.0
has top concept: Subcultures
in scheme: v3
narrower: https://homosaurus.org/v3/homoit0002551
narrower: https://homosaurus.org/v3/homoit0002556
related: https://homosaurus.org/v3/homoit0002602

Aromantic erotic art
type: Concept
issued: 2023-04-14
modified: 2025-02-23
comment: Erotic art, created by aromantic artists, depicting aromantic people, or that are regarded as important within aromantic culture.
broader: https://homosaurus.org/v3/homoit0002579
change note: Version 3.7.0
has top concept: Subcultures
in scheme: v3
narrower: https://homosaurus.org/v3/homoit0002552
narrower: https://homosaurus.org/v3/homoit0002557
related: https://homosaurus.org/v3/homoit0002603

Asexual erotic art
type: Concept
issued: 2023-04-14
modified: 2025-02-23
comment: Erotic art, created by asexual artists, depicting asexual people, or that are regarded as important within asexual culture.
broader: https://homosaurus.org/v3/homoit0002579
change note: Version 3.7.0
has top concept: Subcultures
in scheme: v3
narrower: https://homosaurus.org/v3/homoit0002553
narrower: https://homosaurus.org/v3/homoit0002558
related: https://homosaurus.org/v3/homoit0002604

Demisexual erotic art
type: Concept
issued: 2023-04-14
modified: 2025-02-23
comment: Erotic art, created by demisexual artists, depicting demisexual people, or that are regarded as important within demisexual culture.
broader: https://homosaurus.org/v3/homoit0002579
change note: Version 3.7.0
has top concept: Subcultures
in scheme: v3
narrower: https://homosaurus.org/v3/homoit0002554
narrower: https://homosaurus.org/v3/homoit0002559
related: https://homosaurus.org/v3/homoit0002605

Anonymous donors (Reproduction)
type: Concept
issued: 2023-04-14
modified: 2025-02-23
comment: People who donated their gametes with the understanding that their identity would remain unknown by any potential offspring.
broader: https://homosaurus.org/v3/homoit0000364
change note: Version 3.7.0
has top concept: Donors
in scheme: v3
related: https://homosaurus.org/v3/homoit0002618

Artificial insemination
type: Concept
issued: 2023-04-14
modified: 2025-02-23
comment: The introduction of semen into the cervical opening, uterus, or fallopian tube using assistance from reproductive technology. Some choose not to use this term due to the implications of the word "artificial."
broader: https://homosaurus.org/v3/homoit0000069
broader: https://homosaurus.org/v3/homoit0002618
change note: Version 3.7.0
has top concept: LGBTQ+ family planning
in scheme: v3
related: https://homosaurus.org/v3/homoit0001336
related: https://homosaurus.org/v3/homoit0003501

Assisted reproduction
type: Concept
issued: 2023-04-14
modified: 2025-02-23
comment: The process by which a fetus is conceived through donor insemination, egg donation, surrogacy, IVF, and/or other reproductive technologies.
broader: https://homosaurus.org/v3/homoit0002619
change note: Version 3.7.0
has top concept: Assisted reproductive technology
in scheme: v3
narrower: https://homosaurus.org/v3/homoit0000659
narrower: https://homosaurus.org/v3/homoit0001265
narrower: https://homosaurus.org/v3/homoit0001347
narrower: https://homosaurus.org/v3/homoit0002617
narrower: https://homosaurus.org/v3/homoit0002620
narrower: https://homosaurus.org/v3/homoit0002622
narrower: https://homosaurus.org/v3/homoit0002626
related: https://homosaurus.org/v3/homoit0000069
related: https://homosaurus.org/v3/homoit0002616

Donor insemination
type: Concept
issued: 2023-04-14
modified: 2025-02-23
comment: The process by which donated sperm is placed inside a person with a uterus to induce pregnancy.
broader: https://homosaurus.org/v3/homoit0000069
broader: https://homosaurus.org/v3/homoit0002618
change note: Version 3.7.0
has top concept: LGBTQ+ family planning
in scheme: v3
narrower: https://homosaurus.org/v3/homoit0001336
related: https://homosaurus.org/v3/homoit0002626

Donor siblings
type: Concept
issued: 2023-04-14
modified: 2025-02-23
comment: People who are biologically related to one another through a shared donor.
broader: https://homosaurus.org/v3/homoit0001310
change note: Version 3.7.0
has top concept: Family members
in scheme: v3
related: https://homosaurus.org/v3/homoit0000116
related: https://homosaurus.org/v3/homoit0000364
related: https://homosaurus.org/v3/homoit0000583

Egg donation
type: Concept
issued: 2023-04-14
modified: 2025-02-23
comment: The process by which a person donates their eggs for reproduction.
broader: https://homosaurus.org/v3/homoit0002618
change note: Version 3.7.0
has top concept: Assisted reproductive technology
in scheme: v3
related: https://homosaurus.org/v3/homoit0002627

Half-siblings
type: Concept
issued: 2023-04-14
modified: 2025-02-23
comment: Siblings who are biologically related through one but not all of their parents.
alternative label: Half siblings
broader: https://homosaurus.org/v3/homoit0001310
change note: Version 3.7.0
has top concept: Family members
in scheme: v3
related: https://homosaurus.org/v3/homoit0000116
related: https://homosaurus.org/v3/homoit0000583
related: https://homosaurus.org/v3/homoit0002349

Known donors (Reproduction)
type: Concept
issued: 2023-04-14
modified: 2025-02-23
comment: Donors whose identities are known by the people to whom they donated gametes and/or the offspring born of that donation.
broader: https://homosaurus.org/v3/homoit0000364
change note: Version 3.7.0
has top concept: Donors
in scheme: v3

Open identity donors (Reproduction)
type: Concept
issued: 2023-04-14
modified: 2025-02-23
comment: Donors who donated their gametes with the understanding that their identity and/or contact information would be released to any offspring born of that donation. The age at which the offspring receives this information varies, following the donor's preference.
alternative label: Identity release donors
alternative label: Willing-to-be-known donors
broader: https://homosaurus.org/v3/homoit0000364
change note: Version 3.7.0
has top concept: Donors
in scheme: v3

Sperm donation
type: Concept
issued: 2023-04-14
modified: 2025-02-23
comment: The process by which a person donates their sperm for reproduction.
broader: https://homosaurus.org/v3/homoit0002618
change note: Version 3.7.0
has top concept: Assisted reproductive technology
in scheme: v3
related: https://homosaurus.org/v3/homoit0001336
related: https://homosaurus.org/v3/homoit0002620

Gestational surrogacy
type: Concept
issued: 2023-04-14
modified: 2025-02-23
comment: The process by which a person becomes pregnant using a donated egg.
broader: https://homosaurus.org/v3/homoit0001347
change note: Version 3.7.0
has top concept: LGBTQ+ families
in scheme: v3
related: https://homosaurus.org/v3/homoit0000390
related: https://homosaurus.org/v3/homoit0000587
related: https://homosaurus.org/v3/homoit0002622
related: https://homosaurus.org/v3/homoit0002628

Surro babies
type: Concept
issued: 2023-04-14
modified: 2025-02-23
comment: People born through surrogacy.
alternative label: Surro baby
alternative label: Surrogate babies
broader: https://homosaurus.org/v3/homoit0000255
change note: Version 3.7.0
has top concept: Family members
in scheme: v3
related: https://homosaurus.org/v3/homoit0000587
related: https://homosaurus.org/v3/homoit0002627

Test tube babies
type: Concept
issued: 2023-04-14
modified: 2025-02-23
comment: People who were conceived through IVF, or in vitro fertilization.
alternative label: Test tube baby
broader: https://homosaurus.org/v3/homoit0000255
change note: Version 3.7.0
has top concept: Family members
in scheme: v3
related: https://homosaurus.org/v3/homoit0000659

Non-binary disabled people
type: Concept
issued: 2023-06-26
modified: 2025-02-23
comment: Non-binary people who are disabled.
alternative label: Disabled non-binary people
alternative label: Non-binary people with disabilities
broader: https://homosaurus.org/v3/homoit0001854
change note: Version 3.7.0
has top concept: LGBTQ+ people
in scheme: v3
narrower: https://homosaurus.org/v3/homoit0003005
narrower: https://homosaurus.org/v3/homoit0003011
narrower: https://homosaurus.org/v3/homoit0003016
narrower: https://homosaurus.org/v3/homoit0003021
narrower: https://homosaurus.org/v3/homoit0003027
related: https://homosaurus.org/v3/homoit0003026

MVPFAFF+
type: Concept
issued: 2023-06-26
modified: 2025-02-23
comment: Acronym used to describe Pasifika/Pacific Islander gender diverse identities as a group. The acronym includes Māhū (Hawai'i and Tahiti), Vaka sa lewa lewa (Fiji), Palopa (Papua New Guinea), Fa’afafine (Samoa), Akava’ine (Rarotonga), Fakaleitī (Tonga), Fakafifine (Niue), and more.
broader: https://homosaurus.org/v3/homoit0000322
change note: Version 3.7.0
has top concept: Gender
in scheme: v3
narrower: https://homosaurus.org/v3/homoit0000035
narrower: https://homosaurus.org/v3/homoit0000413
narrower: https://homosaurus.org/v3/homoit0000419
narrower: https://homosaurus.org/v3/homoit0000979
narrower: https://homosaurus.org/v3/homoit0001499
narrower: https://homosaurus.org/v3/homoit0001502

Māhūkāne
type: Concept
issued: 2023-06-26
modified: 2025-02-23
comment: A term coined by the Kānaka Maoli (Native Hawaiian) queer community in the early 2000s that blends the term Māhū (for third gender indigenous people of Hawai'i and Tahiti who blend genders and often hold spiritual roles) and kāne (man).
alternative label: Mahukane
broader: https://homosaurus.org/v3/homoit0000979
change note: Version 3.7.0
has top concept: Gender
in scheme: v3

Māhūwahine
type: Concept
issued: 2023-06-26
modified: 2025-02-23
comment: A term coined by the Kānaka Maoli (Native Hawaiian) queer community in the early 2000s that blends the term Māhū (for third gender indigenous people of Hawai'i and Tahiti who blend genders and often hold spiritual roles) and wahine (woman).
alternative label: Mahuwahine
broader: https://homosaurus.org/v3/homoit0000979
change note: Version 3.7.0
has top concept: Gender
in scheme: v3

LGBTQ+ neurodivergent people
type: Concept
issued: 2023-06-26
modified: 2025-02-23
comment: LGBTQ+ people whose brains process, learn, and/or behave differently from what is considered typical by society. Some of these neurological differences can present as learning disabilities, medical disorders, and other conditions.
broader: https://homosaurus.org/v3/homoit0001854
change note: Version 3.7.0
has top concept: LGBTQ+ people
in scheme: v3
narrower: https://homosaurus.org/v3/homoit0002659
narrower: https://homosaurus.org/v3/homoit0002660
narrower: https://homosaurus.org/v3/homoit0002661
narrower: https://homosaurus.org/v3/homoit0002662
narrower: https://homosaurus.org/v3/homoit0002663
narrower: https://homosaurus.org/v3/homoit0002664
narrower: https://homosaurus.org/v3/homoit0002665
narrower: https://homosaurus.org/v3/homoit0002667
related: https://homosaurus.org/v3/homoit0002666
related: https://homosaurus.org/v3/homoit0003824

Gay neurodivergent men
type: Concept
issued: 2023-06-26
modified: 2025-02-23
comment: Gay men whose brains process, learn, and/or behave differently from what is considered typical by society. Some of these neurological differences can present as learning disabilities, medical disorders, and other conditions.
alternative label: Neurodivergent gay people
alternative label: Neurodivergent gay men
alternative label: Gay neurodivergent people
broader: https://homosaurus.org/v3/homoit0002658
change note: Version 3.7.0
has top concept: LGBTQ+ people
in scheme: v3

Lesbian neurodivergent people
type: Concept
issued: 2023-06-26
modified: 2025-02-23
comment: Lesbians whose brains process, learn, and/or behave differently from what is considered typical by society. Some of these neurological differences can present as learning disabilities, medical disorders, and other conditions.
broader: https://homosaurus.org/v3/homoit0002658
change note: Version 3.7.0
has top concept: LGBTQ+ people
in scheme: v3

Bisexual neurodivergent people
type: Concept
issued: 2023-06-26
modified: 2025-02-23
comment: Bisexual people whose brains process, learn, and/or behave differently from what is considered typical by society. Some of these neurological differences can present as learning disabilities, medical disorders, and other conditions.
broader: https://homosaurus.org/v3/homoit0002658
change note: Version 3.7.0
has top concept: LGBTQ+ people
in scheme: v3

Transgender neurodivergent people
type: Concept
issued: 2023-06-26
modified: 2025-02-23
comment: Transgender people whose brains process, learn, and/or behave differently from what is considered typical by society. Some of these neurological differences can present as learning disabilities, medical disorders, and other conditions.
alternative label: Neurodivergent transgender people
broader: https://homosaurus.org/v3/homoit0002658
change note: Version 3.7.0
has top concept: LGBTQ+ people
in scheme: v3

Queer neurodivergent people
type: Concept
issued: 2023-06-26
modified: 2025-02-23
comment: Queer people whose brains process, learn, and/or behave differently from what is considered typical by society. Some of these neurological differences can present as learning disabilities, medical disorders, and other conditions.
alternative label: Neurodivergent queer people
broader: https://homosaurus.org/v3/homoit0002658
change note: Version 3.7.0
has top concept: LGBTQ+ people
in scheme: v3

Asexual neurodivergent people
type: Concept
issued: 2023-06-26
modified: 2025-02-23
comment: Asexual people whose brains process, learn, and/or behave differently from what is considered typical by society. Some of these neurological differences can present as learning disabilities, medical disorders, and other conditions.
broader: https://homosaurus.org/v3/homoit0002658
broader: https://homosaurus.org/v3/homoit0002782
change note: Version 3.7.0
has top concept: LGBTQ+ people
in scheme: v3

Intersex neurodivergent people
type: Concept
issued: 2023-06-26
modified: 2025-02-23
comment: Intersex people whose brains process, learn, and/or behave differently from what is considered typical by society. Some of these neurological differences can present as learning disabilities, medical disorders, and other conditions.
alternative label: Neurodivergent Intersex people
broader: https://homosaurus.org/v3/homoit0002658
change note: Version 3.7.0
has top concept: LGBTQ+ people
in scheme: v3
narrower: https://homosaurus.org/v3/homoit0002674

Two-Spirit neurodivergent people
type: Concept
issued: 2023-06-26
modified: 2025-02-23
comment: Two-Spirit people whose brains process, learn, and/or behave differently from what is considered typical by society. Some of these neurological differences can present as learning disabilities, medical disorders, and other conditions.
alternative label: 2S neurodivergent people
alternative label: Two Spirit neurodivergent people
alternative label: Two Spirited neurodivergent people
alternative label: Two-Spirited neurodivergent people
broader: https://homosaurus.org/v3/homoit0001480
change note: Version 3.7.0
has top concept: Gender
in scheme: v3
narrower: https://homosaurus.org/v3/homoit0002676
related: https://homosaurus.org/v3/homoit0002658

LGBTQ+ autistic people
type: Concept
issued: 2023-06-26
modified: 2025-02-23
comment: LGBTQ+ people who are autistic.
alternative label: LGBTQ+ people with autism
broader: https://homosaurus.org/v3/homoit0002658
change note: Version 3.7.0
has top concept: LGBTQ+ people
in scheme: v3
narrower: https://homosaurus.org/v3/homoit0002668
narrower: https://homosaurus.org/v3/homoit0002669
narrower: https://homosaurus.org/v3/homoit0002670
narrower: https://homosaurus.org/v3/homoit0002671
narrower: https://homosaurus.org/v3/homoit0002672
narrower: https://homosaurus.org/v3/homoit0002673
narrower: https://homosaurus.org/v3/homoit0002674
narrower: https://homosaurus.org/v3/homoit0002675
related: https://homosaurus.org/v3/homoit0002676
related: https://homosaurus.org/v3/homoit0003825

Lesbian autistic people
type: Concept
issued: 2023-06-26
modified: 2025-02-23
comment: Lesbians who are autistic.
alternative label: Lesbians with autism
broader: https://homosaurus.org/v3/homoit0002667
change note: Version 3.7.0
has top concept: LGBTQ+ people
in scheme: v3

Gay autistic men
type: Concept
issued: 2023-06-26
modified: 2025-02-23
comment: Gay men who are autistic.
alternative label: Gay men with autism
alternative label: Gay autistic people
alternative label: Gay people with autistic
alternative label: Gay autists
alternative label: Autistic gay men
alternative label: Autistic gay people
broader: https://homosaurus.org/v3/homoit0002667
change note: Version 3.7.0
has top concept: LGBTQ+ people
in scheme: v3

Bisexual autistic people
type: Concept
issued: 2023-06-26
modified: 2025-02-23
comment: Bisexual people who are autistic.
alternative label: Bisexual people with autism
broader: https://homosaurus.org/v3/homoit0002667
change note: Version 3.7.0
has top concept: LGBTQ+ people
in scheme: v3

Transgender autistic people
type: Concept
issued: 2023-06-26
modified: 2025-02-23
comment: Transgender people who are autistic.
alternative label: Transgender people with autism
broader: https://homosaurus.org/v3/homoit0002667
change note: Version 3.7.0
has top concept: LGBTQ+ people
in scheme: v3

Queer autistic people
type: Concept
issued: 2023-06-26
modified: 2025-02-23
comment: Queer people who are autistic.
alternative label: Autistic queer people
alternative label: Queer people with autism
broader: https://homosaurus.org/v3/homoit0002667
change note: Version 3.7.0
has top concept: LGBTQ+ people
in scheme: v3

Non-binary autistic people
type: Concept
issued: 2023-06-26
modified: 2025-02-23
comment: Non-binary people who are autistic.
alternative label: Autistic non-binary people
alternative label: Non-binary people with autism
broader: https://homosaurus.org/v3/homoit0002667
broader: https://homosaurus.org/v3/homoit0003005
change note: Version 3.7.0
has top concept: LGBTQ+ people
in scheme: v3

Intersex autistic people
type: Concept
issued: 2023-06-26
modified: 2025-02-23
comment: Intersex people who are autistic.
alternative label: Autistic intersex people
alternative label: Intersex people with autism
broader: https://homosaurus.org/v3/homoit0002665
broader: https://homosaurus.org/v3/homoit0002667
change note: Version 3.7.0
has top concept: LGBTQ+ people
in scheme: v3

Asexual autistic people
type: Concept
issued: 2023-06-26
modified: 2025-02-23
comment: Asexual people who are autistic.
alternative label: Asexual people with autism
alternative label: Autistic asexual people
broader: https://homosaurus.org/v3/homoit0002667
change note: Version 3.7.0
has top concept: LGBTQ+ people
in scheme: v3

Two-Spirit autistic people
type: Concept
issued: 2023-06-26
modified: 2025-02-23
comment: Two-Spirit people who are autistic.
alternative label: 2S autistic people
alternative label: 2S people with autism
alternative label: Two Spirit autistic people
alternative label: Two Spirit people with autism
alternative label: Two Spirited autistic people
alternative label: Two Spirited people with autism
alternative label: Two-Spirited autistic people
alternative label: Two-Spirited people with autism
broader: https://homosaurus.org/v3/homoit0002666
broader: https://homosaurus.org/v3/homoit0002682
change note: Version 3.7.0
has top concept: Gender
in scheme: v3
related: https://homosaurus.org/v3/homoit0002667

Two-Spirit artists
type: Concept
issued: 2023-06-26
modified: 2025-02-23
comment: Two-Spirit people who practice any of various creative arts.
alternative label: 2S artists
alternative label: Two Spirit artists
alternative label: Two Spirited artists
alternative label: Two-Spirited artists
broader: https://homosaurus.org/v3/homoit0001480
change note: Version 3.7.0
has top concept: Gender
in scheme: v3
narrower: https://homosaurus.org/v3/homoit0003436
narrower: https://homosaurus.org/v3/homoit0003453
related: https://homosaurus.org/v3/homoit0000070

Two-Spirit disabled people
type: Concept
issued: 2023-06-26
modified: 2025-02-23
comment: Two-Spirit people who are disabled
alternative label: 2S disabled people
alternative label: Disabled 2S people
alternative label: Disabled Two Spirit people
alternative label: Disabled Two-Spirited people
alternative label: Two Spirit disabled people
alternative label: Two Spirited disabled people
alternative label: Two-Spirited disabled people
broader: https://homosaurus.org/v3/homoit0001480
change note: Version 3.7.0
has top concept: Gender
in scheme: v3
narrower: https://homosaurus.org/v3/homoit0002676
narrower: https://homosaurus.org/v3/homoit0002683
narrower: https://homosaurus.org/v3/homoit0002684
narrower: https://homosaurus.org/v3/homoit0002693
narrower: https://homosaurus.org/v3/homoit0002695
related: https://homosaurus.org/v3/homoit0001854
related: https://homosaurus.org/v3/homoit0002694

Two-Spirit blind people
type: Concept
issued: 2023-06-26
modified: 2025-02-23
comment: Two-Spirit people with significant or total loss of vision.
alternative label: 2S blind people
alternative label: Blind 2S people
alternative label: Blind Two Spirit people
alternative label: Blind Two Spirited people
alternative label: Blind Two-Spirited people
alternative label: Two Spirit blind people
alternative label: Two Spirited blind people
alternative label: Two-Spirited blind people
broader: https://homosaurus.org/v3/homoit0002682
change note: Version 3.7.0
has top concept: Gender
in scheme: v3
related: https://homosaurus.org/v3/homoit0000822

Two-Spirit Deaf people
type: Concept
issued: 2023-06-26
modified: 2025-02-23
comment: Two-Spirit people with significant or total hearing loss. Some but not all Deaf people prefer to capitalize Deaf in recognition of the cultural and linguistic identity they share with other Deaf people.
alternative label: 2S Deaf people
alternative label: Deaf 2S people
alternative label: Deaf Two Spirit people
alternative label: Deaf Two Spirited people
alternative label: Deaf Two-Spirited people
alternative label: Two Spirit Deaf people
alternative label: Two Spirited Deaf people
alternative label: Two-Spirited Deaf people
broader: https://homosaurus.org/v3/homoit0002682
change note: Version 3.7.0
has top concept: Gender
in scheme: v3
related: https://homosaurus.org/v3/homoit0001866

Two-Spirit children
type: Concept
issued: 2023-06-26
modified: 2025-02-23
comment: Two-Spirit people who have not yet reached the age of adolescence.
alternative label: 2S children
alternative label: Two Spirit children
alternative label: Two Spirited children
alternative label: Two-Spirited children
broader: https://homosaurus.org/v3/homoit0000255
change note: Version 3.7.0
has top concept: Family members
in scheme: v3
related: https://homosaurus.org/v3/homoit0000256

Two-Spirit hard of hearing people
type: Concept
issued: 2023-06-26
modified: 2025-02-23
comment: Two-Spirit people with significant or total hearing loss who may or may not consider themselves d/Deaf.
alternative label: 2S hard of hearing people
alternative label: Two Spirit hard of hearing people
alternative label: Two Spirited hard of hearing people
alternative label: Two-Spirited hard of hearing people
broader: https://homosaurus.org/v3/homoit0002682
change note: Version 3.7.0
has top concept: Gender
in scheme: v3
related: https://homosaurus.org/v3/homoit0001860

Two-Spirit wheelchair users
type: Concept
issued: 2023-06-26
modified: 2025-02-23
comment: Two-Spirit people who use wheelchairs.
alternative label: 2S wheelchair users
alternative label: Two Spirit wheelchair users
alternative label: Two Spirited wheelchair users
alternative label: Two-Spirited wheelchair users
broader: https://homosaurus.org/v3/homoit0002682
change note: Version 3.7.0
has top concept: Gender
in scheme: v3
related: https://homosaurus.org/v3/homoit0001877

Gender dysphoria in children
type: Concept
issued: 2023-06-27
modified: 2025-02-23
comment: A psychological diagnosis (replacing the outdated and offensive "gender identity disorder") used to describe the sense of unease or dissatisfaction an individual feels as a result of incongruence between their gender identity and their assigned gender, gender expression, and/or the way their gender is perceived by others. This term is also used colloquially by individuals to describe the discomfort and distress they experience as a result of this incongruence. Though gender dysphoria is often associated with trans people, people of any identity may experience gender dysphoria when they do not feel "right" in their body or the way their gender is being expressed. Use this particular term for works about children who experience or have experienced gender dysphoria.
broader: https://homosaurus.org/v3/homoit0000567
change note: Version 3.7.0
has top concept: Gender dysphoria
in scheme: v3
related: https://homosaurus.org/v3/homoit0000256
related: https://homosaurus.org/v3/homoit0000568
related: https://homosaurus.org/v3/homoit0000571
related: https://homosaurus.org/v3/homoit0002256

Gender dysphoria in youth
type: Concept
issued: 2023-06-27
modified: 2025-02-23
comment: A psychological diagnosis (replacing the outdated and offensive "gender identity disorder") used to describe the sense of unease or dissatisfaction an individual feels as a result of incongruence between their gender identity and their assigned gender, gender expression, and/or the way their gender is perceived by others. This term is also used colloquially by individuals to describe the discomfort and distress they experience as a result of this incongruence. Though gender dysphoria is often associated with trans people, people of any identity may experience gender dysphoria when they do not feel "right" in their body or the way their gender is being expressed. Use this particular term for works about adolescents (people between the ages of childhood and adulthood) who experience or have experience gender dysphoria.
alternative label: Gender dysphoria in adolescence
alternative label: Gender dysphoria in adolescents
broader: https://homosaurus.org/v3/homoit0000567
change note: Version 3.7.0
has top concept: Gender dysphoria
in scheme: v3
related: https://homosaurus.org/v3/homoit0000568
related: https://homosaurus.org/v3/homoit0000571
related: https://homosaurus.org/v3/homoit0001521
related: https://homosaurus.org/v3/homoit0002256

Gay comedians
type: Concept
issued: 2023-06-27
modified: 2025-02-23
comment: Gay people who seek to entertain an audience by making them laugh, through jokes, slapstick, employing prop comedy, or other amusing means.
alternative label: Gay comics (Persons)
broader: https://homosaurus.org/v3/homoit0002701
change note: Version 3.7.0
has top concept: LGBTQ+ comedians
in scheme: v3

Lesbian comedians
type: Concept
issued: 2023-06-27
modified: 2025-02-23
comment: Lesbians who seek to entertain an audience by making them laugh, through jokes, slapstick, employing prop comedy, or other amusing means.
alternative label: Lesbian comics (Persons)
broader: https://homosaurus.org/v3/homoit0002701
change note: Version 3.7.0
has top concept: LGBTQ+ comedians
in scheme: v3

Bisexual comedians
type: Concept
issued: 2023-06-27
modified: 2025-02-23
comment: Bisexual people who seek to entertain an audience by making them laugh, through jokes, slapstick, employing prop comedy, or other amusing means.
alternative label: Bisexual comics (Persons)
broader: https://homosaurus.org/v3/homoit0002701
change note: Version 3.7.0
has top concept: LGBTQ+ comedians
in scheme: v3

Transgender comedians
type: Concept
issued: 2023-06-27
modified: 2025-02-23
comment: Transgender people who seek to entertain an audience by making them laugh, through jokes, slapstick, employing prop comedy, or other amusing means.
alternative label: Transgender comics (Persons)
broader: https://homosaurus.org/v3/homoit0002701
change note: Version 3.7.0
has top concept: LGBTQ+ comedians
in scheme: v3

Queer comedians
type: Concept
issued: 2023-06-27
modified: 2025-02-23
comment: Queer people who seek to entertain an audience by making them laugh, through jokes, slapstick, employing prop comedy, or other amusing means.
alternative label: Queer comics (Persons)
broader: https://homosaurus.org/v3/homoit0002701
change note: Version 3.7.0
has top concept: LGBTQ+ comedians
in scheme: v3

Intersex comedians
type: Concept
issued: 2023-06-27
modified: 2025-02-23
comment: Intersex people who seek to entertain an audience by making them laugh, through jokes, slapstick, employing prop comedy, or other amusing means.
alternative label: Intersex comics (Persons)
broader: https://homosaurus.org/v3/homoit0002701
change note: Version 3.7.0
has top concept: LGBTQ+ comedians
in scheme: v3

Asexual comedians
type: Concept
issued: 2023-06-27
modified: 2025-02-23
comment: Asexual people who seek to entertain an audience by making them laugh, through jokes, slapstick, employing prop comedy, or other amusing means.
alternative label: Asexual comics (Persons)
broader: https://homosaurus.org/v3/homoit0002701
change note: Version 3.7.0
has top concept: LGBTQ+ comedians
in scheme: v3

Two-Spirit comedians
type: Concept
issued: 2023-06-27
modified: 2025-02-23
comment: Two-Spirit people who seek to entertain an audience by making them laugh, through jokes, slapstick, employing prop comedy, or other amusing means.
alternative label: 2S comedians
alternative label: 2S comics (Persons)
alternative label: Two Spirited comedians
alternative label: Two Spirited comics (Persons)
alternative label: Two-Spirited comedians
alternative label: Two-Spirited comics (Persons)
broader: https://homosaurus.org/v3/homoit0001480
change note: Version 3.7.0
has top concept: Gender
in scheme: v3
related: https://homosaurus.org/v3/homoit0002701

Two-Spirit youth
type: Concept
issued: 2023-06-27
modified: 2025-02-23
comment: Two-Spirit people who are between the ages of childhood and adulthood.
alternative label: 2S adolescents
alternative label: 2S teenagers
alternative label: 2S teens
alternative label: 2S youth
alternative label: Two Spirit adolescents
alternative label: Two Spirit teenagers
alternative label: Two Spirit teens
alternative label: Two Spirit youth
alternative label: Two Spirited adolescents
alternative label: Two Spirited teenagers
alternative label: Two Spirited teens
alternative label: Two Spirited youth
alternative label: Two-Spirited adolescents
alternative label: Two-Spirited teenagers
alternative label: Two-Spirited teens
alternative label: Two-Spirited youth
broader: https://homosaurus.org/v3/homoit0001520
change note: Version 3.7.0
has top concept: Youth
in scheme: v3
narrower: https://homosaurus.org/v3/homoit0003473
narrower: https://homosaurus.org/v3/homoit0003487
related: https://homosaurus.org/v3/homoit0001521
related: https://homosaurus.org/v3/homoit0002712

Two-Spirit youth literature
type: Concept
issued: 2023-06-27
modified: 2025-02-23
comment: Written literary works for an audience of readers from 12-18 years of age, also known as young adult literature or YA; use in reference to youth literature focusing on Two-Spirit characters or themes.
alternative label: 2S youth literature
alternative label: Two Spirit youth literature
alternative label: Two Spirited youth literature
alternative label: Two-Spirited youth literature
broader: https://homosaurus.org/v3/homoit0002710
change note: Version 3.7.0
has top concept: Two-Spirit literature
in scheme: v3
related: https://homosaurus.org/v3/homoit0001522
related: https://homosaurus.org/v3/homoit0002711

Two-Spirit newsletters
type: Concept
issued: 2023-06-27
modified: 2025-02-23
comment: Serialized print or digital periodicals created by or for Two-Spirit people, often with the purpose of sharing news and information related to Two-Spirit communities and Two-Spirit issues.
alternative label: 2S newsletters
alternative label: Two Spirit newsletters
alternative label: Two Spirited newsletters
alternative label: Two-Spirited newsletters
broader: https://homosaurus.org/v3/homoit0002719
change note: Version 3.7.0
has top concept: Two-Spirit press
in scheme: v3
related: https://homosaurus.org/v3/homoit0001041

Two-Spirit newspapers
type: Concept
issued: 2023-06-27
modified: 2025-02-23
comment: Serialized print or digital publications about transgender people or Two-Spirit issues (and typically produced by Two-Spirit people or Two-Spirit organizations) that contain news, articles, columns, correspondence, and advertisements.
alternative label: 2S newspapers
alternative label: Two Spirit newspapers
alternative label: Two Spirited newspapers
alternative label: Two-Spirited newspapers
broader: https://homosaurus.org/v3/homoit0002719
change note: Version 3.7.0
has top concept: Two-Spirit press
in scheme: v3
related: https://homosaurus.org/v3/homoit0001042

Two-Spirit partners
type: Concept
issued: 2023-06-27
modified: 2025-02-23
comment: Two-Spirit people who are the romantic, sexual, or play partners of another person or people.
alternative label: 2S partners
alternative label: Two Spirit partners
alternative label: Two Spirited partners
alternative label: Two-Spirited partners
broader: https://homosaurus.org/v3/homoit0001480
broader: https://homosaurus.org/v3/homoit0002365
change note: Version 3.7.0
has top concept: Gender
in scheme: v3

Two-Spirit victims of hate crimes
type: Concept
issued: 2023-06-27
modified: 2025-02-23
comment: Two-Spirit people who have experienced hate crimes and may or may not have survived; follow the individual's preference for "victims" or "survivors" whenever possible.
alternative label: 2S victims of hate crimes
alternative label: Two Spirit victims of hate crimes
alternative label: Two Spirited victims of hate crimes
alternative label: Two-Spirited victims of hate crimes
broader: https://homosaurus.org/v3/homoit0003748
change note: Version 3.7.0
has top concept: Gender
in scheme: v3
related: https://homosaurus.org/v3/homoit0000613

Two-Spirit victims of rape
type: Concept
issued: 2023-06-27
modified: 2025-02-23
comment: Two-Spirit people who have experienced rape and may or may not have survived; follow the individual's preference for "victims" or "survivors" whenever possible.
alternative label: 2S victims of rape
alternative label: Two Spirit victims of rape
alternative label: Two Spirited victims of rape
alternative label: Two-Spirited victims of rape
broader: https://homosaurus.org/v3/homoit0003748
change note: Version 3.7.0
has top concept: Gender
in scheme: v3
related: https://homosaurus.org/v3/homoit0000958

Two-Spirit victims of sexual abuse
type: Concept
issued: 2023-06-27
modified: 2025-02-23
comment: Two-Spirit people who have experienced sexual abuse and may or may not have survived; follow the individual's preference for "victims" or "survivors" whenever possible.
alternative label: 2S victims of sexual abuse
alternative label: Two Spirit victims of sexual abuse
alternative label: Two Spirited victims of sexual abuse
alternative label: Two-Spirited victims of sexual abuse
broader: https://homosaurus.org/v3/homoit0001480
broader: https://homosaurus.org/v3/homoit0003748
change note: Version 3.7.0
has top concept: Gender
in scheme: v3
related: https://homosaurus.org/v3/homoit0000959

Two-Spirit victims of war
type: Concept
issued: 2023-06-27
modified: 2025-02-23
comment: Two-Spirit people who have experienced war and may or may not have survived; follow the individual's preference for "victims" or "survivors" whenever possible.
alternative label: 2S victims of war
alternative label: Two Spirit victims of war
alternative label: Two Spirited victims of war
alternative label: Two-Spirited victims of war
broader: https://homosaurus.org/v3/homoit0003748
change note: Version 3.7.0
has top concept: Gender
in scheme: v3
related: https://homosaurus.org/v3/homoit0000961

Intersex drama
type: Concept
issued: 2023-06-27
modified: 2025-02-23
comment: Works of fiction written to be performed; use in reference to dramatic works focusing on intersex characters or themes.
broader: https://homosaurus.org/v3/homoit0000376
change note: Version 3.7.0
has top concept: Subcultures
in scheme: v3

Intersex employment
type: Concept
issued: 2023-06-27
modified: 2025-02-23
comment: Employment of intersex people.
broader: https://homosaurus.org/v3/homoit0001717
change note: Version 3.7.0
has top concept: LGBTQ+ employment
in scheme: v3

Intersex fathers
type: Concept
issued: 2023-06-27
modified: 2025-02-23
comment: Intersex people who are fathers. Only use for people who identify as fathers.
broader: https://homosaurus.org/v3/homoit0002337
change note: Version 3.7.0
has top concept: Family members
in scheme: v3
related: https://homosaurus.org/v3/homoit0001763

Parents of intersex people
type: Concept
issued: 2023-06-27
modified: 2025-02-23
comment: People who act as parents to one or more intersex person. For parents who are themselves intersex, use the term "intersex parents."
alternative label: Intersex people's parents
broader: https://homosaurus.org/v3/homoit0002224
change note: Version 3.7.0
has top concept: Family members
in scheme: v3

Partners of intersex people
type: Concept
issued: 2023-06-27
modified: 2025-02-23
comment: People whose sexual, romantic, or play partner is intersex.
broader: https://homosaurus.org/v3/homoit0002366
change note: Version 3.7.0
has top concept: Partners
in scheme: v3

Persecution of intersex people
type: Concept
issued: 2023-06-27
modified: 2025-02-23
comment: Systematic mistreatment of intersex people on the basis of their sex or gender identity.
broader: https://homosaurus.org/v3/homoit0001108
change note: Version 3.7.0
has top concept: LGBTQ+ persecutions
in scheme: v3
related: https://homosaurus.org/v3/homoit0000618

Sons of intersex people
type: Concept
issued: 2023-06-27
modified: 2025-02-23
comment: Sons who have one or more intersex parent. For sons who are themselves intersex, use the term "Intersex sons."
broader: https://homosaurus.org/v3/homoit0002355
change note: Version 3.7.0
has top concept: Family members
in scheme: v3
related: https://homosaurus.org/v3/homoit0001767

White intersex people
type: Concept
issued: 2023-06-27
modified: 2025-02-23
comment: Intersex people who are white.
alternative label: Intersex Caucasian people
alternative label: Intersex white people
broader: https://homosaurus.org/v3/homoit0000243
change note: Version 3.7.0
has top concept: White LGBTQ+ people
in scheme: v3

Intersex information centers
type: Concept
issued: 2023-06-27
modified: 2025-02-23
comment: Institutions providing education, support, and information about intersex issues and intersex communities to intersex people.
alternative label: Intersex information centres
broader: https://homosaurus.org/v3/homoit0000660
change note: Version 3.7.0
has top concept: LGBTQ+ centers
in scheme: v3

Intersex libraries
type: Concept
issued: 2023-06-27
modified: 2025-02-23
comment: Libraries that hold materials primarily pertaining to intersex people or intended for use by intersex people.
broader: https://homosaurus.org/v3/homoit0000968
change note: Version 3.7.0
has top concept: LGBTQ+ cultural heritage institutions
in scheme: v3

Intersex literary criticism
type: Concept
issued: 2023-06-27
modified: 2025-02-23
comment: The study, evaluation, and interpretation of literary works focusing on intersex characters or themes; can also include interpretation of literature through the lens and frameworks of intersex studies.
broader: https://homosaurus.org/v3/homoit0001602
change note: Version 3.7.0
has top concept: LGBTQ+ literary criticism
in scheme: v3

Intersex literature
type: Concept
issued: 2023-06-27
modified: 2025-02-23
comment: Written literary works about intersex characters or themes.
broader: https://homosaurus.org/v3/homoit0000972
change note: Version 3.7.0
has top concept: Subcultures
in scheme: v3
narrower: https://homosaurus.org/v3/homoit0002953
related: https://homosaurus.org/v3/homoit0001749

Intersex activism
type: Concept
issued: 2023-06-27
modified: 2025-02-23
comment: Direct action and organizing to achieve political or social change, bodily autonomy, and acceptance for intersex people.
broader: https://homosaurus.org/v3/homoit0000006
change note: Version 3.7.0
has top concept: LGBTQ+ activism
in scheme: v3
narrower: https://homosaurus.org/v3/homoit0002933

Intersex people of color
type: Concept
issued: 2023-06-27
modified: 2025-02-23
comment: Primarily used in the United States, this term refers to intersex people who are not white and who identify as people of color.
alternative label: Intersex people of colour
broader: https://homosaurus.org/v3/homoit0001101
change note: Version 3.7.0
has top concept: LGBTQ+ people
in scheme: v3

Asian American intersex people
type: Concept
issued: 2023-06-27
modified: 2025-02-23
comment: Intersex people of Asian heritage or descent born in the United States or born in Asian countries who live in or have a strong connection to the United States. Only use for individuals who self-identify as Asian American.
alternative label: Intersex Asian American people
alternative label: Intersex Asian Americans
broader: https://homosaurus.org/v3/homoit0000073
change note: Version 3.7.0
has top concept: LGBTQ+ people
in scheme: v3
related: https://homosaurus.org/v3/homoit0002757

Asian intersex people
type: Concept
issued: 2023-06-27
modified: 2025-02-23
comment: Intersex individuals of Asian heritage or descent, living in Asia or part of the Asian diaspora. Only use for people who self-identify as Asian.
alternative label: Intersex Asian people
alternative label: Intersex Asians
broader: https://homosaurus.org/v3/homoit0000074
change note: Version 3.7.0
has top concept: LGBTQ+ people
in scheme: v3
related: https://homosaurus.org/v3/homoit0002756

Asexual activism
type: Concept
issued: 2023-06-27
modified: 2025-02-23
comment: Direct action and organizing to achieve political or social change and acceptance for asexual people.
broader: https://homosaurus.org/v3/homoit0000006
change note: Version 3.7.0
has top concept: LGBTQ+ activism
in scheme: v3
narrower: https://homosaurus.org/v3/homoit0002803

Asexual archives
type: Concept
issued: 2023-06-27
modified: 2025-02-23
comment: Collections of records and materials relating to asexual people or asexual communities; can include a variety of organizations and institutions from community to government archives.
broader: https://homosaurus.org/v3/homoit0000066
change note: Version 3.7.0
has top concept: LGBTQ+ cultural heritage institutions
in scheme: v3

Asexual artists
type: Concept
issued: 2023-06-27
modified: 2025-02-23
comment: Asexual people who practice any of various creative arts.
broader: https://homosaurus.org/v3/homoit0000070
change note: Version 3.7.0
has top concept: LGBTQ+ people
in scheme: v3

Asexual athletes
type: Concept
issued: 2023-06-27
modified: 2025-02-23
comment: Professional or recreational sports players who self-identify as asexual.
alternative label: Asexual sports players
alternative label: Asexual sportspeople
alternative label: Asexual sportspersons
broader: https://homosaurus.org/v3/homoit0000071
change note: Version 3.7.0
has top concept: Sexual minorities
in scheme: v3

Asexual bookshops
type: Concept
issued: 2023-06-27
modified: 2025-02-23
comment: Bookshops that sell materials intended for use by asexual people or addressing topics related to asexual experiences.
broader: https://homosaurus.org/v3/homoit0000216
change note: Version 3.7.0
has top concept: LGBTQ+ bookshops
in scheme: v3

Black intersex people
type: Concept
issued: 2023-06-27
modified: 2025-02-23
comment: Black people who are intersex. Use only for individuals who self-identity as Black. Follow the individual’s preference for African American or Black whenever possible.
alternative label: Intersex Black people
broader: https://homosaurus.org/v3/homoit0000208
change note: Version 3.7.0
has top concept: LGBTQ+ people
in scheme: v3
narrower: https://homosaurus.org/v3/homoit0002957
narrower: https://homosaurus.org/v3/homoit0002958
narrower: https://homosaurus.org/v3/homoit0002959
narrower: https://homosaurus.org/v3/homoit0002960

Daughters of intersex people
type: Concept
issued: 2023-06-27
modified: 2025-02-23
comment: Daughters who have one or more intersex parent.
broader: https://homosaurus.org/v3/homoit0002352
change note: Version 3.7.0
has top concept: Family members
in scheme: v3

Fathers of intersex people
type: Concept
issued: 2023-06-27
modified: 2025-02-23
comment: People who assume the role of father to intersex people. Only use to describe individuals who identify as fathers.
broader: https://homosaurus.org/v3/homoit0002342
change note: Version 3.7.0
has top concept: Family members
in scheme: v3

Jewish intersex people
type: Concept
issued: 2023-06-27
modified: 2025-02-23
comment: Intersex people who are Jewish.
alternative label: Intersex Jews
broader: https://homosaurus.org/v3/homoit0000682
change note: Version 3.7.0
has top concept: LGBTQ+ people
in scheme: v3

Latino/a/x intersex people
type: Concept
issued: 2023-06-27
modified: 2025-02-23
comment: Latin American people who are intersex; only use to describe individuals who self-identify as Latino, Latina, or Latinx. Do not conflate with Chicano/a/x or Hispanic.
alternative label: Intersex Latinas
alternative label: Intersex Latine people
alternative label: Intersex Latinos
alternative label: Intersex Latinx people
alternative label: Latina intersex people
alternative label: Latine intersex people
alternative label: Latino intersex people
alternative label: Latinx intersex people
broader: https://homosaurus.org/v3/homoit0000253
change note: Version 3.7.0
has top concept: LGBTQ+ people
in scheme: v3
narrower: https://homosaurus.org/v3/homoit0002960

Asexual characters
type: Concept
issued: 2023-06-27
modified: 2025-02-23
comment: Characters in creative works who are asexual.
broader: https://homosaurus.org/v3/homoit0000249
change note: Version 3.7.0
has top concept: LGBTQ+ characters
in scheme: v3

Asexual chefs
type: Concept
issued: 2023-06-27
modified: 2025-02-23
comment: Asexual people who are trained, professional cooks, typically holding a leadership role in the kitchen in which they are employed.
broader: https://homosaurus.org/v3/homoit0001771
change note: Version 3.7.0
has top concept: LGBTQ+ people
in scheme: v3
related: https://homosaurus.org/v3/homoit0001772
related: https://homosaurus.org/v3/homoit0001773
related: https://homosaurus.org/v3/homoit0001774
related: https://homosaurus.org/v3/homoit0001775
related: https://homosaurus.org/v3/homoit0001776
related: https://homosaurus.org/v3/homoit0001777

Asexual children
type: Concept
issued: 2023-06-27
modified: 2025-02-23
comment: Asexual people who have not yet reached the age of adolescence.
broader: https://homosaurus.org/v3/homoit0000255
broader: https://homosaurus.org/v3/homoit0000256
change note: Version 3.7.0
has top concept: Family members
in scheme: v3

Asexual community
type: Concept
issued: 2023-06-27
modified: 2025-02-23
comment: Groups of people who share the experience of being asexual.
broader: https://homosaurus.org/v3/homoit0000297
change note: Version 3.7.0
has top concept: LGBTQ+ communities
in scheme: v3

Asexual community centers
type: Concept
issued: 2023-06-27
modified: 2025-02-23
comment: Spaces in which people from asexual communities meet for social, education, recreational, or organizing activities.
broader: https://homosaurus.org/v3/homoit0000298
change note: Version 3.7.0
has top concept: LGBTQ+ centers
in scheme: v3
preferred label: Asexual community centres

Intersex archives
type: Concept
issued: 2023-06-27
modified: 2025-02-23
comment: Collections of records and materials relating to intersex people or intersex communities; can include a variety of organizations and institutions from community to government archives.
broader: https://homosaurus.org/v3/homoit0000066
change note: Version 3.7.0
has top concept: LGBTQ+ cultural heritage institutions
in scheme: v3

Intersex artists
type: Concept
issued: 2023-06-27
modified: 2025-02-23
comment: Intersex people who practice any of various creative arts.
broader: https://homosaurus.org/v3/homoit0000070
change note: Version 3.7.0
has top concept: LGBTQ+ people
in scheme: v3

Intersex autobiographies
type: Concept
issued: 2023-06-27
modified: 2025-02-23
comment: Accounts of intersex peoples' lives written by those people. For written accounts of intersex people's lives that were not written by the subject, use "Intersex biographies."
alternative label: Intersex memoirs
broader: https://homosaurus.org/v3/homoit0001729
change note: Version 3.7.0
has top concept: LGBTQ+ autobiographies
in scheme: v3
related: https://homosaurus.org/v3/homoit0002779

Intersex biographies
type: Concept
issued: 2023-06-27
modified: 2025-02-23
comment: Written accounts of the lives of intersex people. For written accounts of intersex people's lives written by the subject, use "Intersex autobiographies."
broader: https://homosaurus.org/v3/homoit0001614
change note: Version 3.7.0
has top concept: LGBTQ+ biographies
in scheme: v3
related: https://homosaurus.org/v3/homoit0001749
related: https://homosaurus.org/v3/homoit0002778

Asexual couples
type: Concept
issued: 2023-06-27
modified: 2025-02-23
comment: Partnerships in which both people are asexual.
broader: https://homosaurus.org/v3/homoit0000310
change note: Version 3.7.0
has top concept: LGBTQ+ relationships
in scheme: v3

Asexual daughters
type: Concept
issued: 2023-06-27
modified: 2025-02-23
comment: Daughters who identify as asexual.
broader: https://homosaurus.org/v3/homoit0000330
change note: Version 3.7.0
has top concept: LGBTQ+ people
in scheme: v3

Asexual disabled people
type: Concept
issued: 2023-06-28
modified: 2025-02-23
comment: Asexual people who are disabled.
alternative label: Asexual people with disabilities
alternative label: Disabled asexual people
broader: https://homosaurus.org/v3/homoit0001854
change note: Version 3.7.0
has top concept: LGBTQ+ people
in scheme: v3
narrower: https://homosaurus.org/v3/homoit0002664
narrower: https://homosaurus.org/v3/homoit0002783
narrower: https://homosaurus.org/v3/homoit0002784
narrower: https://homosaurus.org/v3/homoit0002785
narrower: https://homosaurus.org/v3/homoit0002787
related: https://homosaurus.org/v3/homoit0002786

Asexual blind people
type: Concept
issued: 2023-06-28
modified: 2025-02-23
comment: Asexual people with significant or total loss of vision.
alternative label: Blind asexual people
broader: https://homosaurus.org/v3/homoit0000822
broader: https://homosaurus.org/v3/homoit0002782
change note: Version 3.7.0
has top concept: LGBTQ+ people
in scheme: v3

Asexual Deaf people
type: Concept
issued: 2023-06-28
modified: 2025-02-23
comment: Asexual people with significant or total hearing loss. Some but not all Deaf people prefer to capitalize Deaf in recognition of the cultural and linguistic identity they share with other Deaf people.
alternative label: Deaf asexual people
broader: https://homosaurus.org/v3/homoit0001866
broader: https://homosaurus.org/v3/homoit0002782
change note: Version 3.7.0
has top concept: LGBTQ+ people
in scheme: v3
related: https://homosaurus.org/v3/homoit0002785

Asexual hard of hearing people
type: Concept
issued: 2023-06-28
modified: 2025-02-23
comment: Asexual people with significant or total hearing loss who may or may not consider themselves d/Deaf.
broader: https://homosaurus.org/v3/homoit0001860
broader: https://homosaurus.org/v3/homoit0002782
change note: Version 3.7.0
has top concept: LGBTQ+ people
in scheme: v3
related: https://homosaurus.org/v3/homoit0002784

Asexual people with chronic illnesses
type: Concept
issued: 2023-06-28
modified: 2025-02-23
comment: Asexual people who have long-term health conditions that require continued medical attention and/or significantly impact or limit daily life; some but not all people with chronic illnesses consider themselves disabled.
alternative label: Chronically ill asexual people
broader: https://homosaurus.org/v3/homoit0001879
change note: Version 3.7.0
has top concept: LGBTQ+ people
in scheme: v3
related: https://homosaurus.org/v3/homoit0002782

Asexual wheelchair users
type: Concept
issued: 2023-06-28
modified: 2025-02-23
comment: Asexual people who use wheelchairs.
broader: https://homosaurus.org/v3/homoit0001877
broader: https://homosaurus.org/v3/homoit0002782
change note: Version 3.7.0
has top concept: LGBTQ+ people
in scheme: v3

Asexual culture
type: Concept
issued: 2023-06-28
modified: 2025-02-23
comment: Cultural experiences shared by members of asexual communities or products of asexual culture (e.g., art and media created by and for asexual people, activism focused on asexual issues, slang commonly used in asexual communities, etc.).
broader: https://homosaurus.org/v3/homoit0001831
change note: Version 3.7.0
has top concept: Subcultures
in scheme: v3
related: https://homosaurus.org/v3/homoit0002789

Asexual slang
type: Concept
issued: 2023-06-28
modified: 2025-02-23
comment: Colloquial or informal language related to asexual identity or used by asexual people.
broader: https://homosaurus.org/v3/homoit0001317
change note: Version 3.7.0
has top concept: LGBTQ+ slang
in scheme: v3
related: https://homosaurus.org/v3/homoit0002788

Asexual sons
type: Concept
issued: 2023-06-28
modified: 2025-02-23
comment: Asexual people who are sons.
broader: https://homosaurus.org/v3/homoit0001329
change note: Version 3.7.0
has top concept: LGBTQ+ people
in scheme: v3

Asexual employment
type: Concept
issued: 2023-06-28
modified: 2025-02-23
comment: Employment of asexual people
broader: https://homosaurus.org/v3/homoit0001717
change note: Version 3.7.0
has top concept: LGBTQ+ employment
in scheme: v3

Asexual fathers
type: Concept
issued: 2023-06-28
modified: 2025-02-23
comment: Asexual people who are fathers.
broader: https://homosaurus.org/v3/homoit0002337
change note: Version 3.7.0
has top concept: Family members
in scheme: v3

Asexual information centers
type: Concept
issued: 2023-06-28
modified: 2025-02-23
comment: Institutions providing education, support, and information about asexual issues and asexual communities to asexual people.
alternative label: Asexual information centres
broader: https://homosaurus.org/v3/homoit0000660
change note: Version 3.7.0
has top concept: LGBTQ+ centers
in scheme: v3

Asexual libraries
type: Concept
issued: 2023-06-28
modified: 2025-02-23
comment: Libraries that hold materials primarily pertaining to asexual people or intended for use by asexual people.
broader: https://homosaurus.org/v3/homoit0000968
change note: Version 3.7.0
has top concept: LGBTQ+ cultural heritage institutions
in scheme: v3

Asexual mothers
type: Concept
issued: 2023-06-28
modified: 2025-02-23
comment: Asexual people who are mothers.
broader: https://homosaurus.org/v3/homoit0001021
broader: https://homosaurus.org/v3/homoit0001762
broader: https://homosaurus.org/v3/homoit0002343
change note: Version 3.7.0
has top concept: Family members
in scheme: v3

Asexual movement
type: Concept
issued: 2023-06-28
modified: 2025-02-23
comment: Umbrella term for activism focused on the rights of asexual people and issues faced by asexual communities.
broader: https://homosaurus.org/v3/homoit0001026
change note: Version 3.7.0
has top concept: Social movements
in scheme: v3

Asexual newsletters
type: Concept
issued: 2023-06-28
modified: 2025-02-23
comment: Serialized print or digital periodicals created by or for asexual people, often with the purpose of sharing news and information related to asexual communities and asexual issues.
broader: https://homosaurus.org/v3/homoit0001041
change note: Version 3.7.0
has top concept: LGBTQ+ press
in scheme: v3
related: https://homosaurus.org/v3/homoit0002804

Asexual newspapers
type: Concept
issued: 2023-06-28
modified: 2025-02-23
comment: Serialized print or digital publications about asexual people or asexual issues (and typically produced by asexual people or asexual organizations) that contain news, articles, columns, correspondence, and advertisements.
broader: https://homosaurus.org/v3/homoit0001042
change note: Version 3.7.0
has top concept: LGBTQ+ press
in scheme: v3
related: https://homosaurus.org/v3/homoit0002804

Asexual museums
type: Concept
issued: 2023-06-28
modified: 2025-02-23
comment: Institutions dedicated to the storage, exhibition, conservation, and preservation of materials relating to asexual people and asexual history.
broader: LGBTQ+ museums
change note: Version 3.7.0
has top concept: LGBTQ+ cultural heritage institutions
in scheme: v3

Asexual partners
type: Concept
issued: 2023-06-28
modified: 2025-02-23
comment: Asexual people who are the romantic, sexual, or play partners of another person or people.
broader: https://homosaurus.org/v3/homoit0001083
change note: Version 3.7.0
has top concept: LGBTQ+ families
in scheme: v3

Asexual people in the military
type: Concept
issued: 2023-06-28
modified: 2025-02-23
comment: Asexual people serving in state and national armed forces.
broader: https://homosaurus.org/v3/homoit0001100
change note: Version 3.7.0
has top concept: Legal status
in scheme: v3

Asexual people of color
type: Concept
issued: 2023-06-28
modified: 2025-02-23
comment: Primarily used in the United States, this term refers to asexual people who are not white and who identify as people of color.
alternative label: Asexual people of colour
broader: https://homosaurus.org/v3/homoit0001101
change note: Version 3.7.0
has top concept: LGBTQ+ people
in scheme: v3

Asexual political activists
type: Concept
issued: 2023-06-28
modified: 2025-02-23
comment: Asexual people working to bring about political or social change through public organizing.
broader: https://homosaurus.org/v3/homoit0000007
broader: https://homosaurus.org/v3/homoit0002758
change note: Version 3.7.0
has top concept: LGBTQ+ people
in scheme: v3

Asexual press
type: Concept
issued: 2023-06-28
modified: 2025-02-23
comment: Newspapers, magazines, or other publishing outlets aimed at asexual audiences and/or operated by asexual people.
broader: https://homosaurus.org/v3/homoit0001132
change note: Version 3.7.0
has top concept: LGBTQ+ press
in scheme: v3
narrower: https://homosaurus.org/v3/homoit0003151
related: https://homosaurus.org/v3/homoit0002797
related: https://homosaurus.org/v3/homoit0002798

Asexual publishers
type: Concept
issued: 2023-06-28
modified: 2025-02-23
comment: Companies and organizations that publish materials for asexual communities or addressing asexual issues.
broader: https://homosaurus.org/v3/homoit0001144
change note: Version 3.7.0
has top concept: LGBTQ+ publishers
in scheme: v3

Asexual radio
type: Concept
issued: 2023-06-28
modified: 2025-02-23
comment: Auditory content broadcast on the radio (analog or digital) about asexual people and asexual issues.
broader: https://homosaurus.org/v3/homoit0001231
change note: Version 3.7.0
has top concept: LGBTQ+ radio
in scheme: v3

Asexual relationships
type: Concept
issued: 2023-06-28
modified: 2025-02-23
comment: Ongoing connections (romantic, sexual, or platonic) between two or more asexual people.
broader: https://homosaurus.org/v3/homoit0001237
change note: Version 3.7.0
has top concept: LGBTQ+ relationships
in scheme: v3

Asexual rights
type: Concept
issued: 2023-06-28
modified: 2025-02-23
comment: Legal, social, or ethical principles of freedom or entitlement held by asexual people.
broader: https://homosaurus.org/v3/homoit0000276
change note: Version 3.7.0
has top concept: Human rights
in scheme: v3

Gay politicians
type: Concept
issued: 2023-06-28
modified: 2025-02-23
comment: Gay men or mascs who are candidates for public office, are currently holding public office, or have held political positions. Politicians can be elected by public election or otherwise appointed.
alternative label: Gay public officials
broader: https://homosaurus.org/v3/homoit0002809
change note: Version 3.7.0
has top concept: LGBTQ+ politicians
in scheme: v3

Lesbian politicians
type: Concept
issued: 2023-06-28
modified: 2025-02-23
comment: Lesbians who are candidates for public office, are currently holding public office, or have held political positions. Politicians can be elected by public election or otherwise appointed.
alternative label: Lesbian public officials
broader: https://homosaurus.org/v3/homoit0002809
change note: Version 3.7.0
has top concept: LGBTQ+ politicians
in scheme: v3

Bisexual politicians
type: Concept
issued: 2023-06-28
modified: 2025-02-23
comment: Bisexual people who are candidates for public office, are currently holding public office, or have held political positions. Politicians can be elected by public election or otherwise appointed.
alternative label: Bisexual public officials
broader: https://homosaurus.org/v3/homoit0002809
change note: Version 3.7.0
has top concept: LGBTQ+ politicians
in scheme: v3

Queer politicians
type: Concept
issued: 2023-06-28
modified: 2025-02-23
comment: Queer people who are candidates for public office, are currently holding public office, or have held political positions. Politicians can be elected by public election or otherwise appointed.
alternative label: Queer public officials
broader: https://homosaurus.org/v3/homoit0002809
change note: Version 3.7.0
has top concept: LGBTQ+ politicians
in scheme: v3

Transgender politicians
type: Concept
issued: 2023-06-28
modified: 2025-02-23
comment: Transgender people who are candidates for public office, are currently holding public office, or have held political positions. Politicians can be elected by public election or otherwise appointed.
alternative label: Transgender public officials
broader: https://homosaurus.org/v3/homoit0002809
change note: Version 3.7.0
has top concept: LGBTQ+ politicians
in scheme: v3

Intersex politicians
type: Concept
issued: 2023-06-28
modified: 2025-02-23
comment: Intersex people who are candidates for public office, are currently holding public office, or have held political positions. Politicians can be elected by public election or otherwise appointed.
alternative label: Intersex public officials
broader: https://homosaurus.org/v3/homoit0002809
change note: Version 3.7.0
has top concept: LGBTQ+ politicians
in scheme: v3

Asexual politicians
type: Concept
issued: 2023-06-28
modified: 2025-02-23
comment: Asexual people who are candidates for public office, are currently holding public office, or have held political positions. Politicians can be elected by public election or otherwise appointed.
alternative label: Asexual public officials
broader: https://homosaurus.org/v3/homoit0002809
change note: Version 3.7.0
has top concept: LGBTQ+ politicians
in scheme: v3

Two-Spirit politicians
type: Concept
issued: 2023-06-28
modified: 2025-02-23
comment: Two-Spirit people who are candidates for public office, are currently holding public office, or have held political positions. Politicians can be elected by public election or otherwise appointed.
alternative label: 2S politicians
alternative label: 2S public officials
alternative label: Two Spirited politicians
alternative label: Two Spirited public officials
alternative label: Two-Spirit public officials
alternative label: Two-Spirited public officials
alternative label: Two-Spiritied politicians
broader: https://homosaurus.org/v3/homoit0001480
change note: Version 3.7.0
has top concept: Gender
in scheme: v3
related: https://homosaurus.org/v3/homoit0002809

17-beta hydroxysteroid dehydrogenase 3 deficiency
type: Concept
issued: 2023-06-28
modified: 2025-02-23
comment: People with 17-beta hydroxysteroid dehydrogenase 3 deficiency, abbreviated as "17-beta," have XY chromosomes and testes, but their bodies do not have one of the enzymes needed to synthesize testosterone. Most people with 17-beta are born with a vulva and vagina, and their testes are most often undescended. Some people with 17-beta will be born with genitals that do not clearly resemble a typical penis or a typical vulva. Some will have a penis that may be smaller than typical (known as a micropenis), and the urethra may open on the underside of the penis rather than at the tip (known as hypospadias). In adolescence, people with 17-beta will often develop some secondary sex characteristics associated with a typical testosterone puberty.
alternative label: 17-beta
broader: https://homosaurus.org/v3/homoit0000669
change note: Version 3.7.0
has top concept: Sex (Body)
in scheme: v3

Ambiguous genitalia
type: Concept
issued: 2023-06-28
modified: 2025-02-23
comment: A term used to describe a birth variation in which the outer genitals do not have the typical appearance of those associated with either boys or girls. This is often the first sign many doctors and parents see that indicate their child has an intersex variation. Ambiguous genitalia can be caused by a variety of variations and rarely require immediate surgical intervention as long as the child is able to excrete and urinate without complications. Many intersex people find this term stigmatizing, so it should not be used unless the individual uses it to describe themselves.
broader: https://homosaurus.org/v3/homoit0000669
change note: Version 3.7.0
has top concept: Sex (Body)
in scheme: v3

Androgens
type: Concept
issued: 2023-06-28
modified: 2025-02-23
comment: A term that encompasses testosterone, dihydrotestosterone, and other hormones primarily produced in the testes but also in the ovaries and adrenal glands.
broader: https://homosaurus.org/v3/homoit0000651
change note: Version 3.7.0
has top concept: Sex (Body)
in scheme: v3
related: https://homosaurus.org/v3/homoit0000317

Anorchia
type: Concept
issued: 2023-06-28
modified: 2025-02-23
comment: A person with anorchia has 46 XY chromosomes and is born without testes. As a result, they do not produce typical levels of testosterone. Someone with anorchia will usually have a typical-appearing penis and scrotum because these organs are already formed by the stage of fetal development when the testes disappear.
broader: https://homosaurus.org/v3/homoit0000669
change note: Version 3.7.0
has top concept: Sex (Body)
in scheme: v3

Aromatase deficiency
type: Concept
issued: 2023-06-28
modified: 2025-02-23
comment: People with aromatase deficiency do not have the enzyme responsible for converting androgens into estrogen. At birth, someone with aromatase deficiency and XX chromosomes may have a larger-than-typical clitoris and partially or completely fused labia (resembling the appearance of a scrotum). At puberty, they may not develop breasts, may not begin menstruating, and may develop some secondary sex characteristics associated with a typical testosterone puberty. They may also develop multiple cysts on their ovaries. People with XY chromosomes can also have aromatase deficiency, but they do not typically experience variations in their sex characteristics, though they may grow taller than is typical because estrogen is usually responsible for closing the bone growth plates.
broader: https://homosaurus.org/v3/homoit0000669
change note: Version 3.7.0
has top concept: Sex (Body)
in scheme: v3

Aromatase excess syndrome
type: Concept
issued: 2023-06-28
modified: 2025-02-23
comment: People with aromatase excess have increased production of aromatase, which converts androgens (like testosterone) into estrogen. People with XY chromosomes and aromatase excess syndrome will therefore have more active estrogen in their bodies than is typical. As a result, they will often stop growing at a shorter height and/or develop breasts in adolescence along with features associated with a typical testosterone puberty. People with XX chromosomes can also have aromatase excess, but it doesn't usually cause their sex characteristics to vary from what is considered typical for those assigned female at birth, though they may also experience breast enlargement and short stature, along with menstrual irregularities.
alternative label: Familial gynecomastia
alternative label: Hyperestrogenism
broader: https://homosaurus.org/v3/homoit0000669
change note: Version 3.7.0
has top concept: Sex (Body)
in scheme: v3

Bladder exstrophy
type: Concept
issued: 2023-06-28
modified: 2025-02-23
comment: People with bladder exstrophy are born with their urinary bladder exposed (through an open abdominal wall) or outside of the body. They may also have an open pelvis (resulting from the pubic bones not joining together), which causes genital differences. People with bladder exstrophy and XY chromosomes often have a shorter-than-typical penis with epispadias (meaning the urethra opens on the top surface of the penis instead of at the tip) and undescended testes. People with XX chromosomes and bladder exstrophy often have a urethra that is placed higher than usual, widely spaced labia (due to the wide spacing of their pubic bones), and a clitoris formed in two halves with a split in the middle.
broader: https://homosaurus.org/v3/homoit0000669
change note: Version 3.7.0
has top concept: Sex (Body)
in scheme: v3

Chimeras
type: Concept
issued: 2023-06-28
modified: 2025-02-23
comment: Chimeras, or people with chimerism, have two different sets of DNA. This happens when a person is pregnant with fraternal twins, but the embryos combine into one fetus.
alternative label: Human chimeras
broader: https://homosaurus.org/v3/homoit0000618
change note: Version 3.7.0
has top concept: LGBTQ+ people
in scheme: v3

Chimerism
type: Concept
issued: 2023-06-28
modified: 2025-02-23
comment: Term used to describe the variation in which a person is born with two or more different sets of DNA. This can occur when multiple zygotes (such as fraternal twins) combine and develop into one fetus. Sex-chromosome discordant chimerism occurs when at least one embryo with XX chromosomes fuses with at least one embryo with XY chromosomes. A person who develops this way would have sets of both XX and XY chromosomes, or a chromosome pattern of 46XX/46XY, and could have a wide variety of different possible sex characteristics. Many people with chimerism and XX/XY chromosomes have both ovarian and testicular tissue, while others have only testes or only ovaries, and still others have gonadal dysgenesis. Some have noticeable genital differences and others do not.
broader: https://homosaurus.org/v3/homoit0000669
change note: Version 3.7.0
has top concept: Sex (Body)
in scheme: v3

Classical congenital adrenal hyperplasia
type: Concept
issued: 2023-06-28
modified: 2025-02-23
comment: People who have classical congenital adrenal hyperplasia (CAH), a subtype of CAH, have more pronounced issues with cortisol and/or aldosterone production. This variation is likely to be noticed at birth or shortly after.
broader: https://homosaurus.org/v3/homoit0000301
change note: Version 3.7.0
has top concept: Sex (Body)
in scheme: v3
narrower: https://homosaurus.org/v3/homoit0002874

Cloacal exstrophy
type: Concept
issued: 2023-06-28
modified: 2025-02-23
comment: People born with cloacal exstrophy are born with an open abdominal wall exposing their colon, bladder, and sometimes other abdominal organs. Their organs may also be positioned outside of the body at birth. The bladder is often split into two halves, and the colon and bladder may be connected. The anal opening may be blocked or not have been formed. The pubic bones do not join together, resulting in an open pelvis with noticeable genital differences. People with XY chromosomes and cloacal exstrophy may have a smaller-than-typical penis that is flat or split into two halves with an epispadic urethra (opening on the top of the penis rather than at the tip) and undescended testes. Someone with XX chromosomes and cloacal exstrophy usually has a clitoris that is split into two halves, and they may have two vaginal openings.
broader: https://homosaurus.org/v3/homoit0000669
change note: Version 3.7.0
has top concept: Sex (Body)
in scheme: v3

Complete androgen insensitivity syndrome
type: Concept
issued: 2023-06-28
modified: 2025-02-23
comment: People with complete androgen insensitivity syndrome (CAIS) have no response to androgens and are born with a vulva and clitoris, as well as a shorter-than-typical vagina and undescended testes. In adolescence, they will develop breasts and other features associated with a typical estrogen puberty due to the body’s natural conversion of testosterone to estrogen. However, people with CAIS do not menstruate because they do not have a uterus or ovaries.
alternative label: CAIS
broader: https://homosaurus.org/v3/homoit0000669
change note: Version 3.7.0
has top concept: Sex (Body)
in scheme: v3

Complete gonadal dysgenesis
type: Concept
issued: 2023-06-28
modified: 2025-02-23
comment: People with complete gonadal dysgenesis are born with XX or XY chromosomes and gonadal tissue that has not developed into testicles or ovaries (also known as streak gonads). They are generally born with a vulva and vagina, and they will not usually develop secondary sex characteristics at puberty because streak gonads do not produce hormones.
alternative label: Pure gonadal dysgenesis
broader: https://homosaurus.org/v3/homoit0000044
change note: Version 3.7.0
has top concept: Sex (Body)
in scheme: v3

Congenital chordee
type: Concept
issued: 2023-06-28
modified: 2025-02-23
comment: People born with congenital chordee have a penis that curves upward or downward or bends to one side, usually due to bands of fibrous tissue that pull the penis in a particular direction. People with congenital chordee often have hypospadias, meaning that their urethral opening is not at the tip of the penis.
broader: https://homosaurus.org/v3/homoit0000669
change note: Version 3.7.0
has top concept: Sex (Body)
in scheme: v3

Cryptorchidism
type: Concept
issued: 2023-06-28
modified: 2025-02-23
comment: An intersex variation in which one or both of the testes do not descend from the abdomen into the scrotum. If both testes are undescended, this is known as "bilateral cryptorchidism," whereas "unilateral cryptorchidism" occurs when only one the testes does not descend.
alternative label: Undescended testes
alternative label: Undescended testicles
broader: https://homosaurus.org/v3/homoit0000669
change note: Version 3.7.0
has top concept: Sex (Body)
in scheme: v3

De la Chapelle syndrome
type: Concept
issued: 2023-06-28
modified: 2025-02-23
comment: De la Chapelle syndrome causes people with XX chromosomes to be born with a penis and testes. This usually happens because a particular gene typically seen on Y chromosomes (known as the SRY gene) ends up on one of their X chromosomes and causes their genitals and internal reproductive organs to develop as they typically would in someone with XY chromosomes. People with de la Chapelle might have testes that are smaller than typical or that are undescended, and they are often infertile. In adolescence, they may experience breast growth, and they might not develop the characteristics that are usually associated with a typical testosterone puberty.
alternative label: XX male syndrome
broader: https://homosaurus.org/v3/homoit0000669
change note: Version 3.7.0
has top concept: Sex (Body)
in scheme: v3

Early genital surgery model
type: Concept
issued: 2023-06-28
modified: 2025-02-23
comment: Patient care model developed by John Money, a New Zealand psychologist who theorized that gender was completely dependent on "nurture." This model advocates for performing genital surgery on intersex infants and raising them as girls. Money's theories have resulted in many surgically misgendered children who have had to deal with life-long gender dysphoria, depression, sexual dysfunction, bowel and urinary incontinence, and nerve pain. A patient-centered model, in which the intersex child is allowed to grow up and make their own choices regarding their gender and surgical option, is now preferred.
alternative label: John Money model
broader: https://homosaurus.org/v3/homoit0000352
change note: Version 3.7.0
has top concept: Sex (Body)
in scheme: v3
related: https://homosaurus.org/v3/homoit0001006

Epispadias
type: Concept
issued: 2023-06-28
modified: 2025-02-23
comment: People with epispadias are born with a urinary opening located on the upper surface of their penis rather than at the tip (similar to the more common variation hypospadias). People with vulvas can also be born with epispadias, in which case the urethral opening is wider and located higher than typical. The clitoris may also be split into two halves. Epispadias is usually present whenever bladder exstrophy or cloacal exstrophy develop, but epispadias can also occur by itself.
alternative label: Anaspadias
broader: https://homosaurus.org/v3/homoit0000669
change note: Version 3.7.0
has top concept: Sex (Body)
in scheme: v3

Estrogen insensitivity syndrome
type: Concept
issued: 2023-06-28
modified: 2025-02-23
comment: People with estrogen insensitivity syndrome (EIS) have a genetic variation in which their bodies do not respond to estrogen. People with XX chromosomes and EIS are usually born with a vulva and vagina, may have a small uterus and enlarged ovaries that later develop multiple cysts, and may produce very high levels of estrogen that their bodies do not recognize. In adolescence, they will most likely not experience the changes associated with a typical estrogen puberty such as breast development or menstruation. They may instead develop pubic hair and acne due to the influence of androgens. People with XY chromosomes can also be born with EIS, and they may or may not experience variations in their other hormone production, testicular development, and development of secondary sex characteristics as a result.
alternative label: EIS
broader: https://homosaurus.org/v3/homoit0000669
change note: Version 3.7.0
has top concept: Sex (Body)
in scheme: v3

Follicle-stimulating hormone insensitivity
type: Concept
issued: 2023-06-28
modified: 2025-02-23
comment: People with follicle-stimulating hormone (FSH) insensitivity have a genetic variation where their bodies do not respond to FSH. People with XX chromosomes and FSH insensitivity will usually be born with a vulva, vagina, and ovaries. Their ovaries may produce lower amounts of estrogen than is considered typical, and they may not produce fertile follicles (eggs). In adolescence, they may not develop secondary sex characteristics associated with a typical estrogen puberty and may not menstruate. People with XY chromosomes and FSH insensitivity may develop smaller-than-typical testes, may produce fewer sperm than usual, and may not be fertile.
alternative label: FSH
alternative label: FSH insensitivity
broader: https://homosaurus.org/v3/homoit0000669
change note: Version 3.7.0
has top concept: Sex (Body)
in scheme: v3

Fraser syndrome
type: Concept
issued: 2023-06-28
modified: 2025-02-23
comment: People with Fraser syndrome are usually born with differences in the development of their eyelids, fingers, and toes. They may also have variations in their sex characteristics, such as a larger-than-typical clitoris or undescended testes. They may develop without one or both kidneys, and other parts of the urinary system can additionally be affected.
broader: https://homosaurus.org/v3/homoit0000669
change note: Version 3.7.0
has top concept: Sex (Body)
in scheme: v3

Gonadectomy
type: Concept
issued: 2023-06-28
modified: 2025-02-23
comment: Surgical procedure to remove the gonads, including testes and ovaries.
broader: https://homosaurus.org/v3/homoit0000584
change note: Version 3.7.0
has top concept: Medical care
in scheme: v3

Hopkins model
type: Concept
issued: 2023-06-28
modified: 2025-02-23
comment: A patient care model that gained popular usage in the 1950s. In this model, parents are used to quickly decide on a gender assignment for their intersex baby, under the assumption that the child would identify with whichever gender their parents raised them as. If a child later deviated from the assigned gender, parents were encouraged to verbally and physically "correct" the child and enforce gender norms. In practice, this resulted in life-altering, unnecessary genital surgeries, irreversible hormone treatments, and dishonesty on the parent's part. A patient-centered model, in which the intersex child is allowed to grow up and make their own choices regarding their gender and surgical option, is now preferred.
alternative label: Concealment centered model
broader: https://homosaurus.org/v3/homoit0000352
change note: Version 3.7.0
has top concept: Sex (Body)
in scheme: v3
related: https://homosaurus.org/v3/homoit0001006

Hyperandrogenism
type: Concept
issued: 2023-06-28
modified: 2025-02-23
comment: People with hyperandrogenism have higher-than-typical levels of testosterone and/or other androgens. In people with XX chromosomes, hyperandrogenism can result in the development of secondary sex characteristics that are associated with the influence of testosterone (such as facial and body hair) to varying degrees. Hyperandrogenism may or may not be the result of an underlying intersex variation, but it is common in several variations (including CAH and PCOS). People with hyperandrogenism who aren’t intersex will nonetheless often have many experiences in common with intersex people, such as encountering exclusion and discrimination in sex-segregated contexts like sports.
broader: https://homosaurus.org/v3/homoit0000669
change note: Version 3.7.0
has top concept: Sex (Body)
in scheme: v3

Hypogonadism
type: Concept
issued: 2023-06-28
modified: 2025-02-23
comment: People with hypogonadism produce lower-than-typical levels of hormones like testosterone and estrogen, or none at all. This can affect how a person’s secondary sex characteristics develop as well as their fertility. Hypogonadism can be a result of a difference in how someone’s brain signals for their gonads to produce (or not produce) hormones, or it can be a feature of their gonads directly. Hypogonadism is not always caused by an intersex variation, but can be related to Klinefelter syndrome, Turner syndrome, and several other variations.
broader: https://homosaurus.org/v3/homoit0000669
change note: Version 3.7.0
has top concept: Sex (Body)
in scheme: v3

Informed consent
type: Concept
issued: 2023-06-28
modified: 2025-02-23
comment: The practice of weighing all options and considering evidence, alternatives, and potential risks in order to make a truly informed medical decision. Such decisions are best made over a period of time rather than under pressure.
broader: https://homosaurus.org/v3/homoit0000302
change note: Version 3.7.0
has top concept: Consent
in scheme: v3
related: https://homosaurus.org/v3/homoit0001004

Intersex surgery
type: Concept
issued: 2023-06-28
modified: 2025-02-23
comment: Non-lifesaving cosmetic procedures intended to change and "normalize" natural variations in genital appearance and/or reproductive anatomy. Intersex surgery was first developed in the early 20th century, with doctors making unresearched claims about an "urgent need" for these operations.
broader: https://homosaurus.org/v3/homoit0000670
change note: Version 3.7.0
has top concept: Intersex genital mutilation
in scheme: v3
related: https://homosaurus.org/v3/homoit0000584

Isolated 17,20-lyase deficiency
type: Concept
issued: 2023-06-28
modified: 2025-02-23
comment: People with isolated 17,20-lyase deficiency (ILD) have one of several specific variations in their genes that cause their bodies to make lower-than-typical amounts of testosterone. They may be born with genitals that do not appear quite like a typical penis, and their testes may be descended or undescended. In adolescence, they may not experience all of the changes related to a typical testosterone puberty because their variation impacts their hormone production.
alternative label: ILD
broader: https://homosaurus.org/v3/homoit0000669
change note: Version 3.7.0
has top concept: Sex (Body)
in scheme: v3

Asexual survivors of hate crimes
type: Concept
issued: 2023-06-28
modified: 2025-02-23
comment: Asexual people who have experienced and survived hate crimes; follow the individual's preference for "victims" or "survivors" whenever possible.
broader: https://homosaurus.org/v3/homoit0001349
change note: Version 3.7.0
has top concept: LGBTQ+ people
in scheme: v3

Asexual survivors of rape
type: Concept
issued: 2023-06-28
modified: 2025-02-23
comment: Asexual people who have experienced and survived rape; follow the individual's preference for "victims" or "survivors" whenever possible.
broader: https://homosaurus.org/v3/homoit0001350
change note: Version 3.7.0
has top concept: LGBTQ+ people
in scheme: v3

Asexual survivors of sexual abuse
type: Concept
issued: 2023-06-28
modified: 2025-02-23
comment: Asexual people who have experienced and survived sexual abuse; follow the individual's preference for "victims" or "survivors" whenever possible.
broader: https://homosaurus.org/v3/homoit0001351
change note: Version 3.7.0
has top concept: LGBTQ+ people
in scheme: v3

Asexual survivors of war
type: Concept
issued: 2023-06-28
modified: 2025-02-23
comment: Asexual people who have experienced and survived war; follow the individual's preference for "victims" or "survivors" whenever possible.
broader: https://homosaurus.org/v3/homoit0001352
change note: Version 3.7.0
has top concept: LGBTQ+ people
in scheme: v3

Asexual television
type: Concept
issued: 2023-06-28
modified: 2025-02-23
comment: Television shows featuring asexual characters or themes.
broader: https://homosaurus.org/v3/homoit0001359
change note: Version 3.7.0
has top concept: LGBTQ+ television
in scheme: v3

Asexual victims of rape
type: Concept
issued: 2023-06-28
modified: 2025-02-23
comment: Asexual people who have experienced rape and may or may not have survived; follow the individual's preference for "victims" or "survivors" whenever possible.
broader: https://homosaurus.org/v3/homoit0000958
change note: Version 3.7.0
has top concept: LGBTQ+ people
in scheme: v3

Asexual victims of sexual abuse
type: Concept
issued: 2023-06-28
modified: 2025-02-23
comment: Asexual people who have experienced sexual abuse and may or may not have survived; follow the individual's preference for "victims" or "survivors" whenever possible.
broader: https://homosaurus.org/v3/homoit0000959
change note: Version 3.7.0
has top concept: LGBTQ+ people
in scheme: v3

Asexual victims of war
type: Concept
issued: 2023-06-28
modified: 2025-02-23
comment: Asexual people who have experienced war and may or may not have survived; follow the individual's preference for "victims" or "survivors" whenever possible.
broader: https://homosaurus.org/v3/homoit0000961
change note: Version 3.7.0
has top concept: LGBTQ+ people
in scheme: v3

Asexual victims' rights
type: Concept
issued: 2023-06-28
modified: 2025-02-23
comment: Asexual people’s legal rights to be informed, present, and heard within the criminal justice system after having been harmed or injured as the result of a crime, accident, or other event.
broader: https://homosaurus.org/v3/homoit0001492
change note: Version 3.7.0
has top concept: Law
in scheme: v3

Asexual-focused businesses
type: Concept
issued: 2023-06-28
modified: 2025-02-23
comment: Businesses focusing on asexual clientele and products related to asexual communities.
broader: https://homosaurus.org/v3/homoit0001741
change note: Version 3.7.0
has top concept: LGBTQ+-focused businesses
in scheme: v3

Asexual-owned businesses
type: Concept
issued: 2023-06-28
modified: 2025-02-23
comment: Businesses owned by asexual people.
broader: https://homosaurus.org/v3/homoit0001735
change note: Version 3.7.0
has top concept: LGBTQ+-owned businesses
in scheme: v3

Jacobs syndrome
type: Concept
issued: 2023-06-28
modified: 2025-02-23
comment: People with Jacobs syndrome develop with an extra Y chromosome. They might not have any obvious physical variations as a result, or they may be taller than usual or have other identifiable differences that do not relate to sex characteristics. Some people with Jacobs syndrome may also have a smaller-than-typical penis or scrotum, hypospadias, and/or undescended testicles.
alternative label: 47XYY
alternative label: XYY syndrome
broader: https://homosaurus.org/v3/homoit0000669
change note: Version 3.7.0
has top concept: Sex (Body)
in scheme: v3

Kallmann syndrome
type: Concept
issued: 2023-06-28
modified: 2025-02-23
comment: Kallmann syndrome can occur in people with XX or XY chromosomes and is a form of hypogonadism. People with Kallmann syndrome and XY chromosomes are often born with a smaller-than-typical penis and undescended testes. In adolescence, most people with Kallmann syndrome will either start puberty later than usual or not experience typical pubertal changes (such as developing facial hair and a deeper voice for people with XY chromosomes or developing breasts and starting to menstruate for people with XX chromosomes) unless they receive hormone therapy. Kallmann syndrome also affects someone’s sense of smell.
alternative label: Hypogonadotropic hypogonadism
broader: https://homosaurus.org/v3/homoit0000669
change note: Version 3.7.0
has top concept: Sex (Body)
in scheme: v3

Leydig cell hypoplasia
type: Concept
issued: 2023-06-28
modified: 2025-02-23
comment: People with Leydig cell hypoplasia (LCH) have XY chromosomes and a genetic insensitivity to luteinizing hormone. LCH can be either complete (known as LCH Type 1) or partial (known as LCH Type 2). Luteinizing hormone is typically responsible for the development of Leydig cells in the testicles and for signaling for those cells to produce androgens like testosterone. Someone with LCH will develop few or no Leydig cells and therefore will produce less testosterone than is typical.
alternative label: LCH
broader: https://homosaurus.org/v3/homoit0000669
change note: Version 3.7.0
has top concept: Sex (Body)
in scheme: v3
narrower: https://homosaurus.org/v3/homoit0002879
narrower: https://homosaurus.org/v3/homoit0002881

Luteinizing hormone insensitivity
type: Concept
issued: 2023-06-28
modified: 2025-02-23
comment: People with XY chromosomes and luteinizing hormone insensitivity develop the variation Leydig cell hypoplasiae. Because people with XX chromosomes do not typically produce Leydig cells to begin with, someone with XX chromosomes who has a genetic insensitivity to luteinizing hormone will not be affected in the same way. A person with XX chromosomes whose body does not respond to luteinizing hormone will not usually have any noticeable differences at birth, but their ovaries may not produce fertile follicles (eggs), and they may not menstruate.
broader: https://homosaurus.org/v3/homoit0000669
change note: Version 3.7.0
has top concept: Sex (Body)
in scheme: v3

Mayer-Rokitansky-Küster-Hauser syndrome
type: Concept
issued: 2023-06-28
modified: 2025-02-23
comment: Mayer-Rokitansky-Küster-Hauser (MRKH) syndrome occurs when a person's Müllerian ducts, which typically become the uterus and upper portion of the vagina during fetal development, do not develop in the typical way. People with MRKH have XX chromosomes and are usually born with a vulva and either a vagina that is shorter than typical or no vagina. They usually do not have a cervix and may have a partial uterus (uterine remnant) or no uterus. They often do not mensturate but may experience cyclic pain if they have a uterine remnant with endometrial lining, and they can develop menstruation-related conditions like endometriosis.
alternative label: MRKH syndrome
alternative label: Müllerian agenesis
alternative label: Müllerian duct anomalies
alternative label: Müllerian duct variations
broader: https://homosaurus.org/v3/homoit0000669
change note: Version 3.7.0
has top concept: Sex (Body)
in scheme: v3
narrower: https://homosaurus.org/v3/homoit0002880
narrower: https://homosaurus.org/v3/homoit0002882

Mild androgen insensitivity syndrome
type: Concept
issued: 2023-06-28
modified: 2025-02-23
comment: People with mild androgen insensitivity syndrome (MAIS) respond to testosterone at a somewhat reduced level compared to typical levels, which means that they will usually be born with a penis (which may or may not be smaller than typical) and will later develop secondary sex characteristics associated with a typical testosterone puberty. Because their bodies convert a small amount of their naturally produced androgens into estrogen, they may have visible variations in features, such as the amount of facial hair, body hair, or muscle tone they develop. They may also experience some breast development during puberty.
alternative label: MAIS
broader: https://homosaurus.org/v3/homoit0000044
change note: Version 3.7.0
has top concept: Sex (Body)
in scheme: v3

Mixed gonadal dysgenesis
type: Concept
issued: 2023-06-28
modified: 2025-02-23
comment: People with mixed gonadal dysgenesis are born with a mosaic (usually 45X/46XY) chromosome pattern and may develop some gonadal streak tissue and testicular tissue. They may be born with a vulva or penis, or with visible genital variations. They usually have a partially or completely developed uterus, and they may have combinations of internal reproductive structures such as a fallopian tube and a vas deferens on opposite sides of the body. In adolescence, people with mixed gonadal dysgenesis may develop some secondary sex characteristics associated with a typical testosterone puberty, depending on the amount of hormone-producing testicular tissue they have.
alternative label: Partial gonadal dysgenesis
broader: https://homosaurus.org/v3/homoit0000599
change note: Version 3.7.0
has top concept: Sex (Body)
in scheme: v3

Non-classical congenital adrenal hyperplasia
type: Concept
issued: 2023-06-28
modified: 2025-02-23
comment: Non-classical congenital adrenal hyperplasia (CAH), a subtype of CAH, does not usually become apparent until later in childhood, adolescence, or even young adulthood.
alternative label: Late-onset congenital adrenal hyperplasia
broader: https://homosaurus.org/v3/homoit0000301
change note: Version 3.7.0
has top concept: Sex (Body)
in scheme: v3

Penoscrotal transposition
type: Concept
issued: 2023-06-28
modified: 2025-02-23
comment: People with penoscrotal transposition are born with a different genital configuration than typical, with their penis located below or in the middle of their scrotum instead of above it. Their scrotum might be bifid (split into two halves), and they may also have hypospadias and/or chordee.
broader: https://homosaurus.org/v3/homoit0000669
change note: Version 3.7.0
has top concept: Sex (Body)
in scheme: v3

Persistent Müllerian duct syndrome
type: Concept
issued: 2023-06-28
modified: 2025-02-23
comment: People with Persistent Müllerian duct syndrome (PMDS) have XY chromosomes, male-typical reproductive organs and external genitalia, and some component(s) of a female-typical reproductive tract, such as a uterus, fallopian tubes, and/or upper vaginal canal. PMDS occurs when the Müllerian ducts—internal structures that ordinarily break down in an XY fetus—remain and develop as they would in an XX fetus. PMDS is ordinarily not diagnosed at birth, and individuals with this variation often have a male gender identity.
alternative label: PMDS
broader: https://homosaurus.org/v3/homoit0000669
change note: Version 3.7.0
has top concept: Sex (Body)
in scheme: v3

Polycystic ovary syndrome
type: Concept
issued: 2023-06-28
modified: 2025-02-23
comment: People with this variation have XX chromosomes and are generally born with a vulva and vagina, a uterus, and ovaries. Later in life, their ovaries often produce higher-than-typical levels of androgens like testosterone. Polycystic ovary syndrome (PCOS) can also result in the development of characteristics such as facial and body hair, and it can interfere with the process of ovulation. This in turn can cause irregular periods or no periods, and people with PCOS may struggle to become pregnant. Some people with PCOS have small cysts (fluid-filled sacs) on their ovaries, but some do not. Signs of PCOS generally will not show up until a person starts menstruating, or later in life.
alternative label: PCOD
alternative label: PCOS
alternative label: Polycystic ovarian disease
alternative label: Polycystic ovarian syndrome
broader: https://homosaurus.org/v3/homoit0000669
change note: Version 3.7.0
has top concept: Sex (Body)
in scheme: v3

Pseudohermaphroditism
type: Concept
issued: 2023-06-28
modified: 2025-02-23
comment: A term previously used in medical contexts to refer to different groups of intersex variations, usually divided into categories of “male pseudohermaphroditism” and “female pseudohermaphroditism” on the basis of the person’s chromosomes. People may still find these terms used in their medical records or in medical journal articles when researching their variation, but they are often considered highly stigmatizing in addition to being vague and inaccurate. Do not use this term to describe a person's variation unless they do so themselves.
alternative label: Female pseudohermaphroditism
alternative label: Male pseudohermaphroditism
broader: https://homosaurus.org/v3/homoit0000669
change note: Version 3.7.0
has top concept: Sex (Body)
in scheme: v3

Salt-wasting congenital adrenal hyperplasia
type: Concept
issued: 2023-06-28
modified: 2025-02-23
comment: People who have salt-wasting congenital adrenal hyperplasia (CAH), a subtype of classical CAH, experience "salt-wasting," a dangerous scenario a person's low levels of aldosterone cause their body to lose too much sodium. They may experience life-threatening adrenal crises, especially when their body is under stress.
broader: https://homosaurus.org/v3/homoit0002827
change note: Version 3.7.0
has top concept: Sex (Body)
in scheme: v3

Sex reversal syndrome
type: Concept
issued: 2023-06-28
modified: 2025-02-23
comment: A term sometimes used in medical contexts to refer to different variations in which a person is born with XY chromosomes and a vulva and vagina or XX chromosomes and a penis.
broader: https://homosaurus.org/v3/homoit0000669
change note: Version 3.7.0
has top concept: Sex (Body)
in scheme: v3

Streak gonads
type: Concept
issued: 2023-06-28
modified: 2025-02-23
comment: Minimally developed gonadal tissue that is present in place of either testes or ovaries. Streak gonads are more common in certain intersex variations such as Swyer syndrome.
broader: https://homosaurus.org/v3/homoit0000600
change note: Version 3.7.0
has top concept: Sex (Body)
in scheme: v3

Trisomy X
type: Concept
issued: 2023-06-28
modified: 2025-02-23
comment: People with Trisomy X are born with 47XXX chromosomes rather than the typical 46XX. If they receive the additional X chromosome from their parent's original sperm or egg cell, they will have 47XXX chromosomes in all their cells. If the additional chromosome appears during the embryo's development process, however, only some cells will have 47XXX chromosomes and the person will be born with a mosaic chromosome pattern. Most people with 47XXX chromosomes do not develop any variations in their other sex characteristics but some may have ovaries that stop producing hormones at an earlier-than-typical age and some may not menstruate.
alternative label: Triple XXX syndrome
broader: https://homosaurus.org/v3/homoit0000669
change note: Version 3.7.0
has top concept: Sex (Body)
in scheme: v3

Type 1 Leydig cell hypoplasia
type: Concept
issued: 2023-06-28
modified: 2025-02-23
comment: People with Type 1 Leydig cell hypoplasia (LCH) produce almost no testosterone and will usually be born with a vulva and vagina and undescended testes. They are usually assigned female at birth, often without their variation being recognized until adolescence, at which point they generally will not develop any secondary sex characteristics or experience other changes typically associated with puberty.
alternative label: Type 1 LCH
broader: https://homosaurus.org/v3/homoit0002863
change note: Version 3.7.0
has top concept: Sex (Body)
in scheme: v3

Type 1 Mayer-Rokitansky-Küster-Hauser syndrome
type: Concept
issued: 2023-06-28
modified: 2025-02-23
comment: People with Type 1 Mayer-Rokitansky-Küster-Hauser (MRKH) syndrome typically have only the differences associated with MRKH syndrome.
alternative label: Type 1 MRKH
broader: https://homosaurus.org/v3/homoit0002865
change note: Version 3.7.0
has top concept: Sex (Body)
in scheme: v3

Type 2 Leydig cell hypoplasia
type: Concept
issued: 2023-06-28
modified: 2025-02-23
comment: People with Type 2 Leydig cell hypoplasia (LCH) have some response to luteinizing hormone and produce lower-than-typical amounts of testosterone, but more than people with Type 1 LCH. At birth, their testes may be descended or undescended, and they may have a smaller-than-typical penis, often with other noticeable differences such as hypospadias. In adolescence, they will often develop some characteristics associated with a typical testosterone puberty.
alternative label: Type 2 LCH
broader: https://homosaurus.org/v3/homoit0002863
change note: Version 3.7.0
has top concept: Sex (Body)
in scheme: v3

Type 2 Mayer-Rokitansky-Küster-Hauser syndrome
type: Concept
issued: 2023-06-28
modified: 2025-02-23
comment: People with Type 2 Mayer-Rokitansky-Küster-Hauser (MRKH) syndrome have both the differences associated with MRKH syndrome and additional differences in other parts of their body, such as their fallopian tubes, kidneys, spine, or heart. A specific example of Type 2 MRKH known as Müllerian agenesis, Renal agenesis, Cervicothoracic Somite (MURCS) association, occurs when someone’s kidneys do not develop typically. They may have scoliosis or fused vertebrae in addition to the usual features of MRKH.
alternative label: Type 2 MRKH
broader: https://homosaurus.org/v3/homoit0002865
change note: Version 3.7.0
has top concept: Sex (Body)
in scheme: v3

Vaginal atresia
type: Concept
issued: 2023-06-28
modified: 2025-02-23
comment: People with this variation may be born without a vaginal opening, a shallow “dimple” where an opening would typically be, or a vaginal opening that is fused or blocked by fibrous tissue. People with vaginal atresia often have a typical upper vaginal canal (along with a typical uterus, cervix, fallopian tubes, and ovaries) with differences in the lower portion of the vagina only.
broader: https://homosaurus.org/v3/homoit0000669
change note: Version 3.7.0
has top concept: Sex (Body)
in scheme: v3

X gender markers
type: Concept
issued: 2023-06-28
modified: 2025-02-23
comment: Gender markers that indicate a person is NOT cisgender. X gender markers may be assigned to or adopted by intersex people or transgender people.
broader: https://homosaurus.org/v3/homoit0000573
change note: Version 3.7.0
has top concept: Legal status
in scheme: v3
related: https://homosaurus.org/v3/homoit0001646

XXYY syndrome
type: Concept
issued: 2023-06-28
modified: 2025-02-23
comment: People with XXYY syndrome are born with an extra copy of both an X and Y chromosome, resulting in an 48XXYY chromosome pattern instead of the typical 46XY. People with XXYY chromosomes may have undescended testes and produce lower-than-typical amounts of testosterone, which can cause them to start puberty at a later age than typical and develop less pronounced secondary sex characteristics like muscle tone and facial hair. They may also experience breast growth. People with XXYY syndrome often have other physical features that are similar to those developed by people with Klinefelter syndrome (47XXY).
broader: https://homosaurus.org/v3/homoit0000669
change note: Version 3.7.0
has top concept: Sex (Body)
in scheme: v3

LGBTQ+ operas
type: Concept
issued: 2023-06-28
modified: 2025-02-23
comment: Long-form musical performances combining singing, orchestral music, and often ballet, typically set to a dramatic narrative or libretto and presented on a theater stage centered on LGBTQ+ characters or themes.
broader: https://homosaurus.org/v3/homoit0000816
change note: Version 3.7.0
has top concept: Subcultures
in scheme: v3
narrower: https://homosaurus.org/v3/homoit0002887
narrower: https://homosaurus.org/v3/homoit0002888
narrower: https://homosaurus.org/v3/homoit0002889
narrower: https://homosaurus.org/v3/homoit0002890
narrower: https://homosaurus.org/v3/homoit0002891
narrower: https://homosaurus.org/v3/homoit0003166
narrower: https://homosaurus.org/v3/homoit0003167
related: https://homosaurus.org/v3/homoit0003168

Gay operas
type: Concept
issued: 2023-06-28
modified: 2025-02-23
comment: Operas created by gay directors, depicting gay men, or that are regarded as important within gay culture.
broader: https://homosaurus.org/v3/homoit0002886
change note: Version 3.7.0
has top concept: Subcultures
in scheme: v3

Bisexual operas
type: Concept
issued: 2023-06-28
modified: 2025-02-23
comment: Operas created by bisexual directors, depicting bisexual individuals, or that are regarded as important within bisexual culture.
broader: https://homosaurus.org/v3/homoit0002886
change note: Version 3.7.0
has top concept: Subcultures
in scheme: v3

Transgender operas
type: Concept
issued: 2023-06-28
modified: 2025-02-23
comment: Operas created by transgender directors, depicting transgender individuals, or that are regarded as important within transgender culture.
broader: https://homosaurus.org/v3/homoit0002886
change note: Version 3.7.0
has top concept: Subcultures
in scheme: v3
related: https://homosaurus.org/v3/homoit0003168

Asexual operas
type: Concept
issued: 2023-06-28
modified: 2025-02-23
comment: Operas created by asexual directors, depicting asexual individuals, or that are regarded as important within asexual culture.
broader: https://homosaurus.org/v3/homoit0002886
change note: Version 3.7.0
has top concept: Subcultures
in scheme: v3

Intersex operas
type: Concept
issued: 2023-06-28
modified: 2025-02-23
comment: Operas created by intersex directors, depicting intersex individuals, or that are regarded as important within intersex culture.
broader: https://homosaurus.org/v3/homoit0002886
change note: Version 3.7.0
has top concept: Subcultures
in scheme: v3
related: https://homosaurus.org/v3/homoit0003168

Aboriginal Australian asexual people
type: Concept
issued: 2023-06-28
modified: 2025-02-23
comment: Asexual people who belong to one or more of the various Indigenous peoples of Australia; do not use to refer to the Indigenous people of the Torres Strait Islands, who are considered ethnically and culturally distinct. Only use to describe people who identify as Aboriginal Australian.
alternative label: Aboriginal asexual people
alternative label: Asexual Aboriginal Australian people
alternative label: Asexual Aboriginal Australians
broader: https://homosaurus.org/v3/homoit0000002
change note: Version 3.7.0
has top concept: LGBTQ+ people
in scheme: v3

Afro-Canadian asexual people
type: Concept
issued: 2023-06-29
modified: 2025-02-23
comment: Asexual people of African descent born in Canada or asexual people born in African countries who live in or have a strong connection to Canada. Use for individuals who self-identify as Afro-Canadian.
alternative label: Asexual Afro-Canadian people
alternative label: Asexual Afro-Canadians
broader: https://homosaurus.org/v3/homoit0000016
broader: https://homosaurus.org/v3/homoit0002334
change note: Version 3.7.0
has top concept: LGBTQ+ people
in scheme: v3

Afro-Caribbean asexual people
type: Concept
issued: 2023-06-29
modified: 2025-02-23
comment: Asexual people of African descent born in the Caribbean or asexual people born in African countries who live in or have a strong connection to the Caribbean. Only use for individuals who self-identify as Afro-Caribbean.
alternative label: Asexual Afro-Caribbean people
alternative label: Asexual Afro-Caribbeans
broader: https://homosaurus.org/v3/homoit0000017
broader: https://homosaurus.org/v3/homoit0002334
change note: Version 3.7.0
has top concept: LGBTQ+ people
in scheme: v3

Asexual victims of hate crimes
type: Concept
issued: 2023-06-29
modified: 2025-02-23
comment: Asexual people who have experienced hate crimes and may or may not have survived; follow the individual's preference for "victims" or "survivors" whenever possible.
broader: https://homosaurus.org/v3/homoit0000613
change note: Version 3.7.0
has top concept: LGBTQ+ people
in scheme: v3

Afro-European asexual people
type: Concept
issued: 2023-06-29
modified: 2025-02-23
comment: Asexual people of African descent born in European countries or asexual people born in African countries who live in or have a strong connection to Europe. Only use for individuals who self-identify as Afro-European.
alternative label: Asexual Afro-European people
alternative label: Asexual Afro-Europeans
broader: https://homosaurus.org/v3/homoit0000018
broader: https://homosaurus.org/v3/homoit0002334
change note: Version 3.7.0
has top concept: LGBTQ+ people
in scheme: v3

Latino/a/x asexual people
type: Concept
issued: 2023-06-29
modified: 2025-02-23
comment: Latin American people who are asexual; only use to describe individuals who self-identify as Latino, Latina, or Latinx. Do not conflate with Chicano/a/x or Hispanic.
alternative label: Asexual Latinas
alternative label: Asexual Latine people
alternative label: Asexual Latinos
alternative label: Asexual Latinx people
alternative label: Latina asexual people
alternative label: Latine asexual people
alternative label: Latino asexual people
alternative label: Latinx asexual people
broader: https://homosaurus.org/v3/homoit0000253
change note: Version 3.7.0
has top concept: LGBTQ+ people
in scheme: v3
narrower: https://homosaurus.org/v3/homoit0002898

Afro-Latin American asexual people
type: Concept
issued: 2023-06-29
modified: 2025-02-23
comment: Asexual people of African descent born in Latin American countries or asexual people born in African countries who live in or have a strong connection to Latin America. Only use for individuals who self-identify as Afro-Latin American.
alternative label: Asexual Afro-Latin Americans
broader: https://homosaurus.org/v3/homoit0000019
broader: https://homosaurus.org/v3/homoit0002334
broader: https://homosaurus.org/v3/homoit0002897
change note: Version 3.7.0
has top concept: LGBTQ+ people
in scheme: v3

Anti-asexual discrimination
type: Concept
issued: 2023-06-29
modified: 2025-02-23
comment: The unjust or prejudicial treatment of asexual people due to their sexual identity; may include the denial of legal rights, employment, and housing.
broader: https://homosaurus.org/v3/homoit0000356
change note: Version 3.7.0
has top concept: LGBTQ+ discrimination
in scheme: v3
related: https://homosaurus.org/v3/homoit0000112

Anti-asexual violence
type: Concept
issued: 2023-06-29
modified: 2025-02-23
comment: Behavior involving physical force intended to harm or kill asexual people on the basis of their identity.
broader: https://homosaurus.org/v3/homoit0000059
change note: Version 3.7.0
has top concept: Anti-LGBTQ+ violence
in scheme: v3
related: https://homosaurus.org/v3/homoit0000109

Asian asexual people
type: Concept
issued: 2023-06-29
modified: 2025-02-23
comment: Asexual individuals of Asian heritage or descent, living in Asia or part of the Asian diaspora. Only use for people who self-identify as Asian.
alternative label: Asexual Asian people
alternative label: Asexual Asians
broader: https://homosaurus.org/v3/homoit0000074
change note: Version 3.7.0
has top concept: LGBTQ+ people
in scheme: v3
related: https://homosaurus.org/v3/homoit0002902

Asian American asexual people
type: Concept
issued: 2023-06-29
modified: 2025-02-23
comment: Asexual people of Asian heritage or descent born in the United States or born in Asian countries who live in or have a strong connection to the United States. Only use for individuals who self-identify as Asian American.
alternative label: Asexual Asian American people
alternative label: Asexual Asian Americans
broader: https://homosaurus.org/v3/homoit0000073
change note: Version 3.7.0
has top concept: LGBTQ+ people
in scheme: v3
related: https://homosaurus.org/v3/homoit0002901

Multiracial asexual people
type: Concept
issued: 2023-06-29
modified: 2025-02-23
comment: Asexual people who belong to two or more racial groups.
alternative label: Asexual multi-racial people
alternative label: Asexual multiracial people
alternative label: Multi-racial asexual people
broader: https://homosaurus.org/v3/homoit0000903
change note: Version 3.7.0
has top concept: LGBTQ+ people
in scheme: v3

Biracial asexual people
type: Concept
issued: 2023-06-29
modified: 2025-02-23
comment: Asexual people who belong to two or more racial groups. Only use to describe people who self-identify as biracial.
alternative label: Asexual bi-racial people
alternative label: Asexual biracial people
alternative label: Bi-racial asexual people
broader: https://homosaurus.org/v3/homoit0000820
change note: Version 3.7.0
has top concept: LGBTQ+ people
in scheme: v3

Closeted asexual people
type: Concept
issued: 2023-06-29
modified: 2025-02-23
comment: Asexual people who do not identify as such to others.
broader: https://homosaurus.org/v3/homoit0000071
broader: https://homosaurus.org/v3/homoit0001783
change note: Version 3.7.0
has top concept: Sexual minorities
in scheme: v3
related: https://homosaurus.org/v3/homoit0000285
related: https://homosaurus.org/v3/homoit0000286
related: https://homosaurus.org/v3/homoit0000287
related: https://homosaurus.org/v3/homoit0000295
related: https://homosaurus.org/v3/homoit0001065
related: https://homosaurus.org/v3/homoit0001261
related: https://homosaurus.org/v3/homoit0001784
related: https://homosaurus.org/v3/homoit0001785
related: https://homosaurus.org/v3/homoit0001786

Daughters of asexual people
type: Concept
issued: 2023-06-29
modified: 2025-02-23
comment: Daughters who have one or more asexual parent.
broader: https://homosaurus.org/v3/homoit0002352
change note: Version 3.7.0
has top concept: Family members
in scheme: v3

Fathers of asexual people
type: Concept
issued: 2023-06-29
modified: 2025-02-23
comment: People who assume the role of father to asexual people. Only use to describe individuals who identify as fathers.
broader: https://homosaurus.org/v3/homoit0002342
change note: Version 3.7.0
has top concept: Family members
in scheme: v3

Jewish asexual people
type: Concept
issued: 2023-06-29
modified: 2025-02-23
comment: Asexual people who are Jewish.
alternative label: Asexual Jews
broader: https://homosaurus.org/v3/homoit0000682
change note: Version 3.7.0
has top concept: LGBTQ+ people
in scheme: v3

Mothers of asexual people
type: Concept
issued: 2023-06-29
modified: 2025-02-23
comment: A person who assumes the role of mother to an asexual person; use only for individuals who self-identify as mothers.
broader: https://homosaurus.org/v3/homoit0002348
change note: Version 3.7.0
has top concept: Family members
in scheme: v3

Parents of asexual people
type: Concept
issued: 2023-06-29
modified: 2025-02-23
comment: People who act as parents to one or more asexual person. For parents who are themselves asexual, use the term "Asexual parents."
alternative label: Asexual people's parents
broader: https://homosaurus.org/v3/homoit0002224
change note: Version 3.7.0
has top concept: Family members
in scheme: v3

Partners of asexual people
type: Concept
issued: 2023-06-29
modified: 2025-02-23
comment: People whose sexual, romantic, or play partner is asexual.
broader: https://homosaurus.org/v3/homoit0002366
change note: Version 3.7.0
has top concept: Partners
in scheme: v3

Persecution of asexual people
type: Concept
issued: 2023-06-29
modified: 2025-02-23
comment: Systematic mistreatment of asexual people on the basis of their sexual identity.
broader: https://homosaurus.org/v3/homoit0001108
change note: Version 3.7.0
has top concept: LGBTQ+ persecutions
in scheme: v3
related: https://homosaurus.org/v3/homoit0000071

Romani asexual people
type: Concept
issued: 2023-06-29
modified: 2025-02-23
comment: Asexual people who are Romani, or part of the traditionally nomadic Indo-European people.
alternative label: Asexual Roma
alternative label: Asexual Romanis
alternative label: Asexual Romany
alternative label: Roma asexual people
alternative label: Romany asexual people
broader: https://homosaurus.org/v3/homoit0000875
change note: Version 3.7.0
has top concept: LGBTQ+ people
in scheme: v3

Sons of asexual people
type: Concept
issued: 2023-06-29
modified: 2025-02-23
comment: Sons who have one or more asexual parent. For sons who are themselves asexual, use the term "Asexual sons."
broader: https://homosaurus.org/v3/homoit0001766
broader: https://homosaurus.org/v3/homoit0002355
change note: Version 3.7.0
has top concept: Family members
in scheme: v3

White asexual people
type: Concept
issued: 2023-06-29
modified: 2025-02-23
comment: Asexual people who are white.
alternative label: Asexual Caucasian people
alternative label: Asexual white people
broader: https://homosaurus.org/v3/homoit0000243
change note: Version 3.7.0
has top concept: White LGBTQ+ people
in scheme: v3

Intersex mothers
type: Concept
issued: 2023-06-30
modified: 2025-02-23
comment: Intersex people who are mothers. Only use to describe individuals who identify as mothers.
broader: https://homosaurus.org/v3/homoit0001021
broader: https://homosaurus.org/v3/homoit0001763
broader: https://homosaurus.org/v3/homoit0002343
change note: Version 3.7.0
has top concept: Family members
in scheme: v3

Intersex museums
type: Concept
issued: 2023-06-30
modified: 2025-02-23
comment: Institutions dedicated to the storage, exhibition, conservation, and preservation of materials relating to intersex people and intersex history.
broader: LGBTQ+ museums
change note: Version 3.7.0
has top concept: LGBTQ+ cultural heritage institutions
in scheme: v3

Intersex newsletters
type: Concept
issued: 2023-06-30
modified: 2025-02-23
comment: Serialized print or digital periodicals created by or for intersex people, often with the purpose of sharing news and information related to intersex communities and intersex issues.
broader: https://homosaurus.org/v3/homoit0001041
change note: Version 3.7.0
has top concept: LGBTQ+ press
in scheme: v3

Intersex newspapers
type: Concept
issued: 2023-06-30
modified: 2025-02-23
comment: Serialized print or digital publications about intersex issues (and typically produced by intersex people or intersex organizations) that contain news, articles, columns, correspondence, and advertisements.
broader: https://homosaurus.org/v3/homoit0001042
change note: Version 3.7.0
has top concept: LGBTQ+ press
in scheme: v3

Intersex partners
type: Concept
issued: 2023-06-30
modified: 2025-02-23
comment: Intersex people who are the romantic, sexual, or play partners of another person or people.
broader: https://homosaurus.org/v3/homoit0001083
change note: Version 3.7.0
has top concept: LGBTQ+ families
in scheme: v3

Intersex people in the military
type: Concept
issued: 2023-06-30
modified: 2025-02-23
comment: Intersex people serving in state and national armed forces.
broader: https://homosaurus.org/v3/homoit0001100
change note: Version 3.7.0
has top concept: Legal status
in scheme: v3

Indigenous asexual people
type: Concept
issued: 2023-06-30
modified: 2025-02-23
comment: Asexual people who are part of an Indigenous people, or culturally distinct ethnic group whose members are directly descended from the earliest known inhabitants of a particular region and, to some extent, maintain the language and culture of those people. Only use to describe people who identify as Indigenous; use more specific terms whenever possible.
alternative label: Asexual Indigenous people
broader: https://homosaurus.org/v3/homoit0000886
change note: Version 3.7.0
has top concept: LGBTQ+ people
in scheme: v3
narrower: https://homosaurus.org/v3/homoit0002923
narrower: https://homosaurus.org/v3/homoit0002924
narrower: https://homosaurus.org/v3/homoit0002925
narrower: https://homosaurus.org/v3/homoit0002926
narrower: https://homosaurus.org/v3/homoit0002927

Inuit asexual people
type: Concept
issued: 2023-06-30
modified: 2025-02-23
comment: Asexual people who are Inuit, or part of several Indigenous peoples inhabiting the Inuit homeland in the Arctic and subarctic regions of Greenland, Canada, and Alaska. Only use for people who identify as Inuit.
broader: https://homosaurus.org/v3/homoit0000676
broader: https://homosaurus.org/v3/homoit0002922
change note: Version 3.7.0
has top concept: LGBTQ+ people
in scheme: v3

Kānaka Maoli asexual people
type: Concept
issued: 2023-06-30
modified: 2025-02-23
comment: Asexual people who are part of the Indigenous people of Mokupuni o Hawai‘i, or the Hawaiian Islands; only use to refer to people who identify as Kanaka Maoli.
alternative label: Asexual Indigenous Hawaiians
alternative label: Asexual Kānaka Maoli
alternative label: Asexual Kānaka ʻŌiwi
alternative label: Asexual Native Hawaiians
alternative label: Indigenous Hawaiian asexual people
alternative label: Native Hawaiian asexual people
broader: https://homosaurus.org/v3/homoit0001955
broader: https://homosaurus.org/v3/homoit0002922
change note: Version 3.7.0
has top concept: LGBTQ+ people
in scheme: v3

Native American asexual people
type: Concept
issued: 2023-06-30
modified: 2025-02-23
comment: People who are part of the Native peoples of the continental United States and Canada (excluding Inuit people) and self-identity as asexual. Use more specific terms when available.
alternative label: American Indian asexual people
alternative label: Asexual American Indians
alternative label: Asexual Native Americans
broader: https://homosaurus.org/v3/homoit0001037
broader: https://homosaurus.org/v3/homoit0002922
change note: Version 3.7.0
has top concept: LGBTQ+ people
in scheme: v3

Pacific Islander American asexual people
type: Concept
issued: 2023-06-30
modified: 2025-02-23
comment: Asexual people who identify as both Pacific Islanders (or of Pacific Islander ancestry) and American.
alternative label: Pacific Islander asexual people
broader: https://homosaurus.org/v3/homoit0001812
broader: https://homosaurus.org/v3/homoit0002922
change note: Version 3.7.0
has top concept: LGBTQ+ people
in scheme: v3

Papuan asexual people
type: Concept
issued: 2023-06-30
modified: 2025-02-23
comment: Asexual people who are Papuan, or part of the Indigenous peoples of new Guinea; only use for people who identify as Papuan.
alternative label: Asexual Papuan people
alternative label: Asexual Papuans
broader: https://homosaurus.org/v3/homoit0000913
broader: https://homosaurus.org/v3/homoit0002922
change note: Version 3.7.0
has top concept: LGBTQ+ people
in scheme: v3

Intersex people with chronic illnesses
type: Concept
issued: 2023-06-30
modified: 2025-02-23
comment: Intersex people who have long-term health conditions that require continued medical attention and/or significantly impact or limit daily life; some but not all people with chronic illnesses consider themselves disabled.
alternative label: Chronically ill intersex people
broader: https://homosaurus.org/v3/homoit0001879
change note: Version 3.7.0
has top concept: LGBTQ+ people
in scheme: v3
related: https://homosaurus.org/v3/homoit0002929

Intersex disabled people
type: Concept
issued: 2023-06-30
modified: 2025-02-23
comment: Intersex people who are disabled.
broader: https://homosaurus.org/v3/homoit0001854
change note: Version 3.7.0
has top concept: LGBTQ+ people
in scheme: v3
narrower: https://homosaurus.org/v3/homoit0002932
narrower: https://homosaurus.org/v3/homoit0002952
related: https://homosaurus.org/v3/homoit0002928

Intersex Deaf people
type: Concept
issued: 2023-06-30
modified: 2025-02-23
comment: Intersex people with significant or total hearing loss. Some but not all Deaf people prefer to capitalize Deaf in recognition of the cultural and linguistic identity they share with other Deaf people.
alternative label: Deaf intersex people
broader: LGBTQ+ deaf people
change note: Version 3.7.0
has top concept: LGBTQ+ deaf people
in scheme: v3

Intersex community
type: Concept
issued: 2023-06-30
modified: 2025-02-23
comment: Groups of people who share the experience of being intersex.
broader: https://homosaurus.org/v3/homoit0000297
change note: Version 3.7.0
has top concept: LGBTQ+ communities
in scheme: v3

Intersex blind people
type: Concept
issued: 2023-06-30
modified: 2025-02-23
comment: Intersex people with significant or total loss of vision.
alternative label: Blind intersex people
broader: https://homosaurus.org/v3/homoit0000822
broader: https://homosaurus.org/v3/homoit0002929
change note: Version 3.7.0
has top concept: LGBTQ+ people
in scheme: v3

Intersex political activists
type: Concept
issued: 2023-06-30
modified: 2025-02-23
comment: Intersex people working to bring about political or social change through public organizing.
broader: https://homosaurus.org/v3/homoit0000007
broader: https://homosaurus.org/v3/homoit0002751
change note: Version 3.7.0
has top concept: LGBTQ+ people
in scheme: v3

African American intersex people
type: Concept
issued: 2023-06-30
modified: 2025-02-23
comment: Intersex people of African descent born in the United States or intersex people born in African countries who live in or have a strong connection to the United States. Use for individuals who self-identity as African American. Follow the individual’s preference for African American or Black whenever possible.
alternative label: Intersex African American people
alternative label: Intersex African Americans
broader: https://homosaurus.org/v3/homoit0000015
change note: Version 3.7.0
has top concept: LGBTQ+ people
in scheme: v3

Intersex press
type: Concept
issued: 2023-09-29
modified: 2025-02-23
comment: Newspapers, magazines, or other publishing outlets aimed at intersex audiences and/or operated by intersex people.
broader: https://homosaurus.org/v3/homoit0001132
change note: Version 3.7.0
has top concept: LGBTQ+ press
in scheme: v3
narrower: https://homosaurus.org/v3/homoit0003148

Intersex publishers
type: Concept
issued: 2023-09-29
modified: 2025-02-23
comment: Companies and organizations that publish materials for intersex communities or addressing intersex issues.
broader: https://homosaurus.org/v3/homoit0001144
change note: Version 3.7.0
has top concept: LGBTQ+ publishers
in scheme: v3

Intersex radio
type: Concept
issued: 2023-09-29
modified: 2025-02-23
comment: Auditory content broadcast on the radio (analog or digital) about intersex people and intersex issues.
broader: https://homosaurus.org/v3/homoit0001231
change note: Version 3.7.0
has top concept: LGBTQ+ radio
in scheme: v3

Intersex relationships
type: Concept
issued: 2023-09-29
modified: 2025-02-23
comment: Ongoing connections (romantic, sexual, or platonic) between two or more intersex people.
broader: https://homosaurus.org/v3/homoit0001237
change note: Version 3.7.0
has top concept: LGBTQ+ relationships
in scheme: v3
narrower: https://homosaurus.org/v3/homoit0002969

Intersex slang
type: Concept
issued: 2023-09-29
modified: 2025-02-23
comment: Colloquial or informal language related to intersex identity or used by intersex people.
broader: https://homosaurus.org/v3/homoit0001317
change note: Version 3.7.0
has top concept: LGBTQ+ slang
in scheme: v3

Intersex sons
type: Concept
issued: 2023-09-29
modified: 2025-02-23
comment: Intersex people who are sons. Only use to describe individuals who identify as sons.
broader: https://homosaurus.org/v3/homoit0001329
change note: Version 3.7.0
has top concept: LGBTQ+ people
in scheme: v3

Intersex survivors of hate crimes
type: Concept
issued: 2023-09-29
modified: 2025-02-23
comment: Intersex people who have experienced and survived hate crimes; follow the individual's preference for "victims" or "survivors" whenever possible.
broader: https://homosaurus.org/v3/homoit0001349
change note: Version 3.7.0
has top concept: LGBTQ+ people
in scheme: v3

Intersex survivors of rape
type: Concept
issued: 2023-09-29
modified: 2025-02-23
comment: Intersex people who have experienced and survived rape; follow the individual's preference for "victims" or "survivors" whenever possible.
broader: https://homosaurus.org/v3/homoit0001350
change note: Version 3.7.0
has top concept: LGBTQ+ people
in scheme: v3

Intersex survivors of sexual abuse
type: Concept
issued: 2023-09-29
modified: 2025-02-23
comment: Intersex people who have experienced and survived sexual abuse; follow the individual's preference for "victims" or "survivors" whenever possible.
broader: https://homosaurus.org/v3/homoit0001351
change note: Version 3.7.0
has top concept: LGBTQ+ people
in scheme: v3

Intersex survivors of war
type: Concept
issued: 2023-09-29
modified: 2025-02-23
comment: Intersex people who have experienced and survived war; follow the individual's preference for "victims" or "survivors" whenever possible.
broader: https://homosaurus.org/v3/homoit0001352
change note: Version 3.7.0
has top concept: LGBTQ+ people
in scheme: v3

Intersex television
type: Concept
issued: 2023-09-29
modified: 2025-02-23
comment: Television shows featuring intersex characters or themes.
broader: https://homosaurus.org/v3/homoit0001359
change note: Version 3.7.0
has top concept: LGBTQ+ television
in scheme: v3

Intersex theater
type: Concept
issued: 2023-09-29
modified: 2025-02-23
comment: Works in the performance arts that focus on intersex characters or themes.
alternative label: Intersex theatre
broader: https://homosaurus.org/v3/homoit0001363
change note: Version 3.7.0
has top concept: LGBTQ+ theater
in scheme: v3

Intersex victims of hate crimes
type: Concept
issued: 2023-09-29
modified: 2025-02-23
comment: Intersex people who have experienced hate crimes and may or may not have survived; follow the individual's preference for "victims" or "survivors" whenever possible.
broader: https://homosaurus.org/v3/homoit0000613
change note: Version 3.7.0
has top concept: LGBTQ+ people
in scheme: v3

Intersex victims of sexual abuse
type: Concept
issued: 2023-09-29
modified: 2025-02-23
comment: Intersex people who have experienced sexual abuse and may or may not have survived; follow the individual's preference for "victims" or "survivors" whenever possible.
broader: https://homosaurus.org/v3/homoit0000959
change note: Version 3.7.0
has top concept: LGBTQ+ people
in scheme: v3

Intersex victims of war
type: Concept
issued: 2023-09-29
modified: 2025-02-23
comment: Intersex people who have experienced war and may or may not have survived; follow the individual's preference for "victims" or "survivors" whenever possible.
broader: https://homosaurus.org/v3/homoit0000961
change note: Version 3.7.0
has top concept: LGBTQ+ people
in scheme: v3

Intersex victims' rights
type: Concept
issued: 2023-09-29
modified: 2025-02-23
comment: Intersex people’s legal rights to be informed, present, and heard within the criminal justice system after having been harmed or injured as the result of of a crime, accident, or other event.
broader: https://homosaurus.org/v3/homoit0001492
change note: Version 3.7.0
has top concept: Law
in scheme: v3

Intersex wheelchair users
type: Concept
issued: 2023-09-29
modified: 2025-02-23
comment: Intersex people who use wheelchairs.
broader: https://homosaurus.org/v3/homoit0001877
broader: https://homosaurus.org/v3/homoit0002929
change note: Version 3.7.0
has top concept: LGBTQ+ people
in scheme: v3

Intersex youth literature
type: Concept
issued: 2023-09-29
modified: 2025-02-23
comment: Written literary works for an audience of readers from 12-18 years of age, also known as young adult literature or YA; use in reference to youth literature focusing on intersex characters or themes.
alternative label: Intersex YA
alternative label: Intersex young adult literature
broader: https://homosaurus.org/v3/homoit0001522
broader: https://homosaurus.org/v3/homoit0002750
change note: Version 3.7.0
has top concept: Subcultures
in scheme: v3

Intersex-focused businesses
type: Concept
issued: 2023-09-29
modified: 2025-02-23
comment: Businesses focusing on intersex clientele and products related to intersex communities.
broader: https://homosaurus.org/v3/homoit0001741
change note: Version 3.7.0
has top concept: LGBTQ+-focused businesses
in scheme: v3

Intersex-owned businesses
type: Concept
issued: 2023-09-29
modified: 2025-02-23
comment: Businesses owned by intersex people.
broader: https://homosaurus.org/v3/homoit0001735
change note: Version 3.7.0
has top concept: LGBTQ+-owned businesses
in scheme: v3

Afro-Canadian intersex people
type: Concept
issued: 2023-09-29
modified: 2025-02-23
comment: Intersex people of African descent born in Canada or intersex people born in African countries who live in or have a strong connection to Canada. Use for individuals who self-identify as Afro-Canadian.
alternative label: Intersex Afro-Canadian people
alternative label: Intersex Afro-Canadians
broader: https://homosaurus.org/v3/homoit0000016
broader: https://homosaurus.org/v3/homoit0002764
change note: Version 3.7.0
has top concept: LGBTQ+ people
in scheme: v3

Afro-Caribbean intersex people
type: Concept
issued: 2023-09-29
modified: 2025-02-23
comment: Intersex people of African descent born in the Caribbean or intersex people born in African countries who live in or have a strong connection to the Caribbean. Only use for individuals who self-identify as Afro-Caribbean.
broader: https://homosaurus.org/v3/homoit0000017
broader: https://homosaurus.org/v3/homoit0002764
change note: Version 3.7.0
has top concept: LGBTQ+ people
in scheme: v3

Afro-European intersex people
type: Concept
issued: 2023-09-29
modified: 2025-02-23
comment: Intersex people of African descent born in European countries or intersex people born in African countries who live in or have a strong connection to Europe. Only use for individuals who self-identify as Afro-European.
alternative label: Intersex Afro-Europeans
broader: https://homosaurus.org/v3/homoit0000018
broader: https://homosaurus.org/v3/homoit0002764
change note: Version 3.7.0
has top concept: LGBTQ+ people
in scheme: v3

Afro-Latin American intersex people
type: Concept
issued: 2023-09-29
modified: 2025-02-23
comment: Intersex people of African descent born in Latin American countries or intersex people born in African countries who live in or have a strong connection to Latin America. Only use for individuals who self-identify as Afro-Latin American.
alternative label: Afro-Latina intersex people
alternative label: Afro-Latine intersex people
alternative label: Afro-Latino intersex people
alternative label: Afro-Latino/a/x intersex people
alternative label: Afro-Latinx intersex people
alternative label: Intersex Afro-Latin Americans
alternative label: Intersex Afro-Latinas
alternative label: Intersex Afro-Latine people
alternative label: Intersex Afro-Latinos
alternative label: Intersex Afro-Latinx people
broader: https://homosaurus.org/v3/homoit0000019
broader: https://homosaurus.org/v3/homoit0002764
broader: https://homosaurus.org/v3/homoit0002769
change note: Version 3.7.0
has top concept: LGBTQ+ people
in scheme: v3

Biracial intersex people
type: Concept
issued: 2023-09-29
modified: 2025-02-23
comment: Intersex people who belong to two or more racial groups. Only use for people who self-identify as biracial.
alternative label: Bi-racial intersex people
alternative label: Intersex bi-racial people
alternative label: Intersex biracial people
broader: https://homosaurus.org/v3/homoit0000820
change note: Version 3.7.0
has top concept: LGBTQ+ people
in scheme: v3

Mothers of intersex people
type: Concept
issued: 2023-09-29
modified: 2025-02-23
comment: A person who assumes the role of mother to an intersex person; use only for individuals who self-identify as mothers.
broader: https://homosaurus.org/v3/homoit0002348
change note: Version 3.7.0
has top concept: Family members
in scheme: v3

Multiracial intersex people
type: Concept
issued: 2023-09-29
modified: 2025-02-23
comment: Intersex people who belong to two or more racial groups. Only use for people who self-identify as multiracial.
alternative label: Intersex multi-racial people
alternative label: Intersex multiracial people
alternative label: Multi-racial intersex people
broader: https://homosaurus.org/v3/homoit0000903
change note: Version 3.7.0
has top concept: LGBTQ+ people
in scheme: v3

Native American intersex people
type: Concept
issued: 2023-09-29
modified: 2025-02-23
comment: People who are part of the Native peoples of the continental United States and Canada (excluding Inuit people) and self-identity as intersex. Use more specific terms when available.
alternative label: American Indian intersex people
alternative label: Intersex American Indians
alternative label: Intersex Native Americans
broader: https://homosaurus.org/v3/homoit0001037
broader: https://homosaurus.org/v3/homoit0001973
change note: Version 3.7.0
has top concept: LGBTQ+ people
in scheme: v3

Intersex bookshops
type: Concept
issued: 2023-09-29
modified: 2025-02-23
comment: Bookshops that sell materials intended for use by intersex people or addressing topics related to intersex experiences.
broader: https://homosaurus.org/v3/homoit0000216
change note: Version 3.7.0
has top concept: LGBTQ+ bookshops
in scheme: v3

Intersex characters
type: Concept
issued: 2023-09-29
modified: 2025-02-23
comment: Characters in creative works who are intersex.
broader: https://homosaurus.org/v3/homoit0000249
change note: Version 3.7.0
has top concept: LGBTQ+ characters
in scheme: v3

Intersex community centers
type: Concept
issued: 2023-09-29
modified: 2025-02-23
comment: Spaces in which people from intersex communities meet for social, education, recreational, or organizing activities.
alternative label: Intersex community centres
broader: https://homosaurus.org/v3/homoit0000298
change note: Version 3.7.0
has top concept: LGBTQ+ centers
in scheme: v3

Intersex couples
type: Concept
issued: 2023-09-29
modified: 2025-02-23
comment: Partnerships in which both people are intersex.
broader: https://homosaurus.org/v3/homoit0000310
broader: https://homosaurus.org/v3/homoit0002939
change note: Version 3.7.0
has top concept: LGBTQ+ relationships
in scheme: v3

Intersex culture
type: Concept
issued: 2023-09-29
modified: 2025-02-23
comment: Cultural experiences shared by members of intersex communities or products of intersex culture (e.g., art and media created by and for intersex people, activism focused on intersex issues, slang commonly used in intersex communities, etc.).
broader: https://homosaurus.org/v3/homoit0001831
change note: Version 3.7.0
has top concept: Subcultures
in scheme: v3

Intersex daughters
type: Concept
issued: 2023-09-29
modified: 2025-02-23
comment: Daughters who identify as intersex. Only use for people who identify as daughters.
broader: https://homosaurus.org/v3/homoit0000330
change note: Version 3.7.0
has top concept: LGBTQ+ people
in scheme: v3

Intersex atheists
type: Concept
issued: 2023-09-29
modified: 2025-02-23
comment: Intersex people who are atheists.
broader: https://homosaurus.org/v3/homoit0000082
change note: Version 3.7.0
has top concept: LGBTQ+ people
in scheme: v3

Intersex Christians
type: Concept
issued: 2023-09-29
modified: 2025-02-23
comment: Intersex people who are Christian.
broader: https://homosaurus.org/v3/homoit0000265
change note: Version 3.7.0
has top concept: LGBTQ+ religious people
in scheme: v3

Intersex clergy
type: Concept
issued: 2023-09-29
modified: 2025-02-23
comment: Intersex people who are ordained for religious duties, particularly in the Christian Church.
broader: https://homosaurus.org/v3/homoit0001624
change note: Version 3.7.0
has top concept: LGBTQ+ clergy
in scheme: v3

Intersex Muslims
type: Concept
issued: 2023-09-29
modified: 2025-02-23
comment: Intersex people who are Muslim.
broader: https://homosaurus.org/v3/homoit0001032
change note: Version 3.7.0
has top concept: LGBTQ+ religious people
in scheme: v3

Intersex Pagans
type: Concept
issued: 2023-09-29
modified: 2025-02-23
comment: Intersex people who are members of polytheistic religions or other religions outside of the dominant culture that typically incorporate nature worship and/or the sacred feminine, such as Wicca, Druidry, Heathenry, etc. Use to describe intersex people who self-identify as Pagan.
broader: https://homosaurus.org/v3/homoit0001069
change note: Version 3.7.0
has top concept: LGBTQ+ religious people
in scheme: v3

Intersex Protestants
type: Concept
issued: 2023-09-29
modified: 2025-02-23
comment: Intersex people who are members of the Protestant Church.
broader: https://homosaurus.org/v3/homoit0001137
change note: Version 3.7.0
has top concept: LGBTQ+ religious people
in scheme: v3

Asexual atheists
type: Concept
issued: 2023-10-27
modified: 2025-02-23
comment: Asexual people who are atheists.
broader: https://homosaurus.org/v3/homoit0000082
change note: Version 3.7.0
has top concept: LGBTQ+ people
in scheme: v3

Asexual Christians
type: Concept
issued: 2023-10-27
modified: 2025-02-23
comment: Asexual people who are Christian.
broader: https://homosaurus.org/v3/homoit0000265
change note: Version 3.7.0
has top concept: LGBTQ+ religious people
in scheme: v3

Asexual clergy
type: Concept
issued: 2023-10-27
modified: 2025-02-23
comment: Asexual people who are ordained for religious duties, particularly in the Christian Church.
broader: https://homosaurus.org/v3/homoit0001624
change note: Version 3.7.0
has top concept: LGBTQ+ clergy
in scheme: v3

Asexual Muslims
type: Concept
issued: 2023-10-27
modified: 2025-02-23
comment: Asexual people who are Muslim.
broader: https://homosaurus.org/v3/homoit0001032
change note: Version 3.7.0
has top concept: LGBTQ+ religious people
in scheme: v3

Asexual Pagans
type: Concept
issued: 2023-10-27
modified: 2025-02-23
comment: Asexual people who are members of polytheistic religions or other religions outside of the dominant culture that typically incorporate nature worship and/or the sacred feminine, such as Wicca, Druidry, Heathenry, etc. Use to describe asexual people who self-identify as Pagan.
broader: https://homosaurus.org/v3/homoit0001069
change note: Version 3.7.0
has top concept: LGBTQ+ religious people
in scheme: v3

Asexual Protestants
type: Concept
issued: 2023-10-27
modified: 2025-02-23
comment: Asexual people who are members of the Protestant Church.
broader: https://homosaurus.org/v3/homoit0001137
change note: Version 3.7.0
has top concept: LGBTQ+ religious people
in scheme: v3

Asexual witches
type: Concept
issued: 2023-10-27
modified: 2025-02-23
comment: Asexual practitioners of Wicca or other Pagan religions who self-identify as witches.
alternative label: Asexual Wiccans
broader: https://homosaurus.org/v3/homoit0001907
change note: Version 3.7.0
has top concept: LGBTQ+ religious people
in scheme: v3

Asexual Roman Catholics
type: Concept
issued: 2023-10-27
modified: 2025-02-23
comment: Asexual people who are members of the Roman Catholic Church.
broader: https://homosaurus.org/v3/homoit0001244
change note: Version 3.7.0
has top concept: LGBTQ+ religious people
in scheme: v3

Intersex Roman Catholics
type: Concept
issued: 2023-10-27
modified: 2025-02-23
comment: Intersex people who are members of the Roman Catholic Church.
broader: https://homosaurus.org/v3/homoit0001244
change note: Version 3.7.0
has top concept: LGBTQ+ religious people
in scheme: v3

Asexual Buddhists
type: Concept
issued: 2023-10-27
modified: 2025-02-23
comment: Asexual people who are Buddhist.
broader: https://homosaurus.org/v3/homoit0000225
change note: Version 3.7.0
has top concept: LGBTQ+ religious people
in scheme: v3

Intersex Buddhists
type: Concept
issued: 2023-10-27
modified: 2025-02-23
comment: Intersex people who are Buddhist.
broader: https://homosaurus.org/v3/homoit0000225
change note: Version 3.7.0
has top concept: LGBTQ+ religious people
in scheme: v3

Asexual dominatrices
type: Concept
issued: 2023-10-27
modified: 2025-02-23
comment: Women who take a dominant role in BDSM activities; use for dominatrices who identify as asexual.
broader: https://homosaurus.org/v3/homoit0000363
change note: Version 3.7.0
has top concept: Relationship minorities
in scheme: v3

Asexual dominants
type: Concept
issued: 2023-10-27
modified: 2025-02-23
comment: Asexual people (typically men) who are part of the BDSM scene and assume the dominant role in sexual relationships with a master/slave dynamic.
broader: https://homosaurus.org/v3/homoit0000999
change note: Version 3.7.0
has top concept: Sexual identity
in scheme: v3

Asexual mistresses
type: Concept
issued: 2023-10-27
modified: 2025-02-23
comment: Asexual women who are part of the BDSM scene and assume the mistress role in sexual relationships with a mistress/slave dynamic.
broader: https://homosaurus.org/v3/homoit0001018
change note: Version 3.7.0
has top concept: Sexual identity
in scheme: v3

Demisexual disabled people
type: Concept
issued: 2023-10-27
modified: 2025-02-23
comment: Demisexual people who are disabled.
alternative label: Disabled demisexual people
broader: https://homosaurus.org/v3/homoit0001854
change note: Version 3.7.0
has top concept: LGBTQ+ people
in scheme: v3
narrower: https://homosaurus.org/v3/homoit0003001
narrower: https://homosaurus.org/v3/homoit0003007
narrower: https://homosaurus.org/v3/homoit0003012
narrower: https://homosaurus.org/v3/homoit0003017
narrower: https://homosaurus.org/v3/homoit0003028
related: https://homosaurus.org/v3/homoit0003022

Megasexual disabled people
type: Concept
issued: 2023-10-27
modified: 2025-02-23
comment: Megasexual people who are disabled.
alternative label: Disabled megasexual people
broader: https://homosaurus.org/v3/homoit0001854
change note: Version 3.7.0
has top concept: LGBTQ+ people
in scheme: v3
narrower: https://homosaurus.org/v3/homoit0003002
narrower: https://homosaurus.org/v3/homoit0003008
narrower: https://homosaurus.org/v3/homoit0003013
narrower: https://homosaurus.org/v3/homoit0003018
narrower: https://homosaurus.org/v3/homoit0003029
related: https://homosaurus.org/v3/homoit0003023

Aromantic disabled people
type: Concept
issued: 2023-10-27
modified: 2025-02-23
comment: Aromantic people who are disabled.
alternative label: Disabled aromantic people
broader: https://homosaurus.org/v3/homoit0001854
change note: Version 3.7.0
has top concept: LGBTQ+ people
in scheme: v3
narrower: https://homosaurus.org/v3/homoit0003003
narrower: https://homosaurus.org/v3/homoit0003009
narrower: https://homosaurus.org/v3/homoit0003014
narrower: https://homosaurus.org/v3/homoit0003019
narrower: https://homosaurus.org/v3/homoit0003030
related: https://homosaurus.org/v3/homoit0003024

Greyromantic disabled people
type: Concept
issued: 2023-10-27
modified: 2025-02-23
comment: Greyromantic people who are disabled.
alternative label: Disabled greyromantic people
broader: https://homosaurus.org/v3/homoit0001854
change note: Version 3.7.0
has top concept: LGBTQ+ people
in scheme: v3
narrower: https://homosaurus.org/v3/homoit0003004
narrower: https://homosaurus.org/v3/homoit0003010
narrower: https://homosaurus.org/v3/homoit0003015
narrower: https://homosaurus.org/v3/homoit0003020
narrower: https://homosaurus.org/v3/homoit0003031
related: https://homosaurus.org/v3/homoit0003025

Demisexual autistic people
type: Concept
issued: 2023-10-27
modified: 2025-02-23
comment: Demisexual people who are autistic.
alternative label: Autistic demisexual people
broader: https://homosaurus.org/v3/homoit0003001
change note: Version 3.7.0
has top concept: LGBTQ+ people
in scheme: v3

Megasexual autistic people
type: Concept
issued: 2023-10-27
modified: 2025-02-23
comment: Megasexual people who are autistic.
alternative label: Autistic megasexual people
broader: https://homosaurus.org/v3/homoit0003002
change note: Version 3.7.0
has top concept: LGBTQ+ people
in scheme: v3

Aromantic autistic people
type: Concept
issued: 2023-10-27
modified: 2025-02-23
comment: Aromantic people who are autistic.
alternative label: Autistic aromantic people
broader: https://homosaurus.org/v3/homoit0003003
change note: Version 3.7.0
has top concept: LGBTQ+ people
in scheme: v3

Greyromantic autistic people
type: Concept
issued: 2023-10-27
modified: 2025-02-23
comment: Greyromantic people who are autistic.
alternative label: Autistic greyromantic people
broader: https://homosaurus.org/v3/homoit0003004
change note: Version 3.7.0
has top concept: LGBTQ+ people
in scheme: v3

Demisexual neurodivergent people
type: Concept
issued: 2023-10-27
modified: 2025-02-23
comment: Demisexual people whose brains process, learn, and/or behave differently from what is considered typical by society. Some of these neurological differences can present as learning disabilities, medical disorders, and other conditions.
alternative label: Neurodivergent demisexual people
broader: https://homosaurus.org/v3/homoit0002993
change note: Version 3.7.0
has top concept: LGBTQ+ people
in scheme: v3
narrower: https://homosaurus.org/v3/homoit0002997

Megasexual neurodivergent people
type: Concept
issued: 2023-10-27
modified: 2025-02-23
comment: Megasexual people whose brains process, learn, and/or behave differently from what is considered typical by society. Some of these neurological differences can present as learning disabilities, medical disorders, and other conditions.
alternative label: Neurodivergent megasexual people
broader: https://homosaurus.org/v3/homoit0002994
change note: Version 3.7.0
has top concept: LGBTQ+ people
in scheme: v3
narrower: https://homosaurus.org/v3/homoit0002998

Aromantic neurodivergent people
type: Concept
issued: 2023-10-27
modified: 2025-02-23
comment: Aromantic people whose brains process, learn, and/or behave differently from what is considered typical by society. Some of these neurological differences can present as learning disabilities, medical disorders, and other conditions.
alternative label: Neurodivergent aromantic people
broader: https://homosaurus.org/v3/homoit0002995
change note: Version 3.7.0
has top concept: LGBTQ+ people
in scheme: v3
narrower: https://homosaurus.org/v3/homoit0002999

Greyromantic neurodivergent people
type: Concept
issued: 2023-10-27
modified: 2025-02-23
comment: Greyromantic people whose brains process, learn, and/or behave differently from what is considered typical by society. Some of these neurological differences can present as learning disabilities, medical disorders, and other conditions.
alternative label: Neurodivergent greyromantic people
broader: https://homosaurus.org/v3/homoit0002996
change note: Version 3.7.0
has top concept: LGBTQ+ people
in scheme: v3
narrower: https://homosaurus.org/v3/homoit0003000

Non-binary neurodivergent people
type: Concept
issued: 2023-10-27
modified: 2025-02-23
comment: Non-binary people whose brains process, learn, and/or behave differently from what is considered typical by society. Some of these neurological differences can present as learning disabilities, medical disorders, and other conditions.
alternative label: Neurodivergent non-binary people
broader: https://homosaurus.org/v3/homoit0002652
change note: Version 3.7.0
has top concept: LGBTQ+ people
in scheme: v3
narrower: https://homosaurus.org/v3/homoit0002673

Demisexual blind people
type: Concept
issued: 2023-10-27
modified: 2025-02-23
comment: Demisexual people with significant or total loss of vision.
alternative label: Blind demisexual people
broader: https://homosaurus.org/v3/homoit0002993
change note: Version 3.7.0
has top concept: LGBTQ+ people
in scheme: v3

Megasexual blind people
type: Concept
issued: 2023-10-27
modified: 2025-02-23
comment: Megasexual people with significant or total loss of vision.
alternative label: Blind megasexual people
broader: https://homosaurus.org/v3/homoit0002994
change note: Version 3.7.0
has top concept: LGBTQ+ people
in scheme: v3

Aromantic blind people
type: Concept
issued: 2023-10-27
modified: 2025-02-23
comment: Aromantic people with significant or total loss of vision.
alternative label: Blind aromantic people
broader: https://homosaurus.org/v3/homoit0002995
change note: Version 3.7.0
has top concept: LGBTQ+ people
in scheme: v3

Greyromantic blind people
type: Concept
issued: 2023-10-27
modified: 2025-02-23
comment: Greyromantic people with significant or total loss of vision.
alternative label: Blind greyromantic people
broader: https://homosaurus.org/v3/homoit0002996
change note: Version 3.7.0
has top concept: LGBTQ+ people
in scheme: v3

Non-binary blind people
type: Concept
issued: 2023-10-27
modified: 2025-02-23
comment: Non-binary people with significant or total loss of vision.
alternative label: Blind non-binary people
alternative label: Nonbinary blind people
broader: https://homosaurus.org/v3/homoit0002652
change note: Version 3.7.0
has top concept: LGBTQ+ people
in scheme: v3

Demisexual hard of hearing people
type: Concept
issued: 2023-10-27
modified: 2025-02-23
comment: Demisexual people with significant or total hearing loss who may or may not consider themselves d/Deaf.
alternative label: Demisexual HoH people
alternative label: Demisexual hearing impaired people
alternative label: Hearing impaired demisexual people
alternative label: HoH Demisexual people
broader: https://homosaurus.org/v3/homoit0002993
change note: Version 3.7.0
has top concept: LGBTQ+ people
in scheme: v3
related: https://homosaurus.org/v3/homoit0003017

Megasexual hard of hearing people
type: Concept
issued: 2023-10-27
modified: 2025-02-23
comment: Megasexual people with significant or total hearing loss who may or may not consider themselves d/Deaf.
alternative label: Hearing impaired megasexual people
alternative label: HoH Megasexual people
alternative label: Megasexual HoH people
alternative label: Megasexual hearing impaired people
broader: https://homosaurus.org/v3/homoit0002994
change note: Version 3.7.0
has top concept: LGBTQ+ people
in scheme: v3
related: https://homosaurus.org/v3/homoit0003018

Aromantic hard of hearing people
type: Concept
issued: 2023-10-27
modified: 2025-02-23
comment: Aromantic people who are hard of hearing.
alternative label: Aromantic HoH people
alternative label: Aromantic hearing impaired people
alternative label: Hearing impaired aromantic people
alternative label: HoH Aromantic people
broader: https://homosaurus.org/v3/homoit0002995
change note: Version 3.7.0
has top concept: LGBTQ+ people
in scheme: v3
related: https://homosaurus.org/v3/homoit0003019

Greyromantic hard of hearing people
type: Concept
issued: 2023-10-27
modified: 2025-02-23
comment: Greyromantic people with significant or total hearing loss who may or may not consider themselves d/Deaf.
alternative label: Greyromantic hearing impaired people
alternative label: Greyromantic HoH people
alternative label: Hearing impaired greyromantic people
alternative label: HoH Greyromantic people
broader: https://homosaurus.org/v3/homoit0002996
broader: https://homosaurus.org/v3/homoit0003020
change note: Version 3.7.0
has top concept: LGBTQ+ people
in scheme: v3

Non-binary hard of hearing people
type: Concept
issued: 2023-10-27
modified: 2025-02-23
comment: Non-binary people with significant or total hearing loss who may or may not consider themselves d/Deaf.
alternative label: Hearing impaired non-binary people
alternative label: HoH Non-binary people
alternative label: Non-binary HoH people
alternative label: Non-binary hearing impaired people
alternative label: Nonbinary hard of hearing people
broader: https://homosaurus.org/v3/homoit0002652
change note: Version 3.7.0
has top concept: LGBTQ+ people
in scheme: v3
related: https://homosaurus.org/v3/homoit0003021

Demisexual Deaf people
type: Concept
issued: 2023-10-27
modified: 2025-02-23
comment: Demisexual people with significant or total hearing loss. Some but not all Deaf people prefer to capitalize Deaf in recognition of the cultural and linguistic identity they share with other Deaf people.
alternative label: Deaf demisexual people
broader: https://homosaurus.org/v3/homoit0002993
change note: Version 3.7.0
has top concept: LGBTQ+ people
in scheme: v3
related: https://homosaurus.org/v3/homoit0003012

Megasexual Deaf people
type: Concept
issued: 2023-10-27
modified: 2025-02-23
comment: Megasexual people with significant or total hearing loss who may or may not consider themselves d/Deaf.
alternative label: Deaf megasexual people
broader: https://homosaurus.org/v3/homoit0002994
change note: Version 3.7.0
has top concept: LGBTQ+ people
in scheme: v3
related: https://homosaurus.org/v3/homoit0003013

Aromantic Deaf people
type: Concept
issued: 2023-10-27
modified: 2025-02-23
comment: Aromantic people with significant or total hearing loss. Some but not all Deaf people prefer to capitalize Deaf in recognition of the cultural and linguistic identity they share with other Deaf people.
alternative label: Deaf aromantic people
broader: https://homosaurus.org/v3/homoit0002995
change note: Version 3.7.0
has top concept: LGBTQ+ people
in scheme: v3
related: https://homosaurus.org/v3/homoit0003014

Greyromantic Deaf people
type: Concept
issued: 2023-10-27
modified: 2025-02-23
comment: Greyromantic people with significant or total hearing loss who may or may not consider themselves d/Deaf.
alternative label: Deaf greyromantic people
broader: https://homosaurus.org/v3/homoit0002996
change note: Version 3.7.0
has top concept: LGBTQ+ people
in scheme: v3
narrower: https://homosaurus.org/v3/homoit0003015

Non-binary Deaf people
type: Concept
issued: 2023-10-27
modified: 2025-02-23
comment: Non-binary people with significant or total hearing loss. Some but not all Deaf people prefer to capitalize Deaf in recognition of the cultural and linguistic identity they share with other Deaf people.
alternative label: Deaf non-binary people
alternative label: Nonbinary Deaf people
broader: https://homosaurus.org/v3/homoit0002652
change note: Version 3.7.0
has top concept: LGBTQ+ people
in scheme: v3
related: https://homosaurus.org/v3/homoit0003016

Non-binary wheelchair users
type: Concept
issued: 2023-10-27
modified: 2025-02-23
comment: Non-binary people who use wheelchairs.
alternative label: Nonbinary wheelchair users
broader: https://homosaurus.org/v3/homoit0002652
change note: Version 3.7.0
has top concept: LGBTQ+ people
in scheme: v3

Demisexual wheelchair users
type: Concept
issued: 2023-10-27
modified: 2025-02-23
comment: Demisexual people who use wheelchairs.
broader: https://homosaurus.org/v3/homoit0002993
change note: Version 3.7.0
has top concept: LGBTQ+ people
in scheme: v3

Megasexual wheelchair users
type: Concept
issued: 2023-10-27
modified: 2025-02-23
comment: Megasexual people who use wheelchairs.
broader: https://homosaurus.org/v3/homoit0002994
change note: Version 3.7.0
has top concept: LGBTQ+ people
in scheme: v3

Aromantic wheelchair users
type: Concept
issued: 2023-10-27
modified: 2025-02-23
comment: Aromantic people who use wheelchairs.
broader: https://homosaurus.org/v3/homoit0002995
change note: Version 3.7.0
has top concept: LGBTQ+ people
in scheme: v3

Greyromantic wheelchair users
type: Concept
issued: 2023-10-27
modified: 2025-02-23
comment: Greyromantic people who use wheelchairs.
broader: https://homosaurus.org/v3/homoit0002996
change note: Version 3.7.0
has top concept: LGBTQ+ people
in scheme: v3

LGBTQ+ alumni groups
type: Concept
issued: 2023-12-05
modified: 2025-02-23
comment: Alumni groups or associations whose membership is specifically comprised of LGBTQ+ former students of the same university, college, or school
alternative label: LGBTQ+ alumni associations
broader: https://homosaurus.org/v3/homoit0000297
change note: Version 3.7.0
has top concept: LGBTQ+ communities
in scheme: v3
related: https://homosaurus.org/v3/homoit0003033
related: https://homosaurus.org/v3/homoit0003034
related: https://homosaurus.org/v3/homoit0003035
related: https://homosaurus.org/v3/homoit0003036
related: https://homosaurus.org/v3/homoit0003037
related: https://homosaurus.org/v3/homoit0003038
related: https://homosaurus.org/v3/homoit0003039
related: https://homosaurus.org/v3/homoit0003040
related: https://homosaurus.org/v3/homoit0003042
related: https://homosaurus.org/v3/homoit0003043
related: https://homosaurus.org/v3/homoit0003044
related: https://homosaurus.org/v3/homoit0003045
related: https://homosaurus.org/v3/homoit0003046

Aromantic college students
type: Concept
issued: 2023-12-05
modified: 2025-02-23
comment: Aromantic people who are attending college.
broader: https://homosaurus.org/v3/homoit0003041
change note: Version 3.7.0
has top concept: LGBTQ+ people
in scheme: v3
related: https://homosaurus.org/v3/homoit0003032

Asexual college students
type: Concept
issued: 2023-12-05
modified: 2025-02-23
comment: Asexual people who are attending college.
broader: https://homosaurus.org/v3/homoit0000071
broader: https://homosaurus.org/v3/homoit0003041
change note: Version 3.7.0
has top concept: Sexual minorities
in scheme: v3
related: https://homosaurus.org/v3/homoit0003032

Bisexual college students
type: Concept
issued: 2023-12-05
modified: 2025-02-23
comment: Bisexual people who are attending college.
broader: https://homosaurus.org/v3/homoit0000170
broader: https://homosaurus.org/v3/homoit0003041
change note: Version 3.7.0
has top concept: LGBTQ+ people
in scheme: v3
related: https://homosaurus.org/v3/homoit0003032

Demisexual college students
type: Concept
issued: 2023-12-05
modified: 2025-02-23
comment: Demisexual people who are attending college.
broader: https://homosaurus.org/v3/homoit0000344
broader: https://homosaurus.org/v3/homoit0003041
change note: Version 3.7.0
has top concept: Sexual identity
in scheme: v3
related: https://homosaurus.org/v3/homoit0003032

Gay college students
type: Concept
issued: 2023-12-05
modified: 2025-02-23
comment: Gay men who are attending college.
broader: https://homosaurus.org/v3/homoit0000506
broader: https://homosaurus.org/v3/homoit0003041
change note: Version 3.7.0
has top concept: LGBTQ+ people
in scheme: v3
related: https://homosaurus.org/v3/homoit0003032

Greyromantic college students
type: Concept
issued: 2023-12-05
modified: 2025-02-23
comment: Greyromantic people who are attending college.
broader: https://homosaurus.org/v3/homoit0001987
broader: https://homosaurus.org/v3/homoit0003041
change note: Version 3.7.0
has top concept: Romantic minorities
in scheme: v3
related: https://homosaurus.org/v3/homoit0003032

Intersex college students
type: Concept
issued: 2023-12-05
modified: 2025-02-23
comment: Intersex people who are attending college.
broader: https://homosaurus.org/v3/homoit0000618
broader: https://homosaurus.org/v3/homoit0003041
change note: Version 3.7.0
has top concept: LGBTQ+ people
in scheme: v3
related: https://homosaurus.org/v3/homoit0003032

Lesbian college students
type: Concept
issued: 2023-12-05
modified: 2025-02-23
comment: Lesbians who are attending college.
broader: https://homosaurus.org/v3/homoit0000556
broader: https://homosaurus.org/v3/homoit0003041
change note: Version 3.7.0
has top concept: LGBTQ+ people
in scheme: v3
related: https://homosaurus.org/v3/homoit0003032

LGBTQ+ college students
type: Concept
issued: 2023-12-05
modified: 2025-02-23
comment: LGBTQ+ people who are attending college.
alternative label: LGBT college students
broader: https://homosaurus.org/v3/homoit0003533
change note: Version 3.7.0
has top concept: LGBTQ+ people
in scheme: v3
narrower: https://homosaurus.org/v3/homoit0003033
narrower: https://homosaurus.org/v3/homoit0003034
narrower: https://homosaurus.org/v3/homoit0003035
narrower: https://homosaurus.org/v3/homoit0003036
narrower: https://homosaurus.org/v3/homoit0003037
narrower: https://homosaurus.org/v3/homoit0003038
narrower: https://homosaurus.org/v3/homoit0003039
narrower: https://homosaurus.org/v3/homoit0003040
narrower: https://homosaurus.org/v3/homoit0003042
narrower: https://homosaurus.org/v3/homoit0003043
narrower: https://homosaurus.org/v3/homoit0003044
narrower: https://homosaurus.org/v3/homoit0003045
related: https://homosaurus.org/v3/homoit0003046

Megasexual college students
type: Concept
issued: 2023-12-05
modified: 2025-02-23
comment: Megasexual people who are attending college.
broader: https://homosaurus.org/v3/homoit0001633
broader: https://homosaurus.org/v3/homoit0003041
change note: Version 3.7.0
has top concept: Sexual minorities
in scheme: v3
related: https://homosaurus.org/v3/homoit0003032

Non-binary college students
type: Concept
issued: 2023-12-05
modified: 2025-02-23
comment: Non-binary people who are attending college.
alternative label: Nonbinary college students
broader: https://homosaurus.org/v3/homoit0001048
broader: https://homosaurus.org/v3/homoit0003041
change note: Version 3.7.0
has top concept: LGBTQ+ people
in scheme: v3
related: https://homosaurus.org/v3/homoit0003032

Queer college students
type: Concept
issued: 2023-12-05
modified: 2025-02-23
comment: Queer people who are attending college.
broader: https://homosaurus.org/v3/homoit0001195
broader: https://homosaurus.org/v3/homoit0003041
change note: Version 3.7.0
has top concept: LGBTQ+ people
in scheme: v3
related: https://homosaurus.org/v3/homoit0003032

Transgender college students
type: Concept
issued: 2023-12-05
modified: 2025-02-23
comment: Transgender people who are attending college.
broader: https://homosaurus.org/v3/homoit0001378
broader: https://homosaurus.org/v3/homoit0003041
change note: Version 3.7.0
has top concept: LGBTQ+ people
in scheme: v3
related: https://homosaurus.org/v3/homoit0003032

Two-Spirit college students
type: Concept
issued: 2023-12-05
modified: 2025-02-23
comment: Two-Spirit people who are attending college.
alternative label: 2S college students
alternative label: Two Spirit college students
alternative label: Two Spirited college students
alternative label: Two-Spirited college students
broader: https://homosaurus.org/v3/homoit0001480
change note: Version 3.7.0
has top concept: Gender
in scheme: v3
related: https://homosaurus.org/v3/homoit0003032
related: https://homosaurus.org/v3/homoit0003041

Wrestling
type: Concept
issued: 2023-12-15
modified: 2025-02-23
comment: A competitive, social, or erotic activity involving two or more people engaging in grappling with each other trying throw or force the other(s) to the ground.
broader: https://homosaurus.org/v3/homoit0000442
change note: Version 3.7.0
has top concept: Eroticism
in scheme: v3

Whipping
type: Concept
issued: 2023-12-15
modified: 2025-02-23
comment: Consensual use of whips, floggers, or similar impact play tools on the body.
broader: https://homosaurus.org/v3/homoit0003053
change note: Version 3.7.0
has top concept: Eroticism
in scheme: v3
narrower: https://homosaurus.org/v3/homoit0000447
related: https://homosaurus.org/v3/homoit0001503
related: https://homosaurus.org/v3/homoit0003120

Wax play
type: Concept
issued: 2023-12-15
modified: 2025-02-23
comment: Application of liquid wax to the body for erotic or sensual play.
broader: https://homosaurus.org/v3/homoit0003054
change note: Version 3.7.0
has top concept: Eroticism
in scheme: v3
related: https://homosaurus.org/v3/homoit0000606
related: https://homosaurus.org/v3/homoit0003055
related: https://homosaurus.org/v3/homoit0003056

Violet wands
type: Concept
issued: 2023-12-15
modified: 2025-02-23
comment: A device used to apply an electrical charge to the body.
broader: https://homosaurus.org/v3/homoit0001266
change note: Version 3.7.0
has top concept: Sex accessories
in scheme: v3
related: https://homosaurus.org/v3/homoit0003057

Muscle worship
type: Concept
issued: 2023-12-15
modified: 2025-02-23
comment: Any practice of revering muscles, usually in a sexual context.
broader: https://homosaurus.org/v3/homoit0000442
broader: https://homosaurus.org/v3/homoit0001634
broader: https://homosaurus.org/v3/homoit0003072
change note: Version 3.7.0
has top concept: Eroticism
in scheme: v3
related: https://homosaurus.org/v3/homoit0001654

Power exchange
type: Concept
issued: 2023-12-15
modified: 2025-02-23
comment: Consensual exchange of power between two or more people as a feature of their relationship or during erotic activity.
alternative label: D & S
alternative label: D and S
alternative label: D&s
alternative label: D/s
alternative label: Dom and sub
alternative label: Dom-sub
alternative label: Dominance and submission
alternative label: Domination and submission
alternative label: M/s
alternative label: Master/slave lifestyle
alternative label: Master/slave
alternative label: Submission and dominance
alternative label: Submission and domination
broader: https://homosaurus.org/v3/homoit0001304
change note: Version 3.7.0
has top concept: Role behavior
in scheme: v3
narrower: https://homosaurus.org/v3/homoit0003060
related: https://homosaurus.org/v3/homoit0000022
related: https://homosaurus.org/v3/homoit0000219
related: https://homosaurus.org/v3/homoit0000363
related: https://homosaurus.org/v3/homoit0000442
related: https://homosaurus.org/v3/homoit0000705
related: https://homosaurus.org/v3/homoit0000999
related: https://homosaurus.org/v3/homoit0001242
related: https://homosaurus.org/v3/homoit0001318
related: https://homosaurus.org/v3/homoit0001376
related: https://homosaurus.org/v3/homoit0001637
related: https://homosaurus.org/v3/homoit0003068
related: https://homosaurus.org/v3/homoit0003069
related: https://homosaurus.org/v3/homoit0003070
related: https://homosaurus.org/v3/homoit0003084
related: https://homosaurus.org/v3/homoit0003139
related: https://homosaurus.org/v3/homoit0003147
related: https://homosaurus.org/v3/homoit0003851

Impact play
type: Concept
issued: 2023-12-15
modified: 2025-02-23
comment: An activity where a person is struck repeatedly, with or without an implement, for erotic play.
alternative label: Beating
alternative label: Cropping
broader: https://homosaurus.org/v3/homoit0000442
change note: Version 3.7.0
has top concept: Eroticism
in scheme: v3
narrower: https://homosaurus.org/v3/homoit0000447
narrower: https://homosaurus.org/v3/homoit0001335
narrower: https://homosaurus.org/v3/homoit0003048
narrower: https://homosaurus.org/v3/homoit0003075
narrower: https://homosaurus.org/v3/homoit0003119
narrower: https://homosaurus.org/v3/homoit0003120
related: https://homosaurus.org/v3/homoit0003111

Temperature play
type: Concept
issued: 2023-12-15
modified: 2025-02-23
comment: Any of various forms of sensual or sexual play in which objects and substances are used to stimulate the body with heat or cold.
broader: https://homosaurus.org/v3/homoit0000442
change note: Version 3.7.0
has top concept: Eroticism
in scheme: v3
narrower: https://homosaurus.org/v3/homoit0003049
narrower: https://homosaurus.org/v3/homoit0003055
narrower: https://homosaurus.org/v3/homoit0003056
narrower: https://homosaurus.org/v3/homoit0003136

Fire play
type: Concept
issued: 2023-12-15
modified: 2025-02-23
comment: The use of fire or flame in a sexual or erotic context.
broader: https://homosaurus.org/v3/homoit0003054
change note: Version 3.7.0
has top concept: Eroticism
in scheme: v3
related: https://homosaurus.org/v3/homoit0003049
related: https://homosaurus.org/v3/homoit0003056
related: https://homosaurus.org/v3/homoit0003136

Ice play
type: Concept
issued: 2023-12-15
modified: 2025-02-23
comment: A type of sensual or sexual play in which ice or similar cold substances are applied to the body.
broader: https://homosaurus.org/v3/homoit0003054
change note: Version 3.7.0
has top concept: Eroticism
in scheme: v3
related: https://homosaurus.org/v3/homoit0003049
related: https://homosaurus.org/v3/homoit0003055

Electrical play
type: Concept
issued: 2023-12-15
modified: 2025-02-23
comment: Any of various forms of sexual play which involve the application of electricity.
broader: https://homosaurus.org/v3/homoit0000442
change note: Version 3.7.0
has top concept: Eroticism
in scheme: v3
related: https://homosaurus.org/v3/homoit0003050
related: https://homosaurus.org/v3/homoit0003109

Vacuum pumps
type: Concept
issued: 2023-12-15
modified: 2025-02-23
comment: A sexual aid or accessory that is placed over and around genitalia. The device creates a suction that engorges and enlarges genitalia.
alternative label: Clitoral pump
alternative label: Nipple pump
alternative label: Penis pump
alternative label: Suckers
broader: https://homosaurus.org/v3/homoit0003059
change note: Version 3.7.0
has top concept: Eroticism
in scheme: v3
related: https://homosaurus.org/v3/homoit0000398

Kink accessories
type: Concept
issued: 2023-12-15
modified: 2025-02-23
comment: Items used during kink play or worn as fashionable accessories to indicate participation in the kink or leather communities.
alternative label: Bondage gear
alternative label: Bondagewear
alternative label: Fetishwear
alternative label: Leather gear
broader: https://homosaurus.org/v3/homoit0000442
change note: Version 3.7.0
has top concept: Eroticism
in scheme: v3
narrower: https://homosaurus.org/v3/homoit0000209
narrower: https://homosaurus.org/v3/homoit0000293
narrower: https://homosaurus.org/v3/homoit0000307
narrower: https://homosaurus.org/v3/homoit0000612
narrower: https://homosaurus.org/v3/homoit0001337
narrower: https://homosaurus.org/v3/homoit0003058
narrower: https://homosaurus.org/v3/homoit0003062
narrower: https://homosaurus.org/v3/homoit0003063
narrower: https://homosaurus.org/v3/homoit0003090
narrower: https://homosaurus.org/v3/homoit0003134
narrower: https://homosaurus.org/v3/homoit0003142
related: https://homosaurus.org/v3/homoit0000086
related: https://homosaurus.org/v3/homoit0000705
related: https://homosaurus.org/v3/homoit0001238
related: https://homosaurus.org/v3/homoit0001266
related: https://homosaurus.org/v3/homoit0003066
related: https://homosaurus.org/v3/homoit0003100
related: https://homosaurus.org/v3/homoit0003107

Total power exchange
type: Concept
issued: 2023-12-15
modified: 2025-02-23
comment: Consensual exchange of power between two or more people as a feature of their relationship that is practiced at all times.
alternative label: 24/7 (Power Exchange)
alternative label: Kept
broader: https://homosaurus.org/v3/homoit0003052
change note: Version 3.7.0
has top concept: Role behavior
in scheme: v3

Diapers (Erotic)
type: Concept
issued: 2023-12-18
modified: 2025-02-23
comment: Absorbent material wrapped around a person’s butt and between their legs to absorb urine and feces; typically used in ageplay.
broader: https://homosaurus.org/v3/homoit0003059
change note: Version 3.7.0
has top concept: Eroticism
in scheme: v3
related: https://homosaurus.org/v3/homoit0000022
related: https://homosaurus.org/v3/homoit0000597

Uniform fetish
type: Concept
issued: 2023-12-18
modified: 2025-02-23
comment: Eroticization of uniforms.
broader: https://homosaurus.org/v3/homoit0003059
change note: Version 3.7.0
has top concept: Eroticism
in scheme: v3
related: https://homosaurus.org/v3/homoit0000217
related: https://homosaurus.org/v3/homoit0000289
related: https://homosaurus.org/v3/homoit0001242
related: https://homosaurus.org/v3/homoit0003064
related: https://homosaurus.org/v3/homoit0003065
related: https://homosaurus.org/v3/homoit0003066
related: https://homosaurus.org/v3/homoit0003067
related: https://homosaurus.org/v3/homoit0003102

Boot fetish
type: Concept
issued: 2023-12-18
modified: 2025-02-23
comment: Eroticization of boots through wearing and incorporating into sexual play.
alternative label: Boot kink
broader: https://homosaurus.org/v3/homoit0001634
broader: https://homosaurus.org/v3/homoit0003102
change note: Version 3.7.0
has top concept: Eroticism
in scheme: v3
related: https://homosaurus.org/v3/homoit0000217
related: https://homosaurus.org/v3/homoit0003063
related: https://homosaurus.org/v3/homoit0003103

Leather fetish
type: Concept
issued: 2023-12-18
modified: 2025-02-23
comment: Eroticization of leather, especially leather garments and accessories associated with the leather and kink communities.
broader: https://homosaurus.org/v3/homoit0000442
change note: Version 3.7.0
has top concept: Eroticism
in scheme: v3
related: https://homosaurus.org/v3/homoit0000217
related: https://homosaurus.org/v3/homoit0000705
related: https://homosaurus.org/v3/homoit0003063

Medical play
type: Concept
issued: 2023-12-18
modified: 2025-02-23
comment: Erotic roleplay and kink activities involving medical tools, settings, uniforms, and procedures.
broader: https://homosaurus.org/v3/homoit0000442
broader: https://homosaurus.org/v3/homoit0001242
change note: Version 3.7.0
has top concept: Eroticism
in scheme: v3
related: https://homosaurus.org/v3/homoit0003063

Mind play
type: Concept
issued: 2023-12-18
modified: 2025-02-23
comment: Psychological games or roleplay performed in order to produce erotic excitement or sexual arousal.
broader: https://homosaurus.org/v3/homoit0000442
change note: Version 3.7.0
has top concept: Eroticism
in scheme: v3
narrower: https://homosaurus.org/v3/homoit0001242
narrower: https://homosaurus.org/v3/homoit0003069
narrower: https://homosaurus.org/v3/homoit0003070
related: https://homosaurus.org/v3/homoit0003052

Humiliation
type: Concept
issued: 2023-12-18
modified: 2025-02-23
comment: Psychological or physical humiliation performed in order to produce erotic excitement or sexual arousal.
alternative label: Erotic humiliation
broader: https://homosaurus.org/v3/homoit0003068
change note: Version 3.7.0
has top concept: Eroticism
in scheme: v3
related: https://homosaurus.org/v3/homoit0003052
related: https://homosaurus.org/v3/homoit0003073
related: https://homosaurus.org/v3/homoit0003851

Erotic hypnosis
type: Concept
issued: 2023-12-18
modified: 2025-02-23
comment: The use of hypnosis in a sexual or erotic context.
alternative label: Mind control
broader: https://homosaurus.org/v3/homoit0003068
change note: Version 3.7.0
has top concept: Eroticism
in scheme: v3
related: https://homosaurus.org/v3/homoit0003052
related: https://homosaurus.org/v3/homoit0003126
related: https://homosaurus.org/v3/homoit0003851

Mummification (Erotic)
type: Concept
issued: 2023-12-18
modified: 2025-02-23
comment: A form of bondage that involves wrapping the body with bandages, plastic wrap, or other materials.
broader: https://homosaurus.org/v3/homoit0000086
change note: Version 3.7.0
has top concept: Eroticism
in scheme: v3
related: https://homosaurus.org/v3/homoit0001238
related: https://homosaurus.org/v3/homoit0003850

Body worship
type: Concept
issued: 2023-12-18
modified: 2025-02-23
comment: Any practice of revering another’s physical body, usually in a sexual context.
broader: https://homosaurus.org/v3/homoit0001299
change note: Version 3.7.0
has top concept: Sexual practices
in scheme: v3
narrower: https://homosaurus.org/v3/homoit0003051
related: https://homosaurus.org/v3/homoit0001654

Orgasm control
type: Concept
issued: 2023-12-18
modified: 2025-02-23
comment: The physical or psychological control of one's own or a partner’s orgasm.
alternative label: Edging
alternative label: Forced orgasm
alternative label: Orgasm denial
broader: https://homosaurus.org/v3/homoit0000442
broader: https://homosaurus.org/v3/homoit0001267
change note: Version 3.7.0
has top concept: Eroticism
in scheme: v3
related: https://homosaurus.org/v3/homoit0001062
related: https://homosaurus.org/v3/homoit0003069
related: https://homosaurus.org/v3/homoit0003074

Chastity play
type: Concept
issued: 2023-12-18
modified: 2025-02-23
comment: Refraining from sexual arousal, orgasm, or sex as an act of submission, method of erotic discipline, or for personal satisfaction.
broader: https://homosaurus.org/v3/homoit0000442
change note: Version 3.7.0
has top concept: Eroticism
in scheme: v3
related: https://homosaurus.org/v3/homoit0003073
related: https://homosaurus.org/v3/homoit0003142

Paddling
type: Concept
issued: 2023-12-18
modified: 2025-02-23
comment: Striking a body with a paddle as a form of impact play.
broader: https://homosaurus.org/v3/homoit0003053
change note: Version 3.7.0
has top concept: Eroticism
in scheme: v3
related: https://homosaurus.org/v3/homoit0000081
related: https://homosaurus.org/v3/homoit0001068

Piercing play
type: Concept
issued: 2023-12-18
modified: 2025-02-23
comment: Temporary piercing of a body, usually for aesthetic, erotic, or sexual purposes.
alternative label: Needle play
alternative label: Play piercing
broader: https://homosaurus.org/v3/homoit0000442
broader: https://homosaurus.org/v3/homoit0001114
change note: Version 3.7.0
has top concept: Eroticism
in scheme: v3
related: https://homosaurus.org/v3/homoit0003078

Blood play
type: Concept
issued: 2023-12-18
modified: 2025-02-23
comment: Use of blood for erotic or sensual pleasure.
broader: https://homosaurus.org/v3/homoit0000442
change note: Version 3.7.0
has top concept: Eroticism
in scheme: v3
related: https://homosaurus.org/v3/homoit0003077
related: https://homosaurus.org/v3/homoit0003085

Play spaces
type: Concept
issued: 2023-12-18
modified: 2025-02-23
comment: A area or room designated for kink and sexual activities.
alternative label: Dungeons
broader: https://homosaurus.org/v3/homoit0000974
change note: Version 3.7.0
has top concept: Sex locations
in scheme: v3
related: https://homosaurus.org/v3/homoit0000087
related: https://homosaurus.org/v3/homoit0000475
related: https://homosaurus.org/v3/homoit0001270
related: https://homosaurus.org/v3/homoit0003080

Leather and kink conventions
type: Concept
issued: 2023-12-18
modified: 2025-02-23
comment: Leather and kink conventions typically take place annually at a hotel, resort, or other venue. They usually include parties, performances, title contests, vendors, play spaces, and classes and workshops on kink, sex, relationships, activism, and related topics.
broader: https://homosaurus.org/v3/homoit0000861
change note: Version 3.7.0
has top concept: LGBTQ+ events
in scheme: v3
related: https://homosaurus.org/v3/homoit0000705
related: https://homosaurus.org/v3/homoit0001272
related: https://homosaurus.org/v3/homoit0003079
related: https://homosaurus.org/v3/homoit0003106

Pony play
type: Concept
issued: 2023-12-18
modified: 2025-02-23
comment: The act of roleplaying as an equine, sometimes with someone acting as a trainer, handler or pet owner, for fun or erotic enjoyment.
broader: https://homosaurus.org/v3/homoit0003082
change note: Version 3.7.0
has top concept: Sex (Act)
in scheme: v3

Animal roleplay
type: Concept
issued: 2023-12-18
modified: 2025-02-23
comment: The act of roleplaying as an animal or animal character, sometimes with someone acting as a trainer, handler or pet owner, for fun or erotic enjoyment.
alternative label: Pet play
broader: https://homosaurus.org/v3/homoit0001242
change note: Version 3.7.0
has top concept: Sex (Act)
in scheme: v3
narrower: https://homosaurus.org/v3/homoit0003081
narrower: https://homosaurus.org/v3/homoit0003083
related: https://homosaurus.org/v3/homoit0000442
related: https://homosaurus.org/v3/homoit0002165
related: https://homosaurus.org/v3/homoit0003123
related: https://homosaurus.org/v3/homoit0003851

Pup play
type: Concept
issued: 2023-12-18
modified: 2025-02-23
comment: The act of roleplaying as a canine, sometimes with someone acting as a trainer, handler or pet owner, for fun or erotic enjoyment.
alternative label: Leatherpups
broader: https://homosaurus.org/v3/homoit0000705
broader: https://homosaurus.org/v3/homoit0003082
broader: https://homosaurus.org/v3/homoit0003086
change note: Version 3.7.0
has top concept: LGBTQ+ communities
in scheme: v3
related: https://homosaurus.org/v3/homoit0001145
related: https://homosaurus.org/v3/homoit0003112
related: https://homosaurus.org/v3/homoit0003178

Kinky people
type: Concept
issued: 2023-12-18
modified: 2025-02-23
comment: People who participate in kink and/or power exchange relationships.
alternative label: BDSMers
alternative label: Fetishists
alternative label: Kinksters
alternative label: Sadomasochists
broader: https://homosaurus.org/v3/homoit0001295
broader: https://homosaurus.org/v3/homoit0001297
change note: Version 3.7.0
has top concept: Sexual identity
in scheme: v3
narrower: https://homosaurus.org/v3/homoit0000363
narrower: https://homosaurus.org/v3/homoit0000999
narrower: https://homosaurus.org/v3/homoit0001318
related: https://homosaurus.org/v3/homoit0000036
related: https://homosaurus.org/v3/homoit0000103
related: https://homosaurus.org/v3/homoit0000219
related: https://homosaurus.org/v3/homoit0000442
related: https://homosaurus.org/v3/homoit0000705
related: https://homosaurus.org/v3/homoit0001376
related: https://homosaurus.org/v3/homoit0003052
related: https://homosaurus.org/v3/homoit0003086
related: https://homosaurus.org/v3/homoit0003140

Knife play
type: Concept
issued: 2023-12-18
modified: 2025-02-23
comment: The use of knives or blades during kink or erotic play.
alternative label: Cutting
broader: https://homosaurus.org/v3/homoit0000442
change note: Version 3.7.0
has top concept: Eroticism
in scheme: v3
related: https://homosaurus.org/v3/homoit0003078

Leather people
type: Concept
issued: 2023-12-18
modified: 2025-02-23
comment: People who participate in or identify with leather communities.
broader: https://homosaurus.org/v3/homoit0000705
change note: Version 3.7.0
has top concept: LGBTQ+ communities
in scheme: v3
narrower: https://homosaurus.org/v3/homoit0000706
narrower: https://homosaurus.org/v3/homoit0000707
narrower: https://homosaurus.org/v3/homoit0000708
narrower: https://homosaurus.org/v3/homoit0000709
narrower: https://homosaurus.org/v3/homoit0000710
narrower: https://homosaurus.org/v3/homoit0003083
narrower: https://homosaurus.org/v3/homoit0003087
narrower: https://homosaurus.org/v3/homoit0003088
narrower: https://homosaurus.org/v3/homoit0003105
related: https://homosaurus.org/v3/homoit0001145
related: https://homosaurus.org/v3/homoit0003084

Leatherboys
type: Concept
issued: 2023-12-18
modified: 2025-02-23
comment: People who participate in leather communities and identify as leatherboy.
broader: https://homosaurus.org/v3/homoit0000705
broader: https://homosaurus.org/v3/homoit0003086
change note: Version 3.7.0
has top concept: LGBTQ+ communities
in scheme: v3
related: https://homosaurus.org/v3/homoit0000706
related: https://homosaurus.org/v3/homoit0000707
related: https://homosaurus.org/v3/homoit0000708
related: https://homosaurus.org/v3/homoit0000709
related: https://homosaurus.org/v3/homoit0000710
related: https://homosaurus.org/v3/homoit0003088

Leathergirls
type: Concept
issued: 2023-12-18
modified: 2025-02-23
comment: People who participate in leather communities and identify as leathergirls.
broader: https://homosaurus.org/v3/homoit0000705
broader: https://homosaurus.org/v3/homoit0003086
change note: Version 3.7.0
has top concept: LGBTQ+ communities
in scheme: v3
related: https://homosaurus.org/v3/homoit0000706
related: https://homosaurus.org/v3/homoit0000707
related: https://homosaurus.org/v3/homoit0000708
related: https://homosaurus.org/v3/homoit0000709
related: https://homosaurus.org/v3/homoit0000710
related: https://homosaurus.org/v3/homoit0003087

Rope bondage
type: Concept
issued: 2023-12-18
modified: 2025-02-23
comment: Use of rope to tie and restrain the body for sensual or erotic play.
alternative label: Japanese rope bondage
alternative label: Kinbaku
alternative label: Shibari
broader: https://homosaurus.org/v3/homoit0000086
change note: Version 3.7.0
has top concept: Eroticism
in scheme: v3
related: https://homosaurus.org/v3/homoit0001238
related: https://homosaurus.org/v3/homoit0001242

Gags
type: Concept
issued: 2023-12-18
modified: 2025-02-23
comment: An item or device used to prevent speech, usually by blocking or filling the mouth. Often used in some forms of bondage play.
alternative label: Ball gags
broader: https://homosaurus.org/v3/homoit0003059
change note: Version 3.7.0
has top concept: Eroticism
in scheme: v3
related: https://homosaurus.org/v3/homoit0000086
related: https://homosaurus.org/v3/homoit0001238
related: https://homosaurus.org/v3/homoit0003112
related: https://homosaurus.org/v3/homoit0003146

Lateral lesbophobia
type: Concept
issued: 2023-12-18
modified: 2025-02-23
comment: The phenomenon in which lesbians displace violence or oppression onto other lesbians, often by acting on internalized lesbophobic beliefs (i.e., negative perceptions of and intolerance toward lesbians and lesbianism) adopted as a result of being raised or socialized within a lesbophobic environment or culture.
broader: https://homosaurus.org/v3/homoit0002591
broader: https://homosaurus.org/v3/homoit0003091
change note: Version 3.7.0
has top concept: LGBTQ+ phobia
in scheme: v3

Lateral homophobia
type: Concept
issued: 2023-12-18
modified: 2025-02-23
comment: This term is often used to describe lateral homophobia carried out by LGBTQ+ people in general. Lateral homophobia refers to the phenomenon in which gay men displace violence or oppression onto other gay men, often by acting on internalized homophobic beliefs (i.e., negative perceptions of and intolerance toward gay men and homosexuality) adopted as a result of being raised or socialized within a homophobic environment or culture.
broader: https://homosaurus.org/v3/homoit0000391
broader: https://homosaurus.org/v3/homoit0003091
change note: Version 3.7.0
has top concept: LGBTQ+ phobia
in scheme: v3

Lateral biphobia
type: Concept
issued: 2023-12-18
modified: 2025-02-23
comment: The phenomenon in which bisexual people displace violence or oppression onto other bisexual people, often by acting on internalized biphobic beliefs (i.e., negative perceptions of and intolerance toward bisexual people and bisexuality) adopted as a result of being raised or socialized within a biphobic environment or culture.
broader: https://homosaurus.org/v3/homoit0002592
broader: https://homosaurus.org/v3/homoit0003091
change note: Version 3.7.0
has top concept: LGBTQ+ phobia
in scheme: v3

Lateral transphobia
type: Concept
issued: 2023-12-18
modified: 2025-02-23
comment: The phenomenon in which transgender people displace violence or oppression onto other transgender people, often by acting on internalized transphobic beliefs (i.e., negative perceptions of and intolerance toward transgender people and trans identities) adopted as a result of being raised or socialized within transphobic environment or culture.
broader: https://homosaurus.org/v3/homoit0002593
broader: https://homosaurus.org/v3/homoit0003091
change note: Version 3.7.0
has top concept: LGBTQ+ phobia
in scheme: v3

Lateral queerphobia
type: Concept
issued: 2023-12-18
modified: 2025-02-23
comment: The phenomenon in which queer people displace violence or oppression onto other queer people, often by acting on internalized queerphobic beliefs (i.e., negative perceptions of and intolerance toward queer people and queer identity) adopted as a result of being raised or socialized within a queerphobic environment or culture.
broader: https://homosaurus.org/v3/homoit0002594
broader: https://homosaurus.org/v3/homoit0003091
change note: Version 3.7.0
has top concept: LGBTQ+ phobia
in scheme: v3

Lateral intersexphobia
type: Concept
issued: 2023-12-18
modified: 2025-02-23
comment: The phenomenon in which intersex people displace violence or oppression onto other intersex people, often by acting on internalized intersexphobic beliefs (i.e., negative perceptions of and intolerance toward intersex people and intersex variations) adopted as a result of being raised or socialized within a intersexphobic environment or culture.
alternative label: Lateral interphobia
broader: https://homosaurus.org/v3/homoit0002595
broader: https://homosaurus.org/v3/homoit0003091
change note: Version 3.7.0
has top concept: LGBTQ+ phobia
in scheme: v3

Balloon kink
type: Concept
issued: 2023-12-18
modified: 2025-02-23
comment: The use of balloons for fashion, sexual arousal or erotic play.
alternative label: Looner
broader: https://homosaurus.org/v3/homoit0000442
change note: Version 3.7.0
has top concept: Eroticism
in scheme: v3
related: https://homosaurus.org/v3/homoit0001247
related: https://homosaurus.org/v3/homoit0003099

Inflation (Erotic)
type: Concept
issued: 2023-12-18
modified: 2025-02-23
comment: Inflation of the body, parts of the body, clothing, or inflatable objects with air or other substances for sexual arousal or erotic play.
alternative label: Inflatables
broader: https://homosaurus.org/v3/homoit0000442
change note: Version 3.7.0
has top concept: Eroticism
in scheme: v3
related: https://homosaurus.org/v3/homoit0000213
related: https://homosaurus.org/v3/homoit0001246
related: https://homosaurus.org/v3/homoit0003098

Jockstraps
type: Concept
issued: 2023-12-18
modified: 2025-02-23
comment: An article of clothing with a pouch to support the genitalia, typically worn by athletes, or for aesthetic or sexual gratification.
broader: https://homosaurus.org/v3/homoit0001266
broader: https://homosaurus.org/v3/homoit0003066
change note: Version 3.7.0
has top concept: Sex accessories
in scheme: v3
related: https://homosaurus.org/v3/homoit0003059

Sex-positive feminism
type: Concept
issued: 2023-12-20
modified: 2025-02-23
comment: A broad feminist movement, usually compared against the anti-sex or anti-pornography feminist movement, that supports sexual liberation, sex workers, pornography, and freedom of sexual and gender expression.
alternative label: Sex-positive movement
broader: https://homosaurus.org/v3/homoit0000437
change note: Version 3.7.0
has top concept: Feminism
in scheme: v3
related: https://homosaurus.org/v3/homoit0001319
related: https://homosaurus.org/v3/homoit0003121

Shoe fetish
type: Concept
issued: 2023-12-20
modified: 2025-02-23
comment: Eroticization of shoes such as high heels and boots.
alternative label: Shoe kink
broader: https://homosaurus.org/v3/homoit0000442
change note: Version 3.7.0
has top concept: Eroticism
in scheme: v3
narrower: https://homosaurus.org/v3/homoit0003064
narrower: https://homosaurus.org/v3/homoit0003103
related: https://homosaurus.org/v3/homoit0000217
related: https://homosaurus.org/v3/homoit0003063
related: https://homosaurus.org/v3/homoit0003122

High heel fetish
type: Concept
issued: 2023-12-20
modified: 2025-02-23
comment: Eroticization of shoes with high heels.
broader: https://homosaurus.org/v3/homoit0003102
change note: Version 3.7.0
has top concept: Eroticism
in scheme: v3
related: https://homosaurus.org/v3/homoit0003064

Leather and kink clubs
type: Concept
issued: 2023-12-20
modified: 2025-02-23
comment: Social clubs and other types of membership organizations in the leather, kink, and related communities.
alternative label: Kink clubs
alternative label: SM clubs
broader: https://homosaurus.org/v3/homoit0000836
change note: Version 3.7.0
has top concept: LGBTQ+ clubs and organizations
in scheme: v3
related: https://homosaurus.org/v3/homoit0000385
related: https://homosaurus.org/v3/homoit0000705
related: https://homosaurus.org/v3/homoit0000906

Bootblacks
type: Concept
issued: 2023-12-20
modified: 2025-02-23
comment: In the leather and kink communities, an individual who cleans and conditions someone’s leather boots, shoes or garments.
broader: https://homosaurus.org/v3/homoit0003086
change note: Version 3.7.0
has top concept: LGBTQ+ communities
in scheme: v3
related: https://homosaurus.org/v3/homoit0000217

Title contests
type: Concept
issued: 2023-12-20
modified: 2025-02-23
comment: An annual event in leather and kink communities where contestants compete for a title. Contestants are judged on qualities including their stage presence, appearance, charisma, and ability to be a leader and activist in the community for the length of their title year.
alternative label: Leather contests
alternative label: Leather pageants
alternative label: Titleholders
broader: https://homosaurus.org/v3/homoit0000818
broader: https://homosaurus.org/v3/homoit0000861
change note: Version 3.7.0
has top concept: LGBTQ+ awards
in scheme: v3
related: https://homosaurus.org/v3/homoit0000705
related: https://homosaurus.org/v3/homoit0003080

Sex swings
type: Concept
issued: 2023-12-20
modified: 2025-02-23
comment: A type of reclining seat suspended from a stand or ceiling, typically used to position the body for sexual activity.
alternative label: Sex slings
alternative label: Slings
alternative label: Swings
broader: https://homosaurus.org/v3/homoit0001266
change note: Version 3.7.0
has top concept: Sex accessories
in scheme: v3
related: https://homosaurus.org/v3/homoit0000076
related: https://homosaurus.org/v3/homoit0000445
related: https://homosaurus.org/v3/homoit0000459
related: https://homosaurus.org/v3/homoit0003059

Spitting (Sex)
type: Concept
issued: 2023-12-20
modified: 2025-02-23
comment: Expelling spit, usually onto a person’s body or into their mouth.
broader: https://homosaurus.org/v3/homoit0003061
change note: Version 3.7.0
has top concept: Body fluids
in scheme: v3
related: https://homosaurus.org/v3/homoit0000442

Sounding (Sex)
type: Concept
issued: 2023-12-20
modified: 2025-02-23
comment: Insertion of rods into the urethra, usually for erotic stimulation.
broader: https://homosaurus.org/v3/homoit0000442
change note: Version 3.7.0
has top concept: Eroticism
in scheme: v3
related: https://homosaurus.org/v3/homoit0003057
related: https://homosaurus.org/v3/homoit0003110

Genital torture
type: Concept
issued: 2023-12-20
modified: 2025-02-23
comment: A kink activity involving application of pain, intense sensation, or constriction to the genitals.
alternative label: CBT
alternative label: Cock and ball torture
alternative label: Pussy torture
broader: https://homosaurus.org/v3/homoit0000036
change note: Version 3.7.0
has top concept: Eroticism
in scheme: v3
related: https://homosaurus.org/v3/homoit0000585
related: https://homosaurus.org/v3/homoit0003109

Gloves (Erotic)
type: Concept
issued: 2023-12-20
modified: 2025-02-23
comment: A garment covering the hand and used in kink or erotic play.
broader: https://homosaurus.org/v3/homoit0001266
broader: https://homosaurus.org/v3/homoit0003066
change note: Version 3.7.0
has top concept: Sex accessories
in scheme: v3
narrower: https://homosaurus.org/v3/homoit0000700
related: https://homosaurus.org/v3/homoit0003053

Gas masks (Erotic)
type: Concept
issued: 2023-12-20
modified: 2025-02-23
comment: A mask traditionally used to protect the wearer from inhaling airborne pollutants and toxic gases and used in kink or erotic play.
broader: https://homosaurus.org/v3/homoit0001266
broader: https://homosaurus.org/v3/homoit0003066
broader: https://homosaurus.org/v3/homoit0003178
change note: Version 3.7.0
has top concept: Sex accessories
in scheme: v3
related: https://homosaurus.org/v3/homoit0003083
related: https://homosaurus.org/v3/homoit0003090
related: https://homosaurus.org/v3/homoit0003113
related: https://homosaurus.org/v3/homoit0003146

Breath control
type: Concept
issued: 2023-12-20
modified: 2025-02-23
comment: Controlling or restricting the ability to breathe in order to achieve heightened pleasure or stimulation.
alternative label: Breath control play
alternative label: Breath play
alternative label: Breathplay
alternative label: Suffocation
broader: https://homosaurus.org/v3/homoit0001299
change note: Version 3.7.0
has top concept: Sexual practices
in scheme: v3
narrower: https://homosaurus.org/v3/homoit0000075
related: https://homosaurus.org/v3/homoit0000307
related: https://homosaurus.org/v3/homoit0000442
related: https://homosaurus.org/v3/homoit0003112

Squirting
type: Concept
issued: 2023-12-20
modified: 2025-02-23
comment: Expulsion of fluid from the urethra during orgasm. Not commonly used for penile ejaculation.
alternative label: Cervical mucus
alternative label: Fejac
alternative label: Female ejaculation
alternative label: Gush
alternative label: Squirt
broader: https://homosaurus.org/v3/homoit0003061
change note: Version 3.7.0
has top concept: Body fluids
in scheme: v3
related: https://homosaurus.org/v3/homoit0001062

Straitjacket
type: Concept
issued: 2023-12-20
modified: 2025-02-23
comment: A type of jacket used to restrain the upper body.
alternative label: Strait-jacket
broader: https://homosaurus.org/v3/homoit0001238
change note: Version 3.7.0
has top concept: Sex accessories
in scheme: v3

Tickling
type: Concept
issued: 2023-12-20
modified: 2025-02-23
comment: Tickling is the act of touching a part of a body in a way that causes involuntary twitching movements and/or laughter.
alternative label: Knismolagnia
alternative label: Knismophilia
alternative label: Tickle torture
broader: https://homosaurus.org/v3/homoit0000442
change note: Version 3.7.0
has top concept: Eroticism
in scheme: v3
related: https://homosaurus.org/v3/homoit0000036

Cuffs
type: Concept
issued: 2023-12-20
modified: 2025-02-23
comment: Any of various restraint devices designed to secure an individual’s wrists or ankles in bondage play.
alternative label: Cuff restraints
broader: https://homosaurus.org/v3/homoit0001238
broader: https://homosaurus.org/v3/homoit0003066
change note: Version 3.7.0
has top concept: Sex accessories
in scheme: v3
narrower: https://homosaurus.org/v3/homoit0000608
related: https://homosaurus.org/v3/homoit0000086
related: https://homosaurus.org/v3/homoit0001337
related: https://homosaurus.org/v3/homoit0003145

Chest
type: Concept
issued: 2023-12-20
modified: 2025-02-23
comment: A gender-inclusive term for the upper area of the torso, can be used if the person has breasts or not.
broader: https://homosaurus.org/v3/homoit0000401
change note: Version 3.7.0
has top concept: Erogenous body parts
in scheme: v3
related: https://homosaurus.org/v3/homoit0000114
related: https://homosaurus.org/v3/homoit0000222
related: https://homosaurus.org/v3/homoit0001621
related: https://homosaurus.org/v3/homoit0001841
related: https://homosaurus.org/v3/homoit0003132
related: https://homosaurus.org/v3/homoit0003133

Caning
type: Concept
issued: 2023-12-20
modified: 2025-02-23
comment: Striking the body with a cane as a form of impact play.
broader: https://homosaurus.org/v3/homoit0003053
change note: Version 3.7.0
has top concept: Eroticism
in scheme: v3

Flogging
type: Concept
issued: 2023-12-20
modified: 2025-02-23
comment: Consensual impact play using a flogger, i.e. a multi-tailed whip, usually made of leather.
broader: https://homosaurus.org/v3/homoit0003053
change note: Version 3.7.0
has top concept: Eroticism
in scheme: v3
related: https://homosaurus.org/v3/homoit0003048

Feminist Sex Wars
type: Concept
issued: 2023-12-20
modified: 2025-02-23
comment: A period of debates beginning in the 1970s between different schools and factions of feminist thought concerning sexual freedom, sex work, pornography, kink and sadomasochism, sex toys, butch/femme, and trans identities.
alternative label: Porn wars
alternative label: Sex wars
broader: https://homosaurus.org/v3/homoit0000437
change note: Version 3.7.0
has top concept: Feminism
in scheme: v3
related: https://homosaurus.org/v3/homoit0003101

Foot fetish
type: Concept
issued: 2023-12-20
modified: 2025-02-23
comment: Eroticization of the feet.
alternative label: Aretifism
alternative label: Foot fetishism
alternative label: Foot kink
alternative label: Foot partialism
alternative label: Podophilia
alternative label: Retifitism
broader: https://homosaurus.org/v3/homoit0000442
change note: Version 3.7.0
has top concept: Eroticism
in scheme: v3
related: https://homosaurus.org/v3/homoit0000217
related: https://homosaurus.org/v3/homoit0003102

Furry culture
type: Concept
issued: 2023-12-20
modified: 2025-02-23
comment: Use to describe cultural experiences shared by members of furry communities or products of furry culture (e.g., art and media created by and for furries, activism focused on furry issues, slang commonly used in furry communities, etc.).
broader: https://homosaurus.org/v3/homoit0001345
change note: Version 3.7.0
has top concept: Subcultures
in scheme: v3
related: https://homosaurus.org/v3/homoit0002165
related: https://homosaurus.org/v3/homoit0003082

Douching
type: Concept
issued: 2023-12-20
modified: 2025-02-23
comment: The use of a device (called a douche or enema) to introduce a stream of liquid into either the rectum or vagina. Can be used for sexual or erotic purposes.
broader: https://homosaurus.org/v3/homoit0000442
broader: https://homosaurus.org/v3/homoit0001267
broader: https://homosaurus.org/v3/homoit0001299
change note: Version 3.7.0
has top concept: Eroticism
in scheme: v3
related: https://homosaurus.org/v3/homoit0000043
related: https://homosaurus.org/v3/homoit0000076
related: https://homosaurus.org/v3/homoit0000081
related: https://homosaurus.org/v3/homoit0000293

Edge play
type: Concept
issued: 2023-12-20
modified: 2025-02-23
comment: BDSM activities and kinks that are considered to have an increased level of risk or taboo, or which are challenging to the participants for subjective reasons, for example due to a personal fear or boundary.
alternative label: Edgeplay
alternative label: Taboo play
broader: https://homosaurus.org/v3/homoit0000442
change note: Version 3.7.0
has top concept: Eroticism
in scheme: v3
related: https://homosaurus.org/v3/homoit0001242

Cum shot
type: Concept
issued: 2023-12-20
modified: 2025-02-23
comment: The depiction of ejaculation, especially onto another person, especially in the context of pornography.
alternative label: Cash shot
alternative label: Money shot
broader: https://homosaurus.org/v3/homoit0001299
change note: Version 3.7.0
has top concept: Sexual practices
in scheme: v3
related: https://homosaurus.org/v3/homoit0000323
related: https://homosaurus.org/v3/homoit0001062
related: https://homosaurus.org/v3/homoit0001128
related: https://homosaurus.org/v3/homoit0003128

Bukkake
type: Concept
issued: 2023-12-20
modified: 2025-02-23
comment: A sexual act involving multiple people ejaculating on one person, typically on the face.
broader: https://homosaurus.org/v3/homoit0000603
change note: Version 3.7.0
has top concept: Sexual practices
in scheme: v3
related: https://homosaurus.org/v3/homoit0000323
related: https://homosaurus.org/v3/homoit0000683
related: https://homosaurus.org/v3/homoit0001128
related: https://homosaurus.org/v3/homoit0003127

Bugchasing
type: Concept
issued: 2023-12-20
modified: 2025-02-23
comment: The act or fantasy of engaging in sex with the intent to contract HIV/AIDS.
broader: https://homosaurus.org/v3/homoit0001239
change note: Version 3.7.0
has top concept: Risk behaviors
in scheme: v3
related: https://homosaurus.org/v3/homoit0000005
related: https://homosaurus.org/v3/homoit0000099
related: https://homosaurus.org/v3/homoit0000442

Breast torture
type: Concept
issued: 2023-12-20
modified: 2025-02-23
comment: A kink activity where intense sensation, pain, or constriction is applied to the breasts.
alternative label: Boob torture
alternative label: Tit torture
broader: https://homosaurus.org/v3/homoit0000036
broader: https://homosaurus.org/v3/homoit0003132
change note: Version 3.7.0
has top concept: Eroticism
in scheme: v3
related: https://homosaurus.org/v3/homoit0000222
related: https://homosaurus.org/v3/homoit0001046
related: https://homosaurus.org/v3/homoit0001621

Nipple torture
type: Concept
issued: 2023-12-20
modified: 2025-02-23
comment: A kink activity where intense sensation, pain, or constriction is applied to the nipples.
alternative label: Nip torture
broader: https://homosaurus.org/v3/homoit0000036
broader: https://homosaurus.org/v3/homoit0001046
change note: Version 3.7.0
has top concept: Eroticism
in scheme: v3
related: https://homosaurus.org/v3/homoit0001984
related: https://homosaurus.org/v3/homoit0003132

Breast play
type: Concept
issued: 2023-12-20
modified: 2025-02-23
comment: Any sexual activity involving the breasts, including fondling/groping, kissing, licking, rubbing, pinching, or squeezing/constricting.
broader: https://homosaurus.org/v3/homoit0001267
broader: https://homosaurus.org/v3/homoit0001299
change note: Version 3.7.0
has top concept: Sex (Act)
in scheme: v3
narrower: https://homosaurus.org/v3/homoit0001046
narrower: https://homosaurus.org/v3/homoit0003130
related: https://homosaurus.org/v3/homoit0000222
related: https://homosaurus.org/v3/homoit0001621
related: https://homosaurus.org/v3/homoit0003118
related: https://homosaurus.org/v3/homoit0003131
related: https://homosaurus.org/v3/homoit0003133

Chest play
type: Concept
issued: 2023-12-20
modified: 2025-02-23
comment: A gender-inclusive term for any sexual activity involving the the upper area of the torso, including fondling/groping, kissing, licking, rubbing, pinching, or squeezing/constricting.
broader: https://homosaurus.org/v3/homoit0001267
broader: https://homosaurus.org/v3/homoit0001299
change note: Version 3.7.0
has top concept: Sex (Act)
in scheme: v3
narrower: https://homosaurus.org/v3/homoit0001046
related: https://homosaurus.org/v3/homoit0000222
related: https://homosaurus.org/v3/homoit0003118
related: https://homosaurus.org/v3/homoit0003132

Body bags (Erotic)
type: Concept
issued: 2023-12-20
modified: 2025-02-23
comment: A body encasing or bag, often leather, used for sensory deprivation or during kink or sexual play.
broader: https://homosaurus.org/v3/homoit0001266
broader: https://homosaurus.org/v3/homoit0003059
change note: Version 3.7.0
has top concept: Sex accessories
in scheme: v3
related: https://homosaurus.org/v3/homoit0000086
related: https://homosaurus.org/v3/homoit0003850

Ashing
type: Concept
issued: 2023-12-20
modified: 2025-02-23
comment: Applying cigar or cigarette ash to someone's mouth or body.
alternative label: Ash play
broader: https://homosaurus.org/v3/homoit0003136
change note: Version 3.7.0
has top concept: Eroticism
in scheme: v3

Cigar play
type: Concept
issued: 2023-12-20
modified: 2025-02-23
comment: A form of temperature play that involves using cigars, usually applied to the skin.
broader: https://homosaurus.org/v3/homoit0003054
change note: Version 3.7.0
has top concept: Eroticism
in scheme: v3
narrower: https://homosaurus.org/v3/homoit0003135
related: https://homosaurus.org/v3/homoit0003055

Armpits
type: Concept
issued: 2023-12-20
modified: 2025-02-23
comment: The hollow area underneath the upper arm where the shoulder connects, known to be ticklish and/or sexually stimulative.
alternative label: Axilla
broader: https://homosaurus.org/v3/homoit0000401
change note: Version 3.7.0
has top concept: Erogenous body parts
in scheme: v3

Abduction play
type: Concept
issued: 2023-12-20
modified: 2025-02-23
comment: A type of consensual BDSM play involving the mock capture, bondage, struggle, and intimidation of one or more sexual partners.
alternative label: Consensual kidnapping
broader: https://homosaurus.org/v3/homoit0000442
change note: Version 3.7.0
has top concept: Eroticism
in scheme: v3
related: https://homosaurus.org/v3/homoit0001242
related: https://homosaurus.org/v3/homoit0003139

Consent play
type: Concept
issued: 2023-12-20
modified: 2025-02-23
comment: A type of consensual play involving mock coercion, intimidation, force, or struggle of one or more partners.
alternative label: CNC
alternative label: Consensual nonconsent
alternative label: Rape play
broader: https://homosaurus.org/v3/homoit0000442
change note: Version 3.7.0
has top concept: Eroticism
in scheme: v3
related: https://homosaurus.org/v3/homoit0001242
related: https://homosaurus.org/v3/homoit0003052
related: https://homosaurus.org/v3/homoit0003138

Anti-sadomasochism
type: Concept
issued: 2023-12-20
modified: 2025-02-23
comment: Opposition to various practices or fantasies involving sadomasochism or power exchange.
alternative label: Antisadomasochism
broader: https://homosaurus.org/v3/homoit0003140
change note: Version 3.7.0
has top concept: Anti-kink discrimination
in scheme: v3
related: https://homosaurus.org/v3/homoit0000036

Chastity devices
type: Concept
issued: 2023-12-20
modified: 2025-02-23
comment: Accessories or devices used to restrict or confine the genitalia.
alternative label: Chastity belt
alternative label: Cock cage
broader: https://homosaurus.org/v3/homoit0003059
change note: Version 3.7.0
has top concept: Eroticism
in scheme: v3
related: https://homosaurus.org/v3/homoit0003074

Clamps (Erotic)
type: Concept
issued: 2023-12-20
modified: 2025-02-23
comment: A device designed to hold something firmly together or to otherwise fasten down on something (such as the nipples) for the purposes of gratification.
alternative label: Clamp devices
broader: https://homosaurus.org/v3/homoit0001266
change note: Version 3.7.0
has top concept: Sex accessories
in scheme: v3
narrower: https://homosaurus.org/v3/homoit0001045
narrower: https://homosaurus.org/v3/homoit0003144

Clothespins (Erotic)
type: Concept
issued: 2023-12-20
modified: 2025-02-23
comment: A fastener usually used to hang up clothes for drying, here used as a sex toy.
alternative label: Clothes pegs
broader: https://homosaurus.org/v3/homoit0001266
broader: https://homosaurus.org/v3/homoit0003143
change note: Version 3.7.0
has top concept: Sex accessories
in scheme: v3

Hogtie
type: Concept
issued: 2024-01-02
modified: 2025-02-23
comment: The position or activity of tying a person’s wrists and ankles together behind their back.
alternative label: Hogtie restraining
broader: https://homosaurus.org/v3/homoit0000086
change note: Version 3.7.0
has top concept: Eroticism
in scheme: v3
related: https://homosaurus.org/v3/homoit0001238
related: https://homosaurus.org/v3/homoit0003117

Hoods (Erotic)
type: Concept
issued: 2024-01-02
modified: 2025-02-23
comment: A hood used as a head covering or restraint, for kink, erotic play or fashion.
alternative label: Bondage hoods
broader: https://homosaurus.org/v3/homoit0001266
broader: https://homosaurus.org/v3/homoit0003066
change note: Version 3.7.0
has top concept: Sex accessories
in scheme: v3
related: https://homosaurus.org/v3/homoit0000086
related: https://homosaurus.org/v3/homoit0000209
related: https://homosaurus.org/v3/homoit0003090
related: https://homosaurus.org/v3/homoit0003112
related: https://homosaurus.org/v3/homoit0003850

Discipline
type: Concept
issued: 2024-01-02
modified: 2025-02-23
comment: A variety of practices where someone in a dominant role sets rules for someone in a submissive role that they are expected to obey and the dominant administers punishments, corrections, or rewards.
broader: https://homosaurus.org/v3/homoit0000442
broader: https://homosaurus.org/v3/homoit0001267
broader: https://homosaurus.org/v3/homoit0001299
change note: Version 3.7.0
has top concept: Eroticism
in scheme: v3
related: https://homosaurus.org/v3/homoit0003052

Intersex zines
type: Concept
issued: 2024-01-02
modified: 2025-02-23
comment: Independent, small-circulation publications usually reproduced via photocopier; use for zines created by intersex people and/or focusing on intersex identity, issues, or culture.
broader: https://homosaurus.org/v3/homoit0000965
broader: https://homosaurus.org/v3/homoit0002936
change note: Version 3.7.0
has top concept: LGBTQ+ press
in scheme: v3

Transgender zines
type: Concept
issued: 2024-01-02
modified: 2025-02-23
comment: Independent, small-circulation publications usually reproduced via photocopier; use for zines created by trans people and/or focusing on trans identities, issues, or culture.
alternative label: Trans zines
broader: https://homosaurus.org/v3/homoit0000965
broader: https://homosaurus.org/v3/homoit0001436
change note: Version 3.7.0
has top concept: LGBTQ+ press
in scheme: v3

Aromantic zines
type: Concept
issued: 2024-01-02
modified: 2025-02-23
comment: Independent, small-circulation publications usually reproduced via photocopier; use for zines created by aromantic people and/or focusing on aromantic identity, issues, or culture.
broader: https://homosaurus.org/v3/homoit0000965
change note: Version 3.7.0
has top concept: LGBTQ+ press
in scheme: v3

Asexual zines
type: Concept
issued: 2024-01-02
modified: 2025-02-23
comment: Independent, small-circulation publications usually reproduced via photocopier; use for zines created by asexual people and/or focusing on asexual identity, issues, or culture.
broader: https://homosaurus.org/v3/homoit0000965
broader: https://homosaurus.org/v3/homoit0002804
change note: Version 3.7.0
has top concept: LGBTQ+ press
in scheme: v3

Non-binary zines
type: Concept
issued: 2024-01-02
modified: 2025-02-23
comment: Independent, small-circulation publications usually reproduced via photocopier; use for zines created by non-binary people and/or focusing on non-binary identities, issues, or culture.
alternative label: Nonbinary zines
broader: https://homosaurus.org/v3/homoit0000965
change note: Version 3.7.0
has top concept: LGBTQ+ press
in scheme: v3

Two-Spirit zines
type: Concept
issued: 2024-01-02
modified: 2025-02-23
comment: Independent, small-circulation publications usually reproduced via photocopier; use for zines created by Two-Spirit people and/or focusing on Two-Spirit identities, issues, or culture.
alternative label: 2S zines
alternative label: Two Spirit zines
alternative label: Two Spirited zines
alternative label: Two-Spirited zines
broader: https://homosaurus.org/v3/homoit0002719
change note: Version 3.7.0
has top concept: Two-Spirit press
in scheme: v3
related: https://homosaurus.org/v3/homoit0000965

Queer zines
type: Concept
issued: 2024-01-02
modified: 2025-02-23
comment: Independent, small-circulation publications usually reproduced via photocopier; use for zines created by queer people and/or focusing on queer identity, issues, or cultures.
broader: https://homosaurus.org/v3/homoit0000965
broader: https://homosaurus.org/v3/homoit0001200
change note: Version 3.7.0
has top concept: LGBTQ+ press
in scheme: v3

Lesbian zines
type: Concept
issued: 2024-01-02
modified: 2025-02-23
comment: Independent, small-circulation publications usually reproduced via photocopier; use for zines created by lesbians and/or focusing on lesbian identity, issues, or culture.
broader: https://homosaurus.org/v3/homoit0000766
broader: https://homosaurus.org/v3/homoit0000965
change note: Version 3.7.0
has top concept: LGBTQ+ press
in scheme: v3

Gay zines
type: Concept
issued: 2024-01-02
modified: 2025-02-23
comment: Independent, small-circulation publications usually reproduced via photocopier; use for zines created by gay people and/or focusing on gay identity, issues, or culture.
broader: https://homosaurus.org/v3/homoit0000521
broader: https://homosaurus.org/v3/homoit0000965
change note: Version 3.7.0
has top concept: LGBTQ+ press
in scheme: v3

Trans-exclusionary radical feminism
type: Concept
issued: 2024-01-02
modified: 2025-02-23
comment: A transphobic and transantagonistic ideology that rejects trans and gender diverse identities and rights, and believes that recognition of these identities and rights constitutes discrimination and oppression towards cisgender women. Though originally considered a fringe offshoot of feminism, trans-exclusionary radical feminist groups have formed alliances with right-wing, far-right extremists, and anti-feminist organizations in order to spread misinformation and further anti-trans sentiment and legislation.
alternative label: Gender critical feminism
alternative label: TERF ideology
alternative label: Trans-exclusionary feminism
broader: https://homosaurus.org/v3/homoit0000115
broader: https://homosaurus.org/v3/homoit0000565
broader: https://homosaurus.org/v3/homoit0001467
broader: https://homosaurus.org/v3/homoit0001892
change note: Version 3.7.0
has top concept: Theories
in scheme: v3
related: https://homosaurus.org/v3/homoit0000062
related: https://homosaurus.org/v3/homoit0000437
related: https://homosaurus.org/v3/homoit0001260
related: https://homosaurus.org/v3/homoit0001885
related: https://homosaurus.org/v3/homoit0003157
related: https://homosaurus.org/v3/homoit0003737

LGBTQ+ country music
type: Concept
issued: 2024-01-09
modified: 2025-02-23
comment: Music expressing a LGBTQ+ sensibility, produced within the larger country genre since the 1930s.
broader: https://homosaurus.org/v3/homoit0003610
change note: Version 3.7.0
has top concept: Subcultures
in scheme: v3

Drag in film
type: Concept
issued: 2024-01-09
modified: 2025-02-23
comment: Films with significant characters who appear in drag. Not to be confused with films where a principal actor plays a character who identifies as a gender other than what the actor identifies as.
alternative label: Drag in cinema
alternative label: Drag in movies
broader: https://homosaurus.org/v3/homoit0000367
broader: https://homosaurus.org/v3/homoit0002327
change note: Version 3.7.0
has top concept: Gender
in scheme: v3
related: https://homosaurus.org/v3/homoit0000249
related: https://homosaurus.org/v3/homoit0000318

Gay musicals
type: Concept
issued: 2024-01-09
modified: 2025-02-23
comment: Musicals created by gay directors, depicting gay men, or that are regarded as important within gay culture.
alternative label: Homosexual musicals
broader: https://homosaurus.org/v3/homoit0001031
change note: Version 3.7.0
has top concept: Subcultures
in scheme: v3

Bisexual musicals
type: Concept
issued: 2024-01-09
modified: 2025-02-23
comment: Musicals created by bisexual directors, depicting bisexual individuals, or that are regarded as important within bisexual culture.
broader: https://homosaurus.org/v3/homoit0001031
change note: Version 3.7.0
has top concept: Subcultures
in scheme: v3

Transgender musicals
type: Concept
issued: 2024-01-09
modified: 2025-02-23
comment: Musicals created by transgender directors, depicting transgender individuals, or that are regarded as important within transgender culture.
broader: https://homosaurus.org/v3/homoit0001031
change note: Version 3.7.0
has top concept: Subcultures
in scheme: v3

Asexual musicals
type: Concept
issued: 2024-01-09
modified: 2025-02-23
comment: Musicals created by asexual directors, depicting asexual individuals, or that are regarded as important within asexual culture.
broader: https://homosaurus.org/v3/homoit0001031
change note: Version 3.7.0
has top concept: Subcultures
in scheme: v3

Intersex musicals
type: Concept
issued: 2024-01-09
modified: 2025-02-23
comment: Musicals created by intersex directors, depicting intersex individuals, or that are regarded as important within intersex culture.
broader: https://homosaurus.org/v3/homoit0001031
change note: Version 3.7.0
has top concept: Subcultures
in scheme: v3

Lesbian operas
type: Concept
issued: 2024-01-09
modified: 2025-02-23
comment: Operas created by lesbian directors, depicting lesbian individuals, or that are regarded as important within lesbian culture.
broader: https://homosaurus.org/v3/homoit0002886
change note: Version 3.7.0
has top concept: Subcultures
in scheme: v3
related: https://homosaurus.org/v3/homoit0000755

Queer operas
type: Concept
issued: 2024-01-09
modified: 2025-02-23
comment: Operas created by queer directors, depicting queer individuals, or that are regarded as important within queer culture.
broader: https://homosaurus.org/v3/homoit0002886
change note: Version 3.7.0
has top concept: Subcultures
in scheme: v3
related: https://homosaurus.org/v3/homoit0003168

Lesbian feminists
type: Concept
issued: 2024-01-11
modified: 2025-02-23
comment: A person who subscribes to lesbian feminism, an ideology that encourages women to focus their efforts, activities, and relationships toward other women rather than men, often advocating for lesbianism as the logical result of feminism. Use when resources are about lesbian feminists or when an individual identifies as such.
broader: https://homosaurus.org/v3/homoit0000439
change note: Version 3.7.0
has top concept: Feminists
in scheme: v3
related: https://homosaurus.org/v3/homoit0000741
related: https://homosaurus.org/v3/homoit0000753

Black feminists
type: Concept
issued: 2024-01-11
modified: 2025-02-23
comment: A person who subscribes to a form of feminism that developed in response to the failures of mainstream feminist and civil rights efforts to acknowledge the ways white supremacy and the patriarchy interact to inform the particular experiences of Black women. Use when resources are about Black feminists or when an individual identifies as such.
alternative label: Afro feminists
alternative label: Afro-feminists
broader: https://homosaurus.org/v3/homoit0000439
change note: Version 3.7.0
has top concept: Feminists
in scheme: v3
related: https://homosaurus.org/v3/homoit0002270
related: https://homosaurus.org/v3/homoit0003176

Eco-feminists
type: Concept
issued: 2024-01-11
modified: 2025-02-23
comment: A person who subscribes to the political and philosophical movement that views feminism and concerns for the environment as inherently related. Use when resources are about eco-feminists or when an individual identifies as such.
alternative label: Ecofeminsts
broader: https://homosaurus.org/v3/homoit0000439
change note: Version 3.7.0
has top concept: Feminists
in scheme: v3
related: https://homosaurus.org/v3/homoit0000387

First-wave feminists
type: Concept
issued: 2024-01-11
modified: 2025-02-23
comment: A person who was part of a period of women's rights activism in the 19th and early 20th centuries that was primarily focused on legal rights such as women's right to vote. Use when resources are about first-wave feminists.
alternative label: First wave feminists
broader: https://homosaurus.org/v3/homoit0000439
change note: Version 3.7.0
has top concept: Feminists
in scheme: v3
related: https://homosaurus.org/v3/homoit0000444

Second-wave feminists
type: Concept
issued: 2024-01-11
modified: 2025-02-23
comment: A person who was part of or subscribes to beliefs developed during a period of feminist political activity (also referred to as women’s liberation) beginning in the early 1960s that critiqued male-dominated institutions and cultural practices in society. Use when resources are about second-wave feminists or when an individual identifies as such.
alternative label: Second wave feminists
broader: https://homosaurus.org/v3/homoit0000439
change note: Version 3.7.0
has top concept: Feminists
in scheme: v3
related: https://homosaurus.org/v3/homoit0001260

Third-wave feminists
type: Concept
issued: 2024-01-11
modified: 2025-02-23
comment: A person who was part of or subscribes to beliefs developed during a period of feminist political activity beginning in the early 1990s that embraced diversity and individualism in women and sought to redefine what it meant to be a feminist. The third-wave is characterized by the emergence of new feminist movements and theories such as intersectionality, sex positivity, ecofeminism, transfeminism, and postmodern feminism. Use when resources are about third-wave feminists or when an individual identifies as such.
alternative label: Third wave feminists
broader: https://homosaurus.org/v3/homoit0000439
change note: Version 3.7.0
has top concept: Feminists
in scheme: v3
related: https://homosaurus.org/v3/homoit0002275

Transfeminists
type: Concept
issued: 2024-01-11
modified: 2025-02-23
comment: A person who is part of or subscribes to beliefs developed as part of a movement by and for trans woman who view the liberation of trans women as essential to the liberation of all women. Use when resources are about transfeminists or when an individual identifies as such.
broader: https://homosaurus.org/v3/homoit0000439
change note: Version 3.7.0
has top concept: Feminists
in scheme: v3
related: https://homosaurus.org/v3/homoit0002274

Radical feminists
type: Concept
issued: 2024-01-11
modified: 2025-02-23
comment: A person who subscribes to a perspective within feminism that calls for a radical reordering of society in which male supremacy is eliminated in all social and economic contexts. Distinct from and not to be confused with trans-exclusionary radical feminists. Use for resources about radical feminists or for individuals who identify as such, unless trans-exclusionary radical feminists is a more appropriate term.
broader: https://homosaurus.org/v3/homoit0000439
change note: Version 3.7.0
has top concept: Feminists
in scheme: v3
narrower: https://homosaurus.org/v3/homoit0003766
related: https://homosaurus.org/v3/homoit0001230

Masks (Erotic)
type: Concept
issued: 2024-01-17
modified: 2025-02-23
comment: Masks worn as a fetish fashion accessory or for sensual or sexual play.
broader: https://homosaurus.org/v3/homoit0001266
broader: https://homosaurus.org/v3/homoit0003066
change note: Version 3.7.0
has top concept: Sex accessories
in scheme: v3
narrower: https://homosaurus.org/v3/homoit0003112
related: https://homosaurus.org/v3/homoit0003083

LGBTQ+ urban fantasy fiction
type: Concept
issued: 2024-01-17
modified: 2025-02-23
comment: A subgenre of fantasy fiction featuring magic and supernatural creatures in contemporary urban settings; use for urban fantasy focusing on LGBTQ+ characters or themes.
broader: https://homosaurus.org/v3/homoit0000865
change note: Version 3.7.0
has top concept: Subcultures
in scheme: v3
narrower: https://homosaurus.org/v3/homoit0003180
narrower: https://homosaurus.org/v3/homoit0003181
narrower: https://homosaurus.org/v3/homoit0003182
narrower: https://homosaurus.org/v3/homoit0003183
narrower: https://homosaurus.org/v3/homoit0003184
narrower: https://homosaurus.org/v3/homoit0003185
narrower: https://homosaurus.org/v3/homoit0003186
narrower: https://homosaurus.org/v3/homoit0003187
narrower: https://homosaurus.org/v3/homoit0003189
narrower: https://homosaurus.org/v3/homoit0003190
narrower: https://homosaurus.org/v3/homoit0003191
narrower: https://homosaurus.org/v3/homoit0003192
related: https://homosaurus.org/v3/homoit0003188

Gay urban fantasy fiction
type: Concept
issued: 2024-01-18
modified: 2025-02-23
comment: A subgenre of fantasy fiction featuring magic and supernatural creatures in contemporary urban settings; use for urban fantasy focusing on gay male characters or themes.
broader: https://homosaurus.org/v3/homoit0003179
change note: Version 3.7.0
has top concept: Subcultures
in scheme: v3

Lesbian urban fantasy fiction
type: Concept
issued: 2024-01-18
modified: 2025-02-23
comment: A subgenre of fantasy fiction featuring magic and supernatural creatures in contemporary urban settings; use for urban fantasy focusing on lesbian characters or themes.
broader: https://homosaurus.org/v3/homoit0003179
change note: Version 3.7.0
has top concept: Subcultures
in scheme: v3

Bisexual urban fantasy fiction
type: Concept
issued: 2024-01-18
modified: 2025-02-23
comment: A subgenre of fantasy fiction featuring magic and supernatural creatures in contemporary urban settings; use for urban fantasy focusing on bisexual characters or themes.
broader: https://homosaurus.org/v3/homoit0003179
change note: Version 3.7.0
has top concept: Subcultures
in scheme: v3

Queer urban fantasy fiction
type: Concept
issued: 2024-01-18
modified: 2025-02-23
comment: A subgenre of fantasy fiction featuring magic and supernatural creatures in contemporary urban settings; use for urban fantasy focusing on queer characters or themes.
broader: https://homosaurus.org/v3/homoit0003179
change note: Version 3.7.0
has top concept: Subcultures
in scheme: v3

Transgender urban fantasy fiction
type: Concept
issued: 2024-01-18
modified: 2025-02-23
comment: A subgenre of fantasy fiction featuring magic and supernatural creatures in contemporary urban settings; use for urban fantasy focusing on transgender characters or themes.
broader: https://homosaurus.org/v3/homoit0003179
change note: Version 3.7.0
has top concept: Subcultures
in scheme: v3

Asexual urban fantasy fiction
type: Concept
issued: 2024-01-18
modified: 2025-02-23
comment: A subgenre of fantasy fiction featuring magic and supernatural creatures in contemporary urban settings; use for urban fantasy focusing on asexual characters or themes.
broader: https://homosaurus.org/v3/homoit0003179
change note: Version 3.7.0
has top concept: Subcultures
in scheme: v3

Aromantic urban fantasy fiction
type: Concept
issued: 2024-01-18
modified: 2025-02-23
comment: A subgenre of fantasy fiction featuring magic and supernatural creatures in contemporary urban settings; use for urban fantasy focusing on aromantic characters or themes.
broader: https://homosaurus.org/v3/homoit0003179
change note: Version 3.7.0
has top concept: Subcultures
in scheme: v3

Megasexual urban fantasy fiction
type: Concept
issued: 2024-01-18
modified: 2025-02-23
comment: A subgenre of fantasy fiction featuring magic and supernatural creatures in contemporary urban settings; use for urban fantasy focusing on megasexual characters or themes.
broader: https://homosaurus.org/v3/homoit0003179
change note: Version 3.7.0
has top concept: Subcultures
in scheme: v3

Demisexual urban fantasy fiction
type: Concept
issued: 2024-01-18
modified: 2025-02-23
comment: A subgenre of fantasy fiction featuring magic and supernatural creatures in contemporary urban settings; use for urban fantasy focusing on demisexual characters or themes.
broader: https://homosaurus.org/v3/homoit0003179
change note: Version 3.7.0
has top concept: Subcultures
in scheme: v3

Intersex urban fantasy fiction
type: Concept
issued: 2024-01-18
modified: 2025-02-23
comment: A subgenre of fantasy fiction featuring magic and supernatural creatures in contemporary urban settings; use for urban fantasy focusing on intersex characters or themes.
broader: https://homosaurus.org/v3/homoit0003179
change note: Version 3.7.0
has top concept: Subcultures
in scheme: v3

Non-binary urban fantasy fiction
type: Concept
issued: 2024-01-18
modified: 2025-02-23
comment: A subgenre of fantasy fiction featuring magic and supernatural creatures in contemporary urban settings; use for urban fantasy focusing on non-binary characters or themes.
broader: https://homosaurus.org/v3/homoit0003179
change note: Version 3.7.0
has top concept: Subcultures
in scheme: v3
preferred label: Nonbinary urban fantasy fiction

Greyromantic urban fantasy fiction
type: Concept
issued: 2024-01-18
modified: 2025-02-23
comment: A subgenre of fantasy fiction featuring magic and supernatural creatures in contemporary urban settings; use for urban fantasy focusing on greyromantic characters or themes.
broader: https://homosaurus.org/v3/homoit0003179
change note: Version 3.7.0
has top concept: Subcultures
in scheme: v3

Lesbian dominants
type: Concept
issued: 2024-02-01
modified: 2025-02-23
comment: Lesbians who are part of the BDSM scene and assume the dominant role in sexual relationships with a dominant/submissive dynamic.
alternative label: Lesbian masters
broader: https://homosaurus.org/v3/homoit0000999
change note: Version 3.7.0
has top concept: Sexual identity
in scheme: v3

Lesbian solidarity
type: Concept
issued: 2024-04-16
modified: 2025-02-23
comment: A sense of fellowship and overall unity of purpose, political interest, and/or community sympathies based on shared experiences as lesbians.
broader: https://homosaurus.org/v3/homoit0003195
change note: Version 3.7.0
has top concept: LGBTQ+ solidarity
in scheme: v3

Gay solidarity
type: Concept
issued: 2024-04-16
modified: 2025-02-23
comment: A sense of fellowship and overall unity of purpose, political interest, and/or community sympathies based on shared experiences as gay men.
broader: https://homosaurus.org/v3/homoit0003195
change note: Version 3.7.0
has top concept: LGBTQ+ solidarity
in scheme: v3

Bisexual solidarity
type: Concept
issued: 2024-04-16
modified: 2025-02-23
comment: A sense of fellowship and overall unity of purpose, political interest, and/or community sympathies based on shared experiences as bisexual people.
broader: https://homosaurus.org/v3/homoit0003195
change note: Version 3.7.0
has top concept: LGBTQ+ solidarity
in scheme: v3

Transgender solidarity
type: Concept
issued: 2024-04-16
modified: 2025-02-23
comment: A sense of fellowship and overall unity of purpose, political interest, and/or community sympathies based on shared experiences as transgender people.
alternative label: Trans solidarity
broader: https://homosaurus.org/v3/homoit0003195
change note: Version 3.7.0
has top concept: LGBTQ+ solidarity
in scheme: v3

Queer solidarity
type: Concept
issued: 2024-04-16
modified: 2025-02-23
comment: A sense of fellowship and overall unity of purpose, political interest, and/or community sympathies based on shared experiences as queer people.
broader: https://homosaurus.org/v3/homoit0003195
change note: Version 3.7.0
has top concept: LGBTQ+ solidarity
in scheme: v3

Intersex solidarity
type: Concept
issued: 2024-04-16
modified: 2025-02-23
comment: A sense of fellowship and overall unity of purpose, political interest, and/or community sympathies based on shared experiences as intersex people.
broader: https://homosaurus.org/v3/homoit0003195
change note: Version 3.7.0
has top concept: LGBTQ+ solidarity
in scheme: v3

Asexual solidarity
type: Concept
issued: 2024-04-16
modified: 2025-02-23
comment: A sense of fellowship and overall unity of purpose, political interest, and/or community sympathies based on shared experiences as asexual people.
broader: https://homosaurus.org/v3/homoit0003195
change note: Version 3.7.0
has top concept: LGBTQ+ solidarity
in scheme: v3

Aromantic solidarity
type: Concept
issued: 2024-04-16
modified: 2025-02-23
comment: A sense of fellowship and overall unity of purpose, political interest, and/or community sympathies based on shared experiences as aromantic people.
broader: https://homosaurus.org/v3/homoit0003195
change note: Version 3.7.0
has top concept: LGBTQ+ solidarity
in scheme: v3

Demisexual solidarity
type: Concept
issued: 2024-04-16
modified: 2025-02-23
comment: A sense of fellowship and overall unity of purpose, political interest, and/or community sympathies based on shared experiences as demisexual people.
broader: https://homosaurus.org/v3/homoit0003195
change note: Version 3.7.0
has top concept: LGBTQ+ solidarity
in scheme: v3

Greyromantic solidarity
type: Concept
issued: 2024-04-16
modified: 2025-02-23
comment: A sense of fellowship and overall unity of purpose, political interest, and/or community sympathies based on shared experiences as greyromantic people.
broader: https://homosaurus.org/v3/homoit0003195
change note: Version 3.7.0
has top concept: LGBTQ+ solidarity
in scheme: v3

Dyke solidarity
type: Concept
issued: 2024-04-16
modified: 2025-02-23
comment: A sense of fellowship and overall unity of purpose, political interest, and/or community sympathies based on shared experiences as self-identifying dykes.
broader: https://homosaurus.org/v3/homoit0003195
change note: Version 3.7.0
has top concept: LGBTQ+ solidarity
in scheme: v3

Megasexual solidarity
type: Concept
issued: 2024-04-16
modified: 2025-02-23
comment: A sense of fellowship and overall unity of purpose, political interest, and/or community sympathies based on shared experiences as megasexual people.
broader: https://homosaurus.org/v3/homoit0003195
change note: Version 3.7.0
has top concept: LGBTQ+ solidarity
in scheme: v3

Non-binary solidarity
type: Concept
issued: 2024-04-16
modified: 2025-02-23
comment: A sense of fellowship and overall unity of purpose, political interest, and/or community sympathies based on shared experiences as non-binary people.
alternative label: Nonbinary solidarity
broader: https://homosaurus.org/v3/homoit0003195
change note: Version 3.7.0
has top concept: LGBTQ+ solidarity
in scheme: v3

Lesbian websites
type: Concept
issued: 2024-04-25
modified: 2025-02-23
comment: Public web pages that primarily address lesbian communities and issues, as well as web pages intended for use by lesbians.
broader: https://homosaurus.org/v3/homoit0000962
change note: Version 3.7.0
has top concept: LGBTQ+ websites
in scheme: v3

Gay websites
type: Concept
issued: 2024-04-25
modified: 2025-02-23
comment: Public web pages that primarily address gay communities and issues, as well as web pages intended for use by gay people.
broader: https://homosaurus.org/v3/homoit0000962
change note: Version 3.7.0
has top concept: LGBTQ+ websites
in scheme: v3

Bisexual websites
type: Concept
issued: 2024-04-25
modified: 2025-02-23
comment: Public web pages that primarily address bisexual communities and issues, as well as web pages intended for use by bisexual people.
broader: https://homosaurus.org/v3/homoit0000962
change note: Version 3.7.0
has top concept: LGBTQ+ websites
in scheme: v3

Transgender websites
type: Concept
issued: 2024-04-25
modified: 2025-02-23
comment: Public web pages that primarily address transgender communities and issues, as well as web pages intended for use by transgender people.
broader: https://homosaurus.org/v3/homoit0000962
change note: Version 3.7.0
has top concept: LGBTQ+ websites
in scheme: v3

Queer websites
type: Concept
issued: 2024-04-25
modified: 2025-02-23
comment: Public web pages that primarily address queer communities and issues, as well as web pages intended for use by queer people.
broader: https://homosaurus.org/v3/homoit0000962
change note: Version 3.7.0
has top concept: LGBTQ+ websites
in scheme: v3

Intersex websites
type: Concept
issued: 2024-04-25
modified: 2025-02-23
comment: Public web pages that primarily address intersex communities and issues, as well as web pages intended for use by intersex people.
broader: https://homosaurus.org/v3/homoit0000962
change note: Version 3.7.0
has top concept: LGBTQ+ websites
in scheme: v3

Aromantic websites
type: Concept
issued: 2024-04-25
modified: 2025-02-23
comment: Public web pages that primarily address aromantic communities and issues, as well as web pages intended for use by aromantic people.
broader: https://homosaurus.org/v3/homoit0000962
change note: Version 3.7.0
has top concept: LGBTQ+ websites
in scheme: v3

Asexual websites
type: Concept
issued: 2024-04-25
modified: 2025-02-23
comment: Public web pages that primarily address asexual communities and issues, as well as web pages intended for use by asexual people.
broader: https://homosaurus.org/v3/homoit0000962
change note: Version 3.7.0
has top concept: LGBTQ+ websites
in scheme: v3

Demisexual websites
type: Concept
issued: 2024-04-25
modified: 2025-02-23
comment: Public web pages that primarily address demisexual communities and issues, as well as web pages intended for use by demisexual people.
broader: https://homosaurus.org/v3/homoit0000962
change note: Version 3.7.0
has top concept: LGBTQ+ websites
in scheme: v3

Greyromantic websites
type: Concept
issued: 2024-04-25
modified: 2025-02-23
comment: Public web pages that primarily address greyromantic communities and issues, as well as web pages intended for use by greyromantic people.
broader: https://homosaurus.org/v3/homoit0000962
change note: Version 3.7.0
has top concept: LGBTQ+ websites
in scheme: v3

Megasexual websites
type: Concept
issued: 2024-04-25
modified: 2025-02-23
comment: Public web pages that primarily address megasexual communities and issues, as well as web pages intended for use by megasexual people.
broader: https://homosaurus.org/v3/homoit0000962
change note: Version 3.7.0
has top concept: LGBTQ+ websites
in scheme: v3

Non-binary websites
type: Concept
issued: 2024-04-25
modified: 2025-02-23
comment: Public web pages that primarily address non-binary communities and issues, as well as web pages intended for use by non-binary.
alternative label: Nonbinary websites
broader: https://homosaurus.org/v3/homoit0000962
change note: Version 3.7.0
has top concept: LGBTQ+ websites
in scheme: v3

Pregnant men
type: Concept
issued: 2024-05-24
modified: 2025-02-23
comment: Pregnant people who are trans or intersex men. For the fandom trope in which cisgender men can become pregnant, use the term "Mpreg."
broader: https://homosaurus.org/v3/homoit0001008
broader: https://homosaurus.org/v3/homoit0003364
change note: Version 3.7.0
has top concept: Gender
in scheme: v3

Pregnant women
type: Concept
issued: 2024-05-24
modified: 2025-02-23
comment: Pregnant people who are women.
broader: https://homosaurus.org/v3/homoit0001509
broader: https://homosaurus.org/v3/homoit0003364
change note: Version 3.7.0
has top concept: Gender
in scheme: v3

Pregnant intersex people
type: Concept
issued: 2024-05-24
modified: 2025-02-23
comment: Pregnant people who are intersex.
broader: https://homosaurus.org/v3/homoit0000618
broader: https://homosaurus.org/v3/homoit0003364
change note: Version 3.7.0
has top concept: LGBTQ+ people
in scheme: v3

Pregnant transgender people
type: Concept
issued: 2024-05-24
modified: 2025-02-23
comment: Pregnant people who are transgender.
alternative label: Pregnant trans people
broader: https://homosaurus.org/v3/homoit0001378
broader: https://homosaurus.org/v3/homoit0003364
change note: Version 3.7.0
has top concept: LGBTQ+ people
in scheme: v3

Pregnant non-binary people
type: Concept
issued: 2024-05-24
modified: 2025-02-23
comment: Pregnant people who are non-binary.
alternative label: Pregnant nonbinary people
broader: https://homosaurus.org/v3/homoit0001048
broader: https://homosaurus.org/v3/homoit0003364
change note: Version 3.7.0
has top concept: LGBTQ+ people
in scheme: v3

Lesbian musicals
type: Concept
issued: 2024-05-24
modified: 2025-02-23
comment: Musicals created by lesbian directors, depicting lesbians, or that are regarded as important within lesbian culture.
broader: https://homosaurus.org/v3/homoit0001031
change note: Version 3.7.0
has top concept: Subcultures
in scheme: v3

Pregnant Two-Spirit people
type: Concept
issued: 2024-05-24
modified: 2025-02-23
comment: Pregnant people who are Two-Spirit.
alternative label: Pregnant 2S people
alternative label: Pregnant Two Spirit people
alternative label: Pregnant Two Spirited people
alternative label: Pregnant Two-Spirited people
broader: https://homosaurus.org/v3/homoit0001480
broader: https://homosaurus.org/v3/homoit0003364
change note: Version 3.7.0
has top concept: Gender
in scheme: v3

Pregnant māhū
type: Concept
issued: 2024-05-24
modified: 2025-02-23
comment: Pregnant people who are māhū.
alternative label: Pregnant mahu
broader: https://homosaurus.org/v3/homoit0000979
broader: https://homosaurus.org/v3/homoit0003364
change note: Version 3.7.0
has top concept: Gender
in scheme: v3

Palestinian LGBTQ+ people
type: Concept
issued: 2024-05-24
modified: 2025-02-23
comment: LGBTQ+ people who were born in, reside in, and/or are descended from those indigenous to the country of Palestine.
alternative label: LGBTQ+ Palestinian people
alternative label: LGBTQ+ Palestinians
alternative label: Palestinian people (LGBTQ)
alternative label: Palestinians (LGBTQ)
broader: https://homosaurus.org/v3/homoit0000886
broader: https://homosaurus.org/v3/homoit0002009
change note: Version 3.7.0
has top concept: LGBTQ+ people
in scheme: v3
narrower: https://homosaurus.org/v3/homoit0003233
narrower: https://homosaurus.org/v3/homoit0003234
narrower: https://homosaurus.org/v3/homoit0003235
narrower: https://homosaurus.org/v3/homoit0003236
narrower: https://homosaurus.org/v3/homoit0003237
narrower: https://homosaurus.org/v3/homoit0003238
narrower: https://homosaurus.org/v3/homoit0003239
narrower: https://homosaurus.org/v3/homoit0003240

Palestinian gay men
type: Concept
issued: 2024-05-24
modified: 2025-02-23
comment: Gay men who were born in, reside in, and/or are descended from those indigenous to the country of Palestine.
alternative label: Gay Palestinians
broader: https://homosaurus.org/v3/homoit0003232
change note: Version 3.7.0
has top concept: LGBTQ+ people
in scheme: v3

Palestinian lesbians
type: Concept
issued: 2024-05-24
modified: 2025-02-23
comment: Lesbians who were born in, reside in, and/or are descended from those indigenous to the country of Palestine.
alternative label: Lesbian Palestinians
broader: https://homosaurus.org/v3/homoit0003232
change note: Version 3.7.0
has top concept: LGBTQ+ people
in scheme: v3

Palestinian bisexual people
type: Concept
issued: 2024-05-24
modified: 2025-02-23
comment: Bisexual people who were born in, reside in, and/or are descended from those indigenous to the country of Palestine.
alternative label: Bisexual Palestinians
broader: https://homosaurus.org/v3/homoit0003232
change note: Version 3.7.0
has top concept: LGBTQ+ people
in scheme: v3

Palestinian queer people
type: Concept
issued: 2024-05-24
modified: 2025-02-23
comment: Queer people who were born in, reside in, and/or are descended from those indigenous to the country of Palestine.
alternative label: Queer Palestinians
broader: https://homosaurus.org/v3/homoit0003232
change note: Version 3.7.0
has top concept: LGBTQ+ people
in scheme: v3

Palestinian transgender people
type: Concept
issued: 2024-05-24
modified: 2025-02-23
comment: Transgender people who were born in, reside in, and/or are descended from those indigenous to the country of Palestine.
alternative label: Palestinian trans people
alternative label: Trans Palestinians
alternative label: Transgender Palestinians
broader: https://homosaurus.org/v3/homoit0003232
change note: Version 3.7.0
has top concept: LGBTQ+ people
in scheme: v3

Palestinian non-binary people
type: Concept
issued: 2024-05-24
modified: 2025-02-23
comment: Non-binary people who were born in, reside in, and/or are descended from those indigenous to the country of Palestine.
alternative label: Non-binary Palestinians
alternative label: Nonbinary Palestinians
alternative label: Palestinian nonbinary people
broader: https://homosaurus.org/v3/homoit0003232
change note: Version 3.7.0
has top concept: LGBTQ+ people
in scheme: v3

Palestinian asexual people
type: Concept
issued: 2024-05-24
modified: 2025-02-23
comment: Asexual people who were born in, reside in, and/or are descended from those indigenous to the country of Palestine.
alternative label: Ace Palestinians
alternative label: Asexual Palestinians
broader: https://homosaurus.org/v3/homoit0003232
change note: Version 3.7.0
has top concept: LGBTQ+ people
in scheme: v3

Palestinian intersex people
type: Concept
issued: 2024-05-24
modified: 2025-02-23
comment: Intersex people who were born in, reside in, and/or are descended from those indigenous to the country of Palestine.
alternative label: Intersex Palestinians
broader: https://homosaurus.org/v3/homoit0003232
change note: Version 3.7.0
has top concept: LGBTQ+ people
in scheme: v3

Two-Spirit fathers
type: Concept
issued: 2024-05-24
modified: 2025-02-23
comment: Two-Spirit people who are fathers. Only use to describe individuals who identify as fathers.
alternative label: 2S fathers
alternative label: Two Spirit fathers
alternative label: Two Spirited fathers
alternative label: Two-Spirited fathers
broader: https://homosaurus.org/v3/homoit0000423
broader: https://homosaurus.org/v3/homoit0001764
change note: Version 3.7.0
has top concept: Family members
in scheme: v3
related: https://homosaurus.org/v3/homoit0001760

Two-Spirit mothers
type: Concept
issued: 2024-05-24
modified: 2025-02-23
comment: Two-Spirit people who are mothers. Only use to describe individuals who identify as mothers.
alternative label: 2S mothers
alternative label: Two Spirit mothers
alternative label: Two Spirited mothers
alternative label: Two-Spirited mothers
broader: https://homosaurus.org/v3/homoit0001021
broader: https://homosaurus.org/v3/homoit0001764
change note: Version 3.7.0
has top concept: Family members
in scheme: v3
related: https://homosaurus.org/v3/homoit0001760

Two-Spirit sons
type: Concept
issued: 2024-05-24
modified: 2025-02-23
comment: Two-Spirit people who are sons. Only use to describe individuals who identify as sons.
alternative label: 2S sons
alternative label: Two Spirit sons
alternative label: Two Spirited sons
alternative label: Two-Spirited sons
broader: https://homosaurus.org/v3/homoit0001480
broader: https://homosaurus.org/v3/homoit0002353
change note: Version 3.7.0
has top concept: Gender
in scheme: v3

Drag television programs
type: Concept
issued: 2024-05-24
modified: 2025-02-23
comment: Television programs that feature drag queens and/or drag kings and drag performances.
alternative label: Drag TV programmes
alternative label: Drag TV programs
alternative label: Drag TV shows
alternative label: Drag television programmes
alternative label: Drag television shows
alternative label: Drag television
broader: https://homosaurus.org/v3/homoit0000367
change note: Version 3.7.0
has top concept: Gender
in scheme: v3
related: https://homosaurus.org/v3/homoit0001359

LGBTQ+ pride flags
type: Concept
issued: 2024-05-24
modified: 2025-02-23
comment: Flags that represent sexual identities, gender identities, and romantic orientations that fall under the LGBTQ+ umbrella, as well as flags representing LGBTQ+ subcultures and communities.
alternative label: Pride flags
broader: https://homosaurus.org/v3/homoit0000954
change note: Version 3.7.0
has top concept: LGBTQ+ symbols
in scheme: v3
narrower: https://homosaurus.org/v3/homoit0001232
related: https://homosaurus.org/v3/homoit0003653

LGBTQ+ teachers
type: Concept
issued: 2024-05-24
modified: 2025-02-23
comment: Teachers who self-identify as LGBTQ+.
alternative label: Teachers (LGBTQ)
broader: https://homosaurus.org/v3/homoit0000915
change note: Version 3.7.0
has top concept: LGBTQ+ people
in scheme: v3
narrower: https://homosaurus.org/v3/homoit0003248
narrower: https://homosaurus.org/v3/homoit0003249
narrower: https://homosaurus.org/v3/homoit0003250
narrower: https://homosaurus.org/v3/homoit0003251
narrower: https://homosaurus.org/v3/homoit0003252
narrower: https://homosaurus.org/v3/homoit0003253
narrower: https://homosaurus.org/v3/homoit0003254
narrower: https://homosaurus.org/v3/homoit0003255
narrower: https://homosaurus.org/v3/homoit0003257
narrower: https://homosaurus.org/v3/homoit0003258
narrower: https://homosaurus.org/v3/homoit0003259
narrower: https://homosaurus.org/v3/homoit0003260
related: https://homosaurus.org/v3/homoit0003256
related: https://homosaurus.org/v3/homoit0003261
related: https://homosaurus.org/v3/homoit0003618

Aromantic teachers
type: Concept
issued: 2024-05-24
modified: 2025-02-23
comment: Teachers who self-identify as aromantic.
broader: https://homosaurus.org/v3/homoit0003247
change note: Version 3.7.0
has top concept: LGBTQ+ people
in scheme: v3
related: https://homosaurus.org/v3/homoit0003264

Asexual teachers
type: Concept
issued: 2024-05-24
modified: 2025-02-23
comment: Teachers who self-identify as asexual.
broader: https://homosaurus.org/v3/homoit0003247
change note: Version 3.7.0
has top concept: LGBTQ+ people
in scheme: v3

Bisexual teachers
type: Concept
issued: 2024-05-24
modified: 2025-02-23
comment: Teachers who self-identify as bisexual.
alternative label: Bi teachers
broader: https://homosaurus.org/v3/homoit0003247
change note: Version 3.7.0
has top concept: LGBTQ+ people
in scheme: v3

Demisexual teachers
type: Concept
issued: 2024-05-24
modified: 2025-02-23
comment: Teachers who self-identify as demisexual.
broader: https://homosaurus.org/v3/homoit0003247
change note: Version 3.7.0
has top concept: LGBTQ+ people
in scheme: v3

Gay teachers
type: Concept
issued: 2024-05-24
modified: 2025-02-23
comment: Teachers who self-identify as gay men.
broader: https://homosaurus.org/v3/homoit0003247
change note: Version 3.7.0
has top concept: LGBTQ+ people
in scheme: v3

Greyromantic teachers
type: Concept
issued: 2024-05-24
modified: 2025-02-23
comment: Teachers who self-identify as greyromantic.
broader: https://homosaurus.org/v3/homoit0003247
change note: Version 3.7.0
has top concept: LGBTQ+ people
in scheme: v3

Intersex teachers
type: Concept
issued: 2024-05-24
modified: 2025-02-23
comment: Teachers who are intersex.
broader: https://homosaurus.org/v3/homoit0003247
change note: Version 3.7.0
has top concept: LGBTQ+ people
in scheme: v3

Lesbian teachers
type: Concept
issued: 2024-05-24
modified: 2025-02-23
comment: Teachers who self-identify as lesbians.
broader: https://homosaurus.org/v3/homoit0003247
change note: Version 3.7.0
has top concept: LGBTQ+ people
in scheme: v3

Māhū teachers
type: Concept
issued: 2024-05-24
modified: 2025-02-23
comment: Teachers who are Māhū.
alternative label: Mahu teachers
broader: https://homosaurus.org/v3/homoit0000979
change note: Version 3.7.0
has top concept: Gender
in scheme: v3
related: https://homosaurus.org/v3/homoit0003247

Megasexual teachers
type: Concept
issued: 2024-05-24
modified: 2025-02-23
comment: Teachers who self-identify as megasexual.
broader: https://homosaurus.org/v3/homoit0003247
change note: Version 3.7.0
has top concept: LGBTQ+ people
in scheme: v3

Non-binary teachers
type: Concept
issued: 2024-05-24
modified: 2025-02-23
comment: Teachers who self-identify as non-binary.
alternative label: Nonbinary teachers
broader: https://homosaurus.org/v3/homoit0003247
change note: Version 3.7.0
has top concept: LGBTQ+ people
in scheme: v3

Queer teachers
type: Concept
issued: 2024-05-24
modified: 2025-02-23
comment: Teachers who self-identify as queer.
broader: https://homosaurus.org/v3/homoit0003247
change note: Version 3.7.0
has top concept: LGBTQ+ people
in scheme: v3

Transgender teachers
type: Concept
issued: 2024-05-24
modified: 2025-02-23
comment: Teachers who self-identify as transgender.
alternative label: Trans teachers
broader: https://homosaurus.org/v3/homoit0003247
change note: Version 3.7.0
has top concept: LGBTQ+ people
in scheme: v3

Two-Spirit teachers
type: Concept
issued: 2024-05-24
modified: 2025-02-23
comment: Indigenous teachers who self-identify as Two-Spirit.
alternative label: 2S teachers
alternative label: Two Spirit teachers
alternative label: Two Spirited teachers
alternative label: Two-Sprited teachers
broader: https://homosaurus.org/v3/homoit0001480
change note: Version 3.7.0
has top concept: Gender
in scheme: v3
related: https://homosaurus.org/v3/homoit0003247

LGBTQ+ sex tourism
type: Concept
issued: 2024-05-24
modified: 2025-02-23
comment: The practice of traveling with the intention of soliciting sex work, typically to allow LGBTQ+ or curious people to explore sexual encounters that are illegal or stigmatized in their home countries. Sex tourism often presents ethical concerns, such as the economic gap between tourists and residents, differences in age of consent laws globally, and the selective enforcement of anti-sex work laws by police.
alternative label: Sex tourism (LGBTQ)
broader: https://homosaurus.org/v3/homoit0000956
broader: https://homosaurus.org/v3/homoit0001275
change note: Version 3.7.0
has top concept: LGBTQ+ tourism
in scheme: v3
related: https://homosaurus.org/v3/homoit0001277

LGBTQ+ academics
type: Concept
issued: 2024-05-24
modified: 2025-02-23
comment: LGBTQ+ researchers and/or educators working in higher education.
alternative label: Academics (LGBTQ)
alternative label: LGBTQ+ college teachers
alternative label: LGBTQ+ professors
alternative label: LGBTQ+ researchers
broader: https://homosaurus.org/v3/homoit0000915
change note: Version 3.7.0
has top concept: LGBTQ+ people
in scheme: v3
narrower: https://homosaurus.org/v3/homoit0003264
narrower: https://homosaurus.org/v3/homoit0003265
narrower: https://homosaurus.org/v3/homoit0003266
narrower: https://homosaurus.org/v3/homoit0003267
narrower: https://homosaurus.org/v3/homoit0003268
narrower: https://homosaurus.org/v3/homoit0003269
narrower: https://homosaurus.org/v3/homoit0003270
narrower: https://homosaurus.org/v3/homoit0003271
narrower: https://homosaurus.org/v3/homoit0003272
narrower: https://homosaurus.org/v3/homoit0003273
narrower: https://homosaurus.org/v3/homoit0003274
narrower: https://homosaurus.org/v3/homoit0003275
related: https://homosaurus.org/v3/homoit0003276

Aromantic academics
type: Concept
issued: 2024-05-24
modified: 2025-02-23
comment: Aromantic researchers and/or educators working in higher education.
alternative label: Aromantic college teachers
alternative label: Aromantic professors
alternative label: Aromantic researchers
broader: https://homosaurus.org/v3/homoit0003263
change note: Version 3.7.0
has top concept: LGBTQ+ people
in scheme: v3
related: https://homosaurus.org/v3/homoit0003248

Asexual academics
type: Concept
issued: 2024-05-24
modified: 2025-02-23
comment: Asexual researchers and/or educators working in higher education.
alternative label: Ace academics
alternative label: Asexual college teachers
alternative label: Asexual professors
alternative label: Asexual researchers
broader: https://homosaurus.org/v3/homoit0003263
change note: Version 3.7.0
has top concept: LGBTQ+ people
in scheme: v3

Bisexual academics
type: Concept
issued: 2024-05-24
modified: 2025-02-23
comment: Bisexual researchers and/or educators working in higher education.
alternative label: Bi academics
alternative label: Bisexual college teachers
alternative label: Bisexual professors
alternative label: Bisexual researchers
broader: https://homosaurus.org/v3/homoit0003263
change note: Version 3.7.0
has top concept: LGBTQ+ people
in scheme: v3

Demisexual academics
type: Concept
issued: 2024-05-24
modified: 2025-02-23
comment: Demisexual researchers and/or educators working in higher education.
alternative label: Demi academics
alternative label: Demisexual college teachers
alternative label: Demisexual professors
alternative label: Demisexual researchers
broader: https://homosaurus.org/v3/homoit0003263
change note: Version 3.7.0
has top concept: LGBTQ+ people
in scheme: v3

Gay academics
type: Concept
issued: 2024-05-24
modified: 2025-02-23
comment: Gay men working as researchers or educators in higher education.
alternative label: Gay college teachers
alternative label: Gay professors
alternative label: Gay researchers
broader: https://homosaurus.org/v3/homoit0003263
change note: Version 3.7.0
has top concept: LGBTQ+ people
in scheme: v3

Greyromantic academics
type: Concept
issued: 2024-05-24
modified: 2025-02-23
comment: Greyromantic researchers and/or educators working in higher education.
alternative label: Greyromantic college teachers
alternative label: Greyromantic professors
alternative label: Greyromantic researchers
broader: https://homosaurus.org/v3/homoit0003263
change note: Version 3.7.0
has top concept: LGBTQ+ people
in scheme: v3

Intersex academics
type: Concept
issued: 2024-05-24
modified: 2025-02-23
comment: Intersex researchers and/or educators working in higher education.
alternative label: Intersex college teachers
alternative label: Intersex professors
alternative label: Intersex researchers
broader: https://homosaurus.org/v3/homoit0003263
change note: Version 3.7.0
has top concept: LGBTQ+ people
in scheme: v3

Lesbian academics
type: Concept
issued: 2024-05-24
modified: 2025-02-23
comment: Lesbian researchers and/or educators working in higher education.
alternative label: Lesbian college teachers
alternative label: Lesbian professors
alternative label: Lesbian researchers
broader: https://homosaurus.org/v3/homoit0003263
change note: Version 3.7.0
has top concept: LGBTQ+ people
in scheme: v3

Megasexual academics
type: Concept
issued: 2024-05-24
modified: 2025-02-23
comment: Megasexual researchers and/or educators working in higher education.
alternative label: Megasexual college teachers
alternative label: Megasexual professors
alternative label: Megasexual researchers
broader: https://homosaurus.org/v3/homoit0003263
change note: Version 3.7.0
has top concept: LGBTQ+ people
in scheme: v3

Non-binary academics
type: Concept
issued: 2024-05-24
modified: 2025-02-23
comment: Non-binary researchers and/or educators working in higher education.
alternative label: Non-binary college teachers
alternative label: Non-binary professors
alternative label: Non-binary researchers
alternative label: Nonbinary academics
broader: https://homosaurus.org/v3/homoit0003263
change note: Version 3.7.0
has top concept: LGBTQ+ people
in scheme: v3

Queer academics
type: Concept
issued: 2024-05-24
modified: 2025-02-23
comment: Queer researchers and/or educators working in higher education.
alternative label: Queer college teachers
alternative label: Queer professors
alternative label: Queer researchers
broader: https://homosaurus.org/v3/homoit0003263
change note: Version 3.7.0
has top concept: LGBTQ+ people
in scheme: v3

Transgender academics
type: Concept
issued: 2024-05-24
modified: 2025-02-23
comment: Transgender researchers and/or educators working in higher education.
alternative label: Trans academics
alternative label: Transgender college teachers
alternative label: Transgender professors
alternative label: Transgender researchers
broader: https://homosaurus.org/v3/homoit0003263
change note: Version 3.7.0
has top concept: LGBTQ+ people
in scheme: v3

Two-Spirit academics
type: Concept
issued: 2024-05-24
modified: 2025-02-23
comment: Two-spirit researchers and/or educators working in higher education.
alternative label: 2S academics
alternative label: Two spirit academics
alternative label: Two spirited academics
alternative label: Two-Spirit college teachers
alternative label: Two-Spirit professors
alternative label: Two-Spirit researchers
alternative label: Two-sprited academics
broader: https://homosaurus.org/v3/homoit0001480
change note: Version 3.7.0
has top concept: Gender
in scheme: v3
related: https://homosaurus.org/v3/homoit0003263

Arab non-binary people
type: Concept
issued: 2024-06-10
modified: 2025-02-23
comment: Non-binary people who are from Arab countries and/or are descended from Arab peoples. Do not conflate with Muslim people.
alternative label: Arab nonbinary people
alternative label: Non-binary Arab people
alternative label: Non-binary Arabs
alternative label: Nonbinary Arab people
alternative label: Nonbinary Arabs
broader: https://homosaurus.org/v3/homoit0002009
change note: Version 3.7.0
has top concept: LGBTQ+ people
in scheme: v3

Open marriage
type: Concept
issued: 2024-06-10
modified: 2025-02-23
comment: A form of consensual non-monogamy in which spouses agree to engage in sexual and/or romantic relationships with individuals other than their marriage partner, without regarding this as infidelity.
broader: https://homosaurus.org/v3/homoit0001651
change note: Version 3.7.0
has top concept: Relationship orientation
in scheme: v3

LGBTQ+ travel guides
type: Concept
issued: 2024-06-10
modified: 2025-02-23
comment: Books or other resources of information about places designed for the use of LGBTQ+ visitors or tourists, typically to direct travelers to establishments or attractions that are owned by, open to, or frequented by LGBTQ+ people. LGBTQ+ travel guides may also direct travelers to safe houses or businesses in places where LGBTQ+ people are otherwise unsafe or criminalized, as well as locations commonly used for cruising, or picking up casual sex partners.
alternative label: Guide books (LGBTQ)
alternative label: LGBTQ+ guide books
alternative label: LGBTQ+ travel guide books
alternative label: Travel guide books (LGBTQ)
alternative label: Travel guides (LGBTQ)
broader: https://homosaurus.org/v3/homoit0000956
change note: Version 3.7.0
has top concept: LGBTQ+ tourism
in scheme: v3

Central American Indigenous LGBTQ+ people
type: Concept
issued: 2024-06-10
modified: 2025-02-23
comment: People who are part of the Native peoples of Central America and self-identify as LGBTQ. Use more specific terms when available.
alternative label: Central American Indigenous people (LGBTQ)
alternative label: Central American Native LGBTQ+ people
alternative label: Central American Native people (LGBTQ)
alternative label: Indigenous Central American LGBTQ+ people
alternative label: LGBTQ+ Central American Indigenous people
alternative label: LGBTQ+ Central American Native people
broader: https://homosaurus.org/v3/homoit0000886
change note: Version 3.7.0
has top concept: LGBTQ+ people
in scheme: v3
narrower: https://homosaurus.org/v3/homoit0003281
narrower: https://homosaurus.org/v3/homoit0003282
narrower: https://homosaurus.org/v3/homoit0003283
narrower: https://homosaurus.org/v3/homoit0003284
narrower: https://homosaurus.org/v3/homoit0003285
narrower: https://homosaurus.org/v3/homoit0003286
narrower: https://homosaurus.org/v3/homoit0003287
narrower: https://homosaurus.org/v3/homoit0003288
narrower: https://homosaurus.org/v3/homoit0003289
narrower: https://homosaurus.org/v3/homoit0003290
narrower: https://homosaurus.org/v3/homoit0003291
narrower: https://homosaurus.org/v3/homoit0003292

Central American Indigenous asexual people
type: Concept
issued: 2024-06-10
modified: 2025-02-23
comment: People who are part of the Native peoples of Central America and self-identify as asexual.
alternative label: Asexual Central American Indigenous people
alternative label: Asexual Central American Native people
alternative label: Central American Native asexual people
alternative label: Indigenous Central American asexual people
broader: https://homosaurus.org/v3/homoit0003280
change note: Version 3.7.0
has top concept: LGBTQ+ people
in scheme: v3

Central American Indigenous bisexual people
type: Concept
issued: 2024-06-10
modified: 2025-02-23
comment: People who are part of the Native peoples of Central America and self-identify as bisexual.
alternative label: Bisexual Central American Indigenous people
alternative label: Bisexual Central American Native people
alternative label: Central American Native bisexual people
alternative label: Indigenous Central American bisexual people
broader: https://homosaurus.org/v3/homoit0003280
change note: Version 3.7.0
has top concept: LGBTQ+ people
in scheme: v3

Central American Indigenous gay men
type: Concept
issued: 2024-06-10
modified: 2025-02-23
comment: Men who are part of the Native peoples of Central America and self-identify as gay.
alternative label: Central American Native gay men
alternative label: Gay Central American Indigenous men
alternative label: Gay Central American Native men
alternative label: Indigenous Central American gay men
broader: https://homosaurus.org/v3/homoit0003280
change note: Version 3.7.0
has top concept: LGBTQ+ people
in scheme: v3

Central American Indigenous intersex people
type: Concept
issued: 2024-06-10
modified: 2025-02-23
comment: People who are part of the Native peoples of Central America and self-identify as intersex.
alternative label: Central American Native intersex people
alternative label: Indigenous Central American intersex people
alternative label: Intersex Central American Indigenous people
alternative label: Intersex Central American Native people
broader: https://homosaurus.org/v3/homoit0003280
change note: Version 3.7.0
has top concept: LGBTQ+ people
in scheme: v3

Central American Indigenous lesbians
type: Concept
issued: 2024-06-10
modified: 2025-02-23
comment: People who are part of the Native peoples of Central America and self-identify as lesbians.
alternative label: Central American Native lesbians
alternative label: Indigenous Central American lesbians
alternative label: Lesbian Central American Indigenous people
alternative label: Lesbian Central American Native people
broader: https://homosaurus.org/v3/homoit0003280
change note: Version 3.7.0
has top concept: LGBTQ+ people
in scheme: v3

Central American Indigenous queer people
type: Concept
issued: 2024-06-10
modified: 2025-02-23
comment: People who are part of the Native peoples of Central America and self-identify as queer.
alternative label: Central American Native queer people
alternative label: Indigenous Central American queer people
alternative label: Queer Central American Indigenous people
alternative label: Queer Central American Native people
broader: https://homosaurus.org/v3/homoit0003280
change note: Version 3.7.0
has top concept: LGBTQ+ people
in scheme: v3

Central American Indigenous transgender people
type: Concept
issued: 2024-06-10
modified: 2025-02-23
comment: People who are part of the Native peoples of Central America and self-identify as transgender.
alternative label: Central American Native transgender people
alternative label: Indigenous Central American transgender people
alternative label: Transgender Central American Indigenous people
alternative label: Transgender Central American Native people
broader: https://homosaurus.org/v3/homoit0003280
change note: Version 3.7.0
has top concept: LGBTQ+ people
in scheme: v3

Central American Indigenous non-binary people
type: Concept
issued: 2024-06-10
modified: 2025-02-23
comment: People who are part of the Native peoples of Central America and self-identify as non-binary.
alternative label: Central American Indigenous nonbinary people
alternative label: Central American Native non-binary people
alternative label: Indigenous Central American non-binary people
alternative label: Non-binary Central American Indigenous people
alternative label: Non-binary Central American Native people
broader: https://homosaurus.org/v3/homoit0003280
change note: Version 3.7.0
has top concept: LGBTQ+ people
in scheme: v3

Central American Indigenous demisexual people
type: Concept
issued: 2024-06-10
modified: 2025-02-23
comment: People who are part of the Native peoples of Central America and self-identify as demisexual.
alternative label: Central American Native demisexual people
alternative label: Demisexual Central American Indigenous people
alternative label: Demisexual Central American Native people
alternative label: Indigenous Central American demisexual people
broader: https://homosaurus.org/v3/homoit0003280
change note: Version 3.7.0
has top concept: LGBTQ+ people
in scheme: v3

Central American Indigenous megasexual people
type: Concept
issued: 2024-06-10
modified: 2025-02-23
comment: People who are part of the Native peoples of Central America and self-identify as megasexual.
alternative label: Central American Native megasexual people
alternative label: Indigenous Central American megasexual people
alternative label: Megasexual Central American Indigenous people
alternative label: Megasexual Central American Native people
broader: https://homosaurus.org/v3/homoit0003280
change note: Version 3.7.0
has top concept: LGBTQ+ people
in scheme: v3

Central American Indigenous greyromantic people
type: Concept
issued: 2024-06-10
modified: 2025-02-23
comment: People who are part of the Native peoples of Central America and self-identify as greyromantic.
alternative label: Central American Native greyromantic people
alternative label: Greyromantic Central American Indigenous people
alternative label: Greyromantic Central American Native people
alternative label: Indigenous Central American greyromantic people
broader: https://homosaurus.org/v3/homoit0003280
change note: Version 3.7.0
has top concept: LGBTQ+ people
in scheme: v3

Central American Indigenous aromantic people
type: Concept
issued: 2024-06-10
modified: 2025-02-23
comment: People who are part of the Native peoples of Central America and self-identify as aromantic.
alternative label: Aromantic Central American Indigenous people
alternative label: Aromantic Central American Native people
alternative label: Central American Native aromantic people
alternative label: Indigenous Central American aromantic people
broader: https://homosaurus.org/v3/homoit0003280
change note: Version 3.7.0
has top concept: LGBTQ+ people
in scheme: v3

South American Indigenous LGBTQ+ people
type: Concept
issued: 2024-06-10
modified: 2025-02-23
comment: People who are part of the Native peoples of South America and self-identify as LGBTQ. Use more specific terms when available.
alternative label: Indigenous South American LGBTQ+ people
alternative label: LGBTQ+ South American Indigenous people
alternative label: LGBTQ+ South American Native people
alternative label: South American Indigenous people (LGBTQ)
alternative label: South American Native LGBTQ+ people
alternative label: South American Native people (LGBTQ)
broader: https://homosaurus.org/v3/homoit0000886
change note: Version 3.7.0
has top concept: LGBTQ+ people
in scheme: v3
narrower: https://homosaurus.org/v3/homoit0003294
narrower: https://homosaurus.org/v3/homoit0003295
narrower: https://homosaurus.org/v3/homoit0003296
narrower: https://homosaurus.org/v3/homoit0003297
narrower: https://homosaurus.org/v3/homoit0003298
narrower: https://homosaurus.org/v3/homoit0003299
narrower: https://homosaurus.org/v3/homoit0003300
narrower: https://homosaurus.org/v3/homoit0003301
narrower: https://homosaurus.org/v3/homoit0003302
narrower: https://homosaurus.org/v3/homoit0003303
narrower: https://homosaurus.org/v3/homoit0003304
narrower: https://homosaurus.org/v3/homoit0003305

South American Indigenous asexual people
type: Concept
issued: 2024-06-10
modified: 2025-02-23
comment: People who are part of the Native peoples of South America and self-identify as asexual.
alternative label: Asexual South American Indigenous people
alternative label: Asexual South American Native people
alternative label: Indigenous South American asexual people
alternative label: South American Native asexual people
broader: https://homosaurus.org/v3/homoit0003293
change note: Version 3.7.0
has top concept: LGBTQ+ people
in scheme: v3

South American Indigenous bisexual people
type: Concept
issued: 2024-06-10
modified: 2025-02-23
comment: People who are part of the Native peoples of South America and self-identify as bisexual.
alternative label: Bisexual South American Indigenous people
alternative label: Bisexual South American Native people
alternative label: Indigenous South American bisexual people
alternative label: South American Native bisexual people
broader: https://homosaurus.org/v3/homoit0003293
change note: Version 3.7.0
has top concept: LGBTQ+ people
in scheme: v3

South American Indigenous gay men
type: Concept
issued: 2024-06-10
modified: 2025-02-23
comment: Men who are part of the Native peoples of South America and self-identify as gay.
alternative label: Gay South American Indigenous men
alternative label: Gay South American Native men
alternative label: Indigenous South American gay men
alternative label: South American Native gay men
broader: https://homosaurus.org/v3/homoit0003293
change note: Version 3.7.0
has top concept: LGBTQ+ people
in scheme: v3

South American Indigenous intersex people
type: Concept
issued: 2024-06-10
modified: 2025-02-23
comment: People who are part of the Native peoples of South America and self-identify as intersex.
alternative label: Indigenous South American intersex people
alternative label: Intersex South American Indigenous people
alternative label: Intersex South American Native people
alternative label: South American Native intersex people
broader: https://homosaurus.org/v3/homoit0003293
change note: Version 3.7.0
has top concept: LGBTQ+ people
in scheme: v3

South American Indigenous lesbians
type: Concept
issued: 2024-06-10
modified: 2025-02-23
comment: People who are part of the Native peoples of South America and self-identify as lesbians.
alternative label: Indigenous South American lesbians
alternative label: Lesbian South American Indigenous people
alternative label: Lesbian South American Native people
alternative label: South American Native lesbians
broader: https://homosaurus.org/v3/homoit0003293
change note: Version 3.7.0
has top concept: LGBTQ+ people
in scheme: v3

South American Indigenous queer people
type: Concept
issued: 2024-06-10
modified: 2025-02-23
comment: People who are part of the Native peoples of South America and self-identify as queer.
alternative label: Indigenous South American queer people
alternative label: Queer South American Indigenous people
alternative label: Queer South American Native people
alternative label: South American Native queer people
broader: https://homosaurus.org/v3/homoit0003293
change note: Version 3.7.0
has top concept: LGBTQ+ people
in scheme: v3

South American Indigenous non-binary people
type: Concept
issued: 2024-06-10
modified: 2025-02-23
comment: People who are part of the Native peoples of South America and self-identify as non-binary.
alternative label: Indigenous South American non-binary people
alternative label: Non-binary South American Indigenous people
alternative label: Non-binary South American Native people
alternative label: South American Indigenous nonbinary people
alternative label: South American Native non-binary people
broader: https://homosaurus.org/v3/homoit0003293
change note: Version 3.7.0
has top concept: LGBTQ+ people
in scheme: v3

South American Indigenous transgender people
type: Concept
issued: 2024-06-10
modified: 2025-02-23
comment: People who are part of the Native peoples of South America and self-identify as transgender.
alternative label: Indigenous South American transgender people
alternative label: South American Native transgender people
alternative label: Transgender South American Indigenous people
alternative label: Transgender South American Native people
broader: https://homosaurus.org/v3/homoit0003293
change note: Version 3.7.0
has top concept: LGBTQ+ people
in scheme: v3

South American Indigenous demisexual people
type: Concept
issued: 2024-06-10
modified: 2025-02-23
comment: People who are part of the Native peoples of South America and self-identify as demisexual.
alternative label: Demisexual South American Indigenous people
alternative label: Demisexual South American Native people
alternative label: Indigenous South American demisexual people
alternative label: South American Native demisexual people
broader: https://homosaurus.org/v3/homoit0003293
change note: Version 3.7.0
has top concept: LGBTQ+ people
in scheme: v3

South American Indigenous megasexual people
type: Concept
issued: 2024-06-10
modified: 2025-02-23
comment: People who are part of the Native peoples of South America and self-identify as megasexual.
alternative label: Indigenous South American megasexual people
alternative label: Megasexual South American Indigenous people
alternative label: Megasexual South American Native people
alternative label: South American Native megasexual people
broader: https://homosaurus.org/v3/homoit0003293
change note: Version 3.7.0
has top concept: LGBTQ+ people
in scheme: v3

South American Indigenous greyromantic people
type: Concept
issued: 2024-06-10
modified: 2025-02-23
comment: People who are part of the Native peoples of South America and self-identify as greyromantic.
alternative label: Greyromantic South American Indigenous people
alternative label: Greyromantic South American Native people
alternative label: Indigenous South American greyromantic people
alternative label: South American Native greyromantic people
broader: https://homosaurus.org/v3/homoit0003293
change note: Version 3.7.0
has top concept: LGBTQ+ people
in scheme: v3

South American Indigenous aromantic people
type: Concept
issued: 2024-06-10
modified: 2025-02-23
comment: People who are part of the Native peoples of South America and self-identify as aromantic.
alternative label: Aromantic South American Indigenous people
alternative label: Aromantic South American Native people
alternative label: Indigenous South American aromantic people
alternative label: South American Native aromantic people
broader: https://homosaurus.org/v3/homoit0003293
change note: Version 3.7.0
has top concept: LGBTQ+ people
in scheme: v3

Belarusian LGBTQ+ people
type: Concept
issued: 2024-06-10
modified: 2025-02-23
comment: LGBTQ+ people who are ethnically Belarusian or have Belarusian nationality.
alternative label: Belarusian people (LGBTQ)
alternative label: Belarusians (LGBTQ)
alternative label: LGBTQ+ Belarusians
broader: https://homosaurus.org/v3/homoit0000860
change note: Version 3.7.0
has top concept: LGBTQ+ people
in scheme: v3
narrower: https://homosaurus.org/v3/homoit0003307
narrower: https://homosaurus.org/v3/homoit0003308
narrower: https://homosaurus.org/v3/homoit0003309
narrower: https://homosaurus.org/v3/homoit0003310
narrower: https://homosaurus.org/v3/homoit0003311
narrower: https://homosaurus.org/v3/homoit0003312
narrower: https://homosaurus.org/v3/homoit0003313
narrower: https://homosaurus.org/v3/homoit0003314
narrower: https://homosaurus.org/v3/homoit0003315
narrower: https://homosaurus.org/v3/homoit0003316
narrower: https://homosaurus.org/v3/homoit0003317
narrower: https://homosaurus.org/v3/homoit0003318

Belarusian asexual people
type: Concept
issued: 2024-06-10
modified: 2025-02-23
comment: Asexual people who are ethnically Belarusian or have Belarusian nationality.
alternative label: Asexual Belarusians
broader: https://homosaurus.org/v3/homoit0003306
change note: Version 3.7.0
has top concept: LGBTQ+ people
in scheme: v3

Belarusian bisexual people
type: Concept
issued: 2024-06-10
modified: 2025-02-23
comment: Bisexual people who are ethnically Belarusian or have Belarusian nationality.
alternative label: Bi Belarusians
alternative label: Bisexual Belarusians
broader: https://homosaurus.org/v3/homoit0003306
change note: Version 3.7.0
has top concept: LGBTQ+ people
in scheme: v3

Belarusian gay men
type: Concept
issued: 2024-06-10
modified: 2025-02-23
comment: Gay men who are ethnically Belarusian or have Belarusian nationality.
alternative label: Gay Belarusians
broader: https://homosaurus.org/v3/homoit0003306
change note: Version 3.7.0
has top concept: LGBTQ+ people
in scheme: v3

Belarusian intersex people
type: Concept
issued: 2024-06-10
modified: 2025-02-23
comment: Intersex people who are ethnically Belarusian or have Belarusian nationality.
alternative label: Intersex Belarusians
broader: https://homosaurus.org/v3/homoit0003306
change note: Version 3.7.0
has top concept: LGBTQ+ people
in scheme: v3

Belarusian lesbians
type: Concept
issued: 2024-06-10
modified: 2025-02-23
comment: Lesbians who are ethnically Belarusian or have Belarusian nationality.
alternative label: Lesbian Belarusians
broader: https://homosaurus.org/v3/homoit0003306
change note: Version 3.7.0
has top concept: LGBTQ+ people
in scheme: v3

Belarusian queer people
type: Concept
issued: 2024-06-10
modified: 2025-02-23
comment: Queer people who are ethnically Belarusian or have Belarusian nationality.
alternative label: Queer Belarusians
broader: https://homosaurus.org/v3/homoit0003306
change note: Version 3.7.0
has top concept: LGBTQ+ people
in scheme: v3

Belarusian non-binary people
type: Concept
issued: 2024-06-10
modified: 2025-02-23
comment: Non-binary people who are ethnically Belarusian or have Belarusian nationality.
alternative label: Belarusian nonbinary people
alternative label: Non-binary Belarusians
alternative label: Nonbinary Belarusians
broader: https://homosaurus.org/v3/homoit0003306
change note: Version 3.7.0
has top concept: LGBTQ+ people
in scheme: v3

Belarusian transgender people
type: Concept
issued: 2024-06-10
modified: 2025-02-23
comment: Trans people who are ethnically Belarusian or have Belarusian nationality.
alternative label: Belarusian trans people
alternative label: Trans Belarusians
alternative label: Transgender Belarusians
broader: https://homosaurus.org/v3/homoit0003306
change note: Version 3.7.0
has top concept: LGBTQ+ people
in scheme: v3

Belarusian demisexual people
type: Concept
issued: 2024-06-10
modified: 2025-02-23
comment: Demisexual people who are ethnically Belarusian or have Belarusian nationality.
alternative label: Demisexual Belarusians
broader: https://homosaurus.org/v3/homoit0003306
change note: Version 3.7.0
has top concept: LGBTQ+ people
in scheme: v3

Belarusian megasexual people
type: Concept
issued: 2024-06-10
modified: 2025-02-23
comment: Megasexual people who are ethnically Belarusian or have Belarusian nationality.
alternative label: Megasexual Belarusians
broader: https://homosaurus.org/v3/homoit0003306
change note: Version 3.7.0
has top concept: LGBTQ+ people
in scheme: v3

Belarusian greyromantic people
type: Concept
issued: 2024-06-10
modified: 2025-02-23
comment: Greyromantic people who are ethnically Belarusian or have Belarusian nationality.
alternative label: Greyromantic Belarusians
broader: https://homosaurus.org/v3/homoit0003306
change note: Version 3.7.0
has top concept: LGBTQ+ people
in scheme: v3

Belarusian aromantic people
type: Concept
issued: 2024-06-10
modified: 2025-02-23
comment: Aromantic people who are ethnically Belarusian or have Belarusian nationality.
alternative label: Aromantic Belarusians
broader: https://homosaurus.org/v3/homoit0003306
change note: Version 3.7.0
has top concept: LGBTQ+ people
in scheme: v3

Russian LGBTQ+ people
type: Concept
issued: 2024-06-10
modified: 2025-02-23
comment: LGBTQ+ people who are ethnically Russian or have Russian nationality.
alternative label: LGBTQ+ Russians
alternative label: Russians (LGBTQ)
broader: https://homosaurus.org/v3/homoit0000860
change note: Version 3.7.0
has top concept: LGBTQ+ people
in scheme: v3
narrower: https://homosaurus.org/v3/homoit0003320
narrower: https://homosaurus.org/v3/homoit0003321
narrower: https://homosaurus.org/v3/homoit0003322
narrower: https://homosaurus.org/v3/homoit0003323
narrower: https://homosaurus.org/v3/homoit0003324
narrower: https://homosaurus.org/v3/homoit0003325
narrower: https://homosaurus.org/v3/homoit0003326
narrower: https://homosaurus.org/v3/homoit0003327
narrower: https://homosaurus.org/v3/homoit0003328
narrower: https://homosaurus.org/v3/homoit0003329
narrower: https://homosaurus.org/v3/homoit0003330
narrower: https://homosaurus.org/v3/homoit0003331

Russian asexual people
type: Concept
issued: 2024-06-10
modified: 2025-02-23
comment: Asexual people who are ethnically Russian or have Russian nationality.
alternative label: Asexual Russians
broader: https://homosaurus.org/v3/homoit0003319
change note: Version 3.7.0
has top concept: LGBTQ+ people
in scheme: v3

Russian bisexual people
type: Concept
issued: 2024-06-10
modified: 2025-02-23
comment: Bisexual people who are ethnically Russian or have Russian nationality.
alternative label: Bisexual Russians
broader: https://homosaurus.org/v3/homoit0003319
change note: Version 3.7.0
has top concept: LGBTQ+ people
in scheme: v3

Russian gay men
type: Concept
issued: 2024-06-10
modified: 2025-02-23
comment: Gay men who are ethnically Russian or have Russian nationality.
alternative label: Gay Russians
broader: https://homosaurus.org/v3/homoit0003319
change note: Version 3.7.0
has top concept: LGBTQ+ people
in scheme: v3

Russian intersex people
type: Concept
issued: 2024-06-10
modified: 2025-02-23
comment: Intersex people who are ethnically Russian or have Russian nationality.
alternative label: Intersex Russians
broader: https://homosaurus.org/v3/homoit0003319
change note: Version 3.7.0
has top concept: LGBTQ+ people
in scheme: v3

Russian lesbians
type: Concept
issued: 2024-06-10
modified: 2025-02-23
comment: Lesbians who are ethnically Russian or have Russian nationality.
alternative label: Lesbian Russians
broader: https://homosaurus.org/v3/homoit0003319
change note: Version 3.7.0
has top concept: LGBTQ+ people
in scheme: v3

Russian queer people
type: Concept
issued: 2024-06-10
modified: 2025-02-23
comment: Queer people who are ethnically Russian or have Russian nationality.
alternative label: Queer Russians
broader: https://homosaurus.org/v3/homoit0003319
change note: Version 3.7.0
has top concept: LGBTQ+ people
in scheme: v3

Russian non-binary people
type: Concept
issued: 2024-06-10
modified: 2025-02-23
comment: Non-binary people who are ethnically Russian or have Russian nationality.
alternative label: Non-binary Russians
alternative label: Nonbinary Russians
alternative label: Russian nonbinary people
broader: https://homosaurus.org/v3/homoit0003319
change note: Version 3.7.0
has top concept: LGBTQ+ people
in scheme: v3

Russian transgender people
type: Concept
issued: 2024-06-10
modified: 2025-02-23
comment: Trans people who are ethnically Russian or have Russian nationality.
alternative label: Russian trans people
alternative label: Trans Russians
alternative label: Transgender Russians
broader: https://homosaurus.org/v3/homoit0003319
change note: Version 3.7.0
has top concept: LGBTQ+ people
in scheme: v3

Russian demisexual people
type: Concept
issued: 2024-06-10
modified: 2025-02-23
comment: Demisexual people who are ethnically Russian or have Russian nationality.
alternative label: Demisexual Russians
broader: https://homosaurus.org/v3/homoit0003319
change note: Version 3.7.0
has top concept: LGBTQ+ people
in scheme: v3

Russian megasexual people
type: Concept
issued: 2024-06-10
modified: 2025-02-23
comment: Megasexual people who are ethnically Russian or have Russian nationality.
alternative label: Megasexual Russians
broader: https://homosaurus.org/v3/homoit0003319
change note: Version 3.7.0
has top concept: LGBTQ+ people
in scheme: v3

Russian greyromantic people
type: Concept
issued: 2024-06-10
modified: 2025-02-23
comment: Greyromantic people who are ethnically Russian or have Russian nationality.
alternative label: Greyromantic Russians
broader: https://homosaurus.org/v3/homoit0003319
change note: Version 3.7.0
has top concept: LGBTQ+ people
in scheme: v3

Russian aromantic people
type: Concept
issued: 2024-06-10
modified: 2025-02-23
comment: Aromantic people who are ethnically Russian or have Russian nationality.
alternative label: Aromantic Russians
broader: https://homosaurus.org/v3/homoit0003319
change note: Version 3.7.0
has top concept: LGBTQ+ people
in scheme: v3

Indigenous non-binary people
type: Concept
issued: 2024-06-10
modified: 2025-02-23
comment: Non-binary people who are part of an Indigenous people, or culturally distinct ethnic group whose members are directly descended from the earliest known inhabitants of a particular region and, to some extent, maintain the language and culture of those people. Only use to describe people who identify as Indigenous; use more specific terms whenever possible.
alternative label: Indigenous nonbinary people
alternative label: Non-binary Indigenous people
alternative label: Nonbinary Indigenous people
broader: https://homosaurus.org/v3/homoit0000886
change note: Version 3.7.0
has top concept: LGBTQ+ people
in scheme: v3

Ukrainian LGBTQ+ people
type: Concept
issued: 2024-06-19
modified: 2025-02-23
comment: LGBTQ+ people who are ethnically Ukrainian or have Ukrainian nationality.
alternative label: LGBTQ+ Ukrainians
alternative label: Ukrainians (LGBTQ)
broader: https://homosaurus.org/v3/homoit0000860
change note: Version 3.7.0
has top concept: LGBTQ+ people
in scheme: v3
narrower: https://homosaurus.org/v3/homoit0003335
narrower: https://homosaurus.org/v3/homoit0003336
narrower: https://homosaurus.org/v3/homoit0003337
narrower: https://homosaurus.org/v3/homoit0003338
narrower: https://homosaurus.org/v3/homoit0003339
narrower: https://homosaurus.org/v3/homoit0003340
narrower: https://homosaurus.org/v3/homoit0003341
narrower: https://homosaurus.org/v3/homoit0003342
narrower: https://homosaurus.org/v3/homoit0003343
narrower: https://homosaurus.org/v3/homoit0003344
narrower: https://homosaurus.org/v3/homoit0003345
narrower: https://homosaurus.org/v3/homoit0003346

Ukrainian asexual people
type: Concept
issued: 2024-06-19
modified: 2025-02-23
comment: Asexual people who are ethnically Ukrainian or have Ukrainian nationality.
alternative label: Asexual Ukrainians
broader: https://homosaurus.org/v3/homoit0003334
change note: Version 3.7.0
has top concept: LGBTQ+ people
in scheme: v3

Ukrainian bisexual people
type: Concept
issued: 2024-06-19
modified: 2025-02-23
comment: Bisexual people who are ethnically Ukrainian or have Ukrainian nationality.
alternative label: Bi Ukrainians
alternative label: Bisexual Ukrainians
broader: https://homosaurus.org/v3/homoit0003334
change note: Version 3.7.0
has top concept: LGBTQ+ people
in scheme: v3

Ukrainian gay men
type: Concept
issued: 2024-06-19
modified: 2025-02-23
comment: Gay men who are ethnically Ukrainian or have Ukrainian nationality.
alternative label: Gay Ukrainians
broader: https://homosaurus.org/v3/homoit0003334
change note: Version 3.7.0
has top concept: LGBTQ+ people
in scheme: v3

Ukrainian intersex people
type: Concept
issued: 2024-06-19
modified: 2025-02-23
comment: Intersex people who are ethnically Ukrainian or have Ukrainian nationality.
alternative label: Intersex Ukrainians
broader: https://homosaurus.org/v3/homoit0003334
change note: Version 3.7.0
has top concept: LGBTQ+ people
in scheme: v3

Ukrainian lesbians
type: Concept
issued: 2024-06-19
modified: 2025-02-23
comment: Lesbians who are ethnically Ukrainian or have Ukrainian nationality.
alternative label: Lesbian Ukrainians
broader: https://homosaurus.org/v3/homoit0003334
change note: Version 3.7.0
has top concept: LGBTQ+ people
in scheme: v3

Ukrainian queer people
type: Concept
issued: 2024-06-19
modified: 2025-02-23
comment: Queer people who are ethnically Ukrainian or have Ukrainian nationality.
alternative label: Queer Ukrainians
broader: https://homosaurus.org/v3/homoit0003334
change note: Version 3.7.0
has top concept: LGBTQ+ people
in scheme: v3

Ukrainian non-binary people
type: Concept
issued: 2024-06-19
modified: 2025-02-23
comment: Non-binary people who are ethnically Ukrainian or have Ukrainian nationality.
alternative label: Non-binary Ukrainians
alternative label: Nonbinary Ukrainians
alternative label: Ukrainian nonbinary people
broader: https://homosaurus.org/v3/homoit0003334
change note: Version 3.7.0
has top concept: LGBTQ+ people
in scheme: v3

Ukrainian transgender people
type: Concept
issued: 2024-06-19
modified: 2025-02-23
comment: Trans people who are ethnically Ukrainian or have Ukrainian nationality.
alternative label: Trans Ukrainians
alternative label: Transgender Ukrainians
alternative label: Ukrainian trans people
broader: https://homosaurus.org/v3/homoit0003334
change note: Version 3.7.0
has top concept: LGBTQ+ people
in scheme: v3

Ukrainian demisexual people
type: Concept
issued: 2024-06-19
modified: 2025-02-23
comment: Demisexual people who are ethnically Ukrainian or have Ukrainian nationality.
alternative label: Demisexual Ukrainians
broader: https://homosaurus.org/v3/homoit0003334
change note: Version 3.7.0
has top concept: LGBTQ+ people
in scheme: v3

Ukrainian megasexual people
type: Concept
issued: 2024-06-19
modified: 2025-02-23
comment: Megasexual people who are ethnically Ukrainian or have Ukrainian nationality.
alternative label: Megasexual Ukrainians
broader: https://homosaurus.org/v3/homoit0003334
change note: Version 3.7.0
has top concept: LGBTQ+ people
in scheme: v3

Ukrainian greyromantic people
type: Concept
issued: 2024-06-19
modified: 2025-02-23
comment: Greyromantic people who are ethnically Ukrainian or have Ukrainian nationality.
alternative label: Greyromantic Ukrainians
broader: https://homosaurus.org/v3/homoit0003334
change note: Version 3.7.0
has top concept: LGBTQ+ people
in scheme: v3

Ukrainian aromantic people
type: Concept
issued: 2024-06-19
modified: 2025-02-23
comment: Aromantic people who are ethnically Ukrainian or have Ukrainian nationality.
alternative label: Aromantic Ukrainians
broader: https://homosaurus.org/v3/homoit0003334
change note: Version 3.7.0
has top concept: LGBTQ+ people
in scheme: v3

LGBTQ+ Unitarian Universalists
type: Concept
issued: 2024-06-19
modified: 2025-02-23
comment: LGBTQ+ people who are members of the Unitarian Universalist church.
alternative label: LGBTQ Unitarian Universalists
alternative label: Unitarian Universalist LGBTQ+ people
broader: https://homosaurus.org/v3/homoit0000928
change note: Version 3.7.0
has top concept: LGBTQ+ religious people
in scheme: v3
narrower: https://homosaurus.org/v3/homoit0003348
narrower: https://homosaurus.org/v3/homoit0003349
narrower: https://homosaurus.org/v3/homoit0003350
narrower: https://homosaurus.org/v3/homoit0003351
narrower: https://homosaurus.org/v3/homoit0003352
narrower: https://homosaurus.org/v3/homoit0003353
narrower: https://homosaurus.org/v3/homoit0003354
narrower: https://homosaurus.org/v3/homoit0003355
narrower: https://homosaurus.org/v3/homoit0003356
narrower: https://homosaurus.org/v3/homoit0003357
narrower: https://homosaurus.org/v3/homoit0003358

Lesbian Unitarian Universalists
type: Concept
issued: 2024-06-19
modified: 2025-02-23
comment: Lesbians who are members of the Unitarian Universalist church.
alternative label: Unitarian Universalist lesbians
broader: https://homosaurus.org/v3/homoit0003347
change note: Version 3.7.0
has top concept: LGBTQ+ religious people
in scheme: v3

Gay Unitarian Universalists
type: Concept
issued: 2024-06-19
modified: 2025-02-23
comment: Gay men who are members of the Unitarian Universalist church.
alternative label: Unitarian Universalist gay men
broader: https://homosaurus.org/v3/homoit0003347
change note: Version 3.7.0
has top concept: LGBTQ+ religious people
in scheme: v3

Bisexual Unitarian Universalists
type: Concept
issued: 2024-06-19
modified: 2025-02-23
comment: Bisexual people who are members of the Unitarian Universalist church.
alternative label: Unitarian Universalist bisexual people
alternative label: Unitarian Universalist bisexuals
broader: https://homosaurus.org/v3/homoit0003347
change note: Version 3.7.0
has top concept: LGBTQ+ religious people
in scheme: v3

Transgender Unitarian Universalists
type: Concept
issued: 2024-06-19
modified: 2025-02-23
comment: Transgender people who are members of the Unitarian Universalist church.
alternative label: Trans Unitarian Universalists
alternative label: Unitarian Universalist trans people
alternative label: Unitarian Universalist transgender people
broader: https://homosaurus.org/v3/homoit0003347
change note: Version 3.7.0
has top concept: LGBTQ+ religious people
in scheme: v3

Queer Unitarian Universalists
type: Concept
issued: 2024-06-19
modified: 2025-02-23
comment: Queer people who are members of the Unitarian Universalist church.
alternative label: Unitarian Universalist queer people
broader: https://homosaurus.org/v3/homoit0003347
change note: Version 3.7.0
has top concept: LGBTQ+ religious people
in scheme: v3

Demisexual Unitarian Universalists
type: Concept
issued: 2024-06-19
modified: 2025-02-23
comment: Demisexual people who are members of the Unitarian Universalist church.
alternative label: Unitarian Universalist demisexual people
alternative label: Unitarian Universalist demisexuals
broader: https://homosaurus.org/v3/homoit0003347
change note: Version 3.7.0
has top concept: LGBTQ+ religious people
in scheme: v3

Megasexual Unitarian Universalists
type: Concept
issued: 2024-06-19
modified: 2025-02-23
comment: Megasexual people who are members of the Unitarian Universalist church.
alternative label: Unitarian Universalist megasexual people
alternative label: Unitarian Universalist megasexuals
broader: https://homosaurus.org/v3/homoit0003347
change note: Version 3.7.0
has top concept: LGBTQ+ religious people
in scheme: v3

Intersex Unitarian Universalists
type: Concept
issued: 2024-06-19
modified: 2025-02-23
comment: Intersex people who are members of the Unitarian Universalist church.
alternative label: Unitarian Universalist intersex people
broader: https://homosaurus.org/v3/homoit0003347
change note: Version 3.7.0
has top concept: LGBTQ+ religious people
in scheme: v3

Aromantic Unitarian Universalists
type: Concept
issued: 2024-06-19
modified: 2025-02-23
comment: Aromantic people who are members of the Unitarian Universalist church.
alternative label: Unitarian Universalist aromantic people
broader: https://homosaurus.org/v3/homoit0003347
change note: Version 3.7.0
has top concept: LGBTQ+ religious people
in scheme: v3

Greyromantic Unitarian Universalists
type: Concept
issued: 2024-06-19
modified: 2025-02-23
comment: Greyromantic people who are members of the Unitarian Universalist church.
alternative label: Unitarian Universalist greyromantic people
broader: https://homosaurus.org/v3/homoit0003347
change note: Version 3.7.0
has top concept: LGBTQ+ religious people
in scheme: v3

Non-binary Unitarian Universalists
type: Concept
issued: 2024-06-19
modified: 2025-02-23
comment: Non-binary people who are members of the Unitarian Universalist church.
alternative label: Nonbinary Unitarian Universalists
alternative label: Unitarian Universalist non-binary people
alternative label: Unitarian Universalist nonbinary people
broader: https://homosaurus.org/v3/homoit0003347
change note: Version 3.7.0
has top concept: LGBTQ+ religious people
in scheme: v3

Drag shows
type: Concept
issued: 2024-06-19
modified: 2025-02-23
comment: Performances by a single drag performer or a group of drag performers, which often include singing or lip syncing, dance routines, and comedy skits.
alternative label: Drag performances
broader: https://homosaurus.org/v3/homoit0000861
change note: Version 3.7.0
has top concept: LGBTQ+ events
in scheme: v3
related: https://homosaurus.org/v3/homoit0000367
related: https://homosaurus.org/v3/homoit0000369
related: https://homosaurus.org/v3/homoit0001906
related: https://homosaurus.org/v3/homoit0003816
related: https://homosaurus.org/v3/homoit0003817

Drag pageants
type: Concept
issued: 2024-06-19
modified: 2025-02-23
comment: Events styled after traditional beauty pageants or contests in which contestants, typically drag queens, female impersonators, and trans women, compete in a range of categories to win a prize or title.
broader: https://homosaurus.org/v3/homoit0000861
change note: Version 3.7.0
has top concept: LGBTQ+ events
in scheme: v3
related: https://homosaurus.org/v3/homoit0000367
related: https://homosaurus.org/v3/homoit0000369
related: https://homosaurus.org/v3/homoit0001906

Reproductive health care for LGBTQ+ people
type: Concept
issued: 2024-06-19
modified: 2025-02-23
comment: Access to and experiences with reproductive health care for LGBTQ+ people. Reproductive health care includes birth control, abortion, assisted reproduction, and prenatal and obstetric care.
alternative label: LGBTQ+ reproductive health care
alternative label: Reproductive health care (LGBTQ)
alternative label: Reproductive healthcare for LGBTQ+ people
broader: https://homosaurus.org/v3/homoit0000614
change note: Version 3.7.0
has top concept: Health care for LGBTQ+ people
in scheme: v3
narrower: https://homosaurus.org/v3/homoit0003362
narrower: https://homosaurus.org/v3/homoit0003363
narrower: https://homosaurus.org/v3/homoit0003365
narrower: https://homosaurus.org/v3/homoit0003366
narrower: https://homosaurus.org/v3/homoit0003844
related: https://homosaurus.org/v3/homoit0003366
related: https://homosaurus.org/v3/homoit0003368
related: https://homosaurus.org/v3/homoit0003369
related: https://homosaurus.org/v3/homoit0003593

Reproductive health care for non-binary people
type: Concept
issued: 2024-06-19
modified: 2025-02-23
comment: Access to and experiences with reproductive health care for non-binary people. Reproductive health care includes birth control, abortion, assisted reproduction, and prenatal and obstetric care.
alternative label: Non-binary reproductive health care
alternative label: Reproductive health care for nonbinary people
alternative label: Reproductive healthcare for non-binary people
broader: https://homosaurus.org/v3/homoit0003361
change note: Version 3.7.0
has top concept: Health care for LGBTQ+ people
in scheme: v3

Reproductive health care for transgender people
type: Concept
issued: 2024-06-19
modified: 2025-02-23
comment: Access to and experiences with reproductive health care for transgender people. Reproductive health care includes birth control, abortion, assisted reproduction, and prenatal and obstetric care.
alternative label: Reproductive health care for trans people
alternative label: Reproductive healthcare for transgender people
alternative label: Trans reproductive health care
alternative label: Transgender reproductive health care
broader: https://homosaurus.org/v3/homoit0003361
change note: Version 3.7.0
has top concept: Health care for LGBTQ+ people
in scheme: v3

Abortion
type: Concept
issued: 2024-06-19
modified: 2025-02-23
comment: The termination of a pregnancy.
alternative label: Pregnancy termination
alternative label: Termination of pregnancy
broader: https://homosaurus.org/v3/homoit0003361
change note: Version 3.7.0
has top concept: Health care for LGBTQ+ people
in scheme: v3
related: https://homosaurus.org/v3/homoit0003366
related: https://homosaurus.org/v3/homoit0003369

Abortion access for LGBTQ+ people
type: Concept
issued: 2024-06-19
modified: 2025-02-23
comment: Term used to describe the various aspects determining whether abortions are accessible to LGBTQ+ people in a given location. Factors determining accessibility include legality, safety, privacy, financial cost, freedom of travel, etc.
broader: https://homosaurus.org/v3/homoit0003361
change note: Version 3.7.0
has top concept: Health care for LGBTQ+ people
in scheme: v3
related: https://homosaurus.org/v3/homoit0003361
related: https://homosaurus.org/v3/homoit0003365
related: https://homosaurus.org/v3/homoit0003367
related: https://homosaurus.org/v3/homoit0003368

Rural LGBTQ+ people
type: Concept
issued: 2024-07-11
modified: 2025-02-23
comment: LGBTQ+ people who are currently living in or consider themselves to be from agricultural or forested areas with low population densities.
alternative label: Rural LGBTQ people
alternative label: Rural people (LGBTQ+)
broader: https://homosaurus.org/v3/homoit0000915
change note: Version 3.7.0
has top concept: LGBTQ+ people
in scheme: v3
narrower: https://homosaurus.org/v3/homoit0003371
narrower: https://homosaurus.org/v3/homoit0003372
narrower: https://homosaurus.org/v3/homoit0003373
narrower: https://homosaurus.org/v3/homoit0003374
narrower: https://homosaurus.org/v3/homoit0003375
narrower: https://homosaurus.org/v3/homoit0003376
narrower: https://homosaurus.org/v3/homoit0003377
narrower: https://homosaurus.org/v3/homoit0003378
narrower: https://homosaurus.org/v3/homoit0003379
related: https://homosaurus.org/v3/homoit0003380

Rural lesbians
type: Concept
issued: 2024-07-11
modified: 2025-02-23
comment: Lesbians who are currently living in or consider themselves to be from agricultural or forested areas with low population densities.
broader: https://homosaurus.org/v3/homoit0003370
change note: Version 3.7.0
has top concept: LGBTQ+ people
in scheme: v3

Rural gay men
type: Concept
issued: 2024-07-11
modified: 2025-02-23
comment: Gay men who are currently living in or consider themselves to be from agricultural or forested areas with low population densities.
alternative label: Gay rural men
broader: https://homosaurus.org/v3/homoit0003370
change note: Version 3.7.0
has top concept: LGBTQ+ people
in scheme: v3

Rural bisexual people
type: Concept
issued: 2024-07-11
modified: 2025-02-23
comment: Bisexual people who are currently living in or consider themselves to be from agricultural or forested areas with low population densities.
alternative label: Bisexual rural people
broader: https://homosaurus.org/v3/homoit0003370
change note: Version 3.7.0
has top concept: LGBTQ+ people
in scheme: v3

Rural transgender people
type: Concept
issued: 2024-07-11
modified: 2025-02-23
comment: Transgender people who are currently living in or consider themselves to be from agricultural or forested areas with low population densities.
alternative label: Rural trans people
alternative label: Trans rural people
alternative label: Transgender rural people
broader: https://homosaurus.org/v3/homoit0003370
change note: Version 3.7.0
has top concept: LGBTQ+ people
in scheme: v3

Rural queer people
type: Concept
issued: 2024-07-11
modified: 2025-02-23
comment: Queer people who are currently living in or consider themselves to be from agricultural or forested areas with low population densities.
alternative label: Queer rural people
broader: https://homosaurus.org/v3/homoit0003370
change note: Version 3.7.0
has top concept: LGBTQ+ people
in scheme: v3

Rural asexual people
type: Concept
issued: 2024-07-11
modified: 2025-02-23
comment: Asexual people who are currently living in or consider themselves to be from agricultural or forested areas with low population densities.
alternative label: Asexual rural people
broader: https://homosaurus.org/v3/homoit0003370
change note: Version 3.7.0
has top concept: LGBTQ+ people
in scheme: v3

Rural aromantic people
type: Concept
issued: 2024-07-11
modified: 2025-02-23
comment: Aromantic people who are currently living in or consider themselves to be from agricultural or forested areas with low population densities.
alternative label: Aromantic rural people
broader: https://homosaurus.org/v3/homoit0003370
change note: Version 3.7.0
has top concept: LGBTQ+ people
in scheme: v3

Rural intersex people
type: Concept
issued: 2024-07-11
modified: 2025-02-23
comment: Intersex people who are currently living in or consider themselves to be from agricultural or forested areas with low population densities.
alternative label: Intersex rural people
broader: https://homosaurus.org/v3/homoit0003370
change note: Version 3.7.0
has top concept: LGBTQ+ people
in scheme: v3

Rural non-binary people
type: Concept
issued: 2024-07-11
modified: 2025-02-23
comment: Non-binary people who are currently living in or consider themselves to be from agricultural or forested areas with low population densities.
alternative label: Non-binary rural people
alternative label: Nonbinary rural people
alternative label: Rural nonbinary people
broader: https://homosaurus.org/v3/homoit0003370
change note: Version 3.7.0
has top concept: LGBTQ+ people
in scheme: v3

Rural Two-Spirit people
type: Concept
issued: 2024-07-11
modified: 2025-02-23
comment: Two-Spirit people who are currently living in or consider themselves to be from agricultural or forested areas with low population densities.
alternative label: 2S rural people
alternative label: Rural 2S people
alternative label: Rural Two Spirit people
alternative label: Rural Two Spirited people
alternative label: Rural Two-Spirited people
alternative label: Two Spirit rural people
alternative label: Two Spirited rural people
alternative label: Two-Spirit rural people
alternative label: Two-Spirited rural people
broader: https://homosaurus.org/v3/homoit0001480
change note: Version 3.7.0
has top concept: Gender
in scheme: v3
related: https://homosaurus.org/v3/homoit0003370

White non-binary people
type: Concept
issued: 2024-07-11
modified: 2025-02-23
comment: Non-binary people who are white.
alternative label: Non-binary Caucasian people
alternative label: Non-binary Caucasians
alternative label: Non-binary white people
alternative label: Nonbinary Caucasian people
alternative label: Nonbinary Caucasians
alternative label: Nonbinary white people
alternative label: White nonbinary people
broader: https://homosaurus.org/v3/homoit0000243
change note: Version 3.7.0
has top concept: White LGBTQ+ people
in scheme: v3

Arab American LGBTQ+ people
type: Concept
issued: 2024-07-11
modified: 2025-02-23
comment: LGBTQ+ people who are descended from Arab peoples and were born in the United States, or LGBTQ+ people born in Arab countries who live in or have a strong connection to the United States. Do not conflate with Muslim people.
alternative label: Arab American people (LGBTQ
alternative label: Arab Americans (LGBTQ)
alternative label: LGBTQ+ Arab Americans
broader: https://homosaurus.org/v3/homoit0002009
change note: Version 3.7.0
has top concept: LGBTQ+ people
in scheme: v3
narrower: https://homosaurus.org/v3/homoit0003383
narrower: https://homosaurus.org/v3/homoit0003384
narrower: https://homosaurus.org/v3/homoit0003385
narrower: https://homosaurus.org/v3/homoit0003386
narrower: https://homosaurus.org/v3/homoit0003387
narrower: https://homosaurus.org/v3/homoit0003388
narrower: https://homosaurus.org/v3/homoit0003389
narrower: https://homosaurus.org/v3/homoit0003390
narrower: https://homosaurus.org/v3/homoit0003391

Arab American lesbians
type: Concept
issued: 2024-07-11
modified: 2025-02-23
comment: Lesbians who are descended from Arab peoples and were born in the United States, or lesbians born in Arab countries who live in or have a strong connection to the United States. Do not conflate with Muslim people.
alternative label: Lesbian Arab American people
alternative label: Lesbian Arab Americans
broader: https://homosaurus.org/v3/homoit0003382
change note: Version 3.7.0
has top concept: LGBTQ+ people
in scheme: v3

Arab American gay men
type: Concept
issued: 2024-07-11
modified: 2025-02-23
comment: Gay men who are descended from Arab peoples and were born in the United States, or gay men born in Arab countries who live in or have a strong connection to the United States. Do not conflate with Muslim people.
alternative label: Gay Arab American men
alternative label: Gay Arab Americans
broader: https://homosaurus.org/v3/homoit0003382
change note: Version 3.7.0
has top concept: LGBTQ+ people
in scheme: v3

Arab American bisexual people
type: Concept
issued: 2024-07-11
modified: 2025-02-23
comment: Bisexual people who are descended from Arab peoples and were born in the United States, or bisexual people born in Arab countries who live in or have a strong connection to the United States. Do not conflate with Muslim people.
alternative label: Bisexual Arab American people
alternative label: Bisexual Arab Americans
broader: https://homosaurus.org/v3/homoit0003382
change note: Version 3.7.0
has top concept: LGBTQ+ people
in scheme: v3

Arab American transgender people
type: Concept
issued: 2024-07-11
modified: 2025-02-23
comment: Transgender people who are descended from Arab peoples and were born in the United States, or transgender people born in Arab countries who live in or have a strong connection to the United States. Do not conflate with Muslim people.
alternative label: Transgender Arab American people
alternative label: Transgender Arab Americans
broader: https://homosaurus.org/v3/homoit0003382
change note: Version 3.7.0
has top concept: LGBTQ+ people
in scheme: v3

Arab American queer people
type: Concept
issued: 2024-07-11
modified: 2025-02-23
comment: Queer people who are descended from Arab peoples and were born in the United States, or Queer people born in Arab countries who live in or have a strong connection to the United States. Do not conflate with Muslim people.
alternative label: Queer Arab American people
alternative label: Queer Arab Americans
broader: https://homosaurus.org/v3/homoit0003382
change note: Version 3.7.0
has top concept: LGBTQ+ people
in scheme: v3

Arab American non-binary people
type: Concept
issued: 2024-07-11
modified: 2025-02-23
comment: Non-binary people who are descended from Arab peoples and were born in the United States, or non-binary people born in Arab countries who live in or have a strong connection to the United States. Do not conflate with Muslim people.
alternative label: Arab American nonbinary people
alternative label: Non-binary Arab American people
alternative label: Non-binary Arab Americans
alternative label: Nonbinary Arab American people
alternative label: Nonbinary Arab Americans
broader: https://homosaurus.org/v3/homoit0003382
change note: Version 3.7.0
has top concept: LGBTQ+ people
in scheme: v3

Arab American asexual people
type: Concept
issued: 2024-07-11
modified: 2025-02-23
comment: Asexual people who are descended from Arab peoples and were born in the United States, or asexual people born in Arab countries who live in or have a strong connection to the United States. Do not conflate with Muslim people.
alternative label: Asexual Arab American people
alternative label: Asexual Arab Americans
broader: https://homosaurus.org/v3/homoit0003382
change note: Version 3.7.0
has top concept: LGBTQ+ people
in scheme: v3

Arab American intersex people
type: Concept
issued: 2024-07-11
modified: 2025-02-23
comment: Intersex people who are descended from Arab peoples and were born in the United States, or intersex people born in Arab countries who live in or have a strong connection to the United States. Do not conflate with Muslim people.
alternative label: Intersex Arab American people
alternative label: Intersex Arab Americans
broader: https://homosaurus.org/v3/homoit0003382
change note: Version 3.7.0
has top concept: LGBTQ+ people
in scheme: v3

Arab American aromantic people
type: Concept
issued: 2024-07-11
modified: 2025-02-23
comment: Aromantic people who are descended from Arab peoples and were born in the United States, or aromantic people born in Arab countries who live in or have a strong connection to the United States. Do not conflate with Muslim people.
alternative label: Aromantic Arab American people
alternative label: Aromantic Arab Americans
broader: https://homosaurus.org/v3/homoit0003382
change note: Version 3.7.0
has top concept: LGBTQ+ people
in scheme: v3

Arab aromantic people
type: Concept
issued: 2024-07-11
modified: 2025-02-23
comment: Aromantic people who are from Arab countries and/or are descended from Arab peoples. Do not conflate with Muslim people.
alternative label: Aromantic Arab people
alternative label: Aromantic Arabs
broader: https://homosaurus.org/v3/homoit0002009
change note: Version 3.7.0
has top concept: LGBTQ+ people
in scheme: v3

Aboriginal Australian non-binary people
type: Concept
issued: 2024-07-11
modified: 2025-02-23
comment: Non-binary people who belong to one or more of the various Indigenous peoples of Australia; do not use to refer to the Indigenous people of the Torres Strait Islands, who are considered ethnically and culturally distinct. Only use to describe people who identify as Aboriginal Australian.
alternative label: Non-binary Aboriginal Australian people
alternative label: Non-binary Aboriginal Australians
alternative label: Nonbinary Aboriginal Australian people
alternative label: Nonbinary Aboriginal Australians
broader: https://homosaurus.org/v3/homoit0000002
change note: Version 3.7.0
has top concept: LGBTQ+ people
in scheme: v3

Assamese non-binary people
type: Concept
issued: 2024-07-11
modified: 2025-02-23
comment: Non-binary people who are a part of the socio-ethnic Assamese peoples, speak the Assamese language, or reside in the Indian state of Assam.
alternative label: Non-binary Asomiya
alternative label: Non-binary Assamese people
alternative label: Nonbinary Asomiya
alternative label: Nonbinary Assamese people
broader: https://homosaurus.org/v3/homoit0002060
change note: Version 3.7.0
has top concept: LGBTQ+ people
in scheme: v3

Awadhi non-binary people
type: Concept
issued: 2024-07-11
modified: 2025-02-23
comment: Non-binary people who speak the Awadhi dialect and reside in or are descended from those who resided in the Awadh region of Uttar Pradesh.
alternative label: Non-binary Awadhi people
alternative label: Non-binary Awadhis
alternative label: Nonbinary Awadhi people
alternative label: Nonbinary Awadhis
broader: https://homosaurus.org/v3/homoit0002070
change note: Version 3.7.0
has top concept: LGBTQ+ people
in scheme: v3

Bengali non-binary people
type: Concept
issued: 2024-07-11
modified: 2025-02-23
comment: Non-binary people who speak the Bengali language or are of Bengali descent.
alternative label: Non-binary Bengali people
alternative label: Non-binary Bengalis
alternative label: Nonbinary Bengali people
alternative label: Nonbinary Bengalis
broader: https://homosaurus.org/v3/homoit0002086
change note: Version 3.7.0
has top concept: LGBTQ+ people
in scheme: v3

Bhil non-binary people
type: Concept
issued: 2024-07-11
modified: 2025-02-23
comment: Non-binary people who speak the Bhil language and belong to or are descended from the Bhil tribal group.
alternative label: Bheel non-binary people
alternative label: Bheel nonbinary people
alternative label: Non-binary Bhils
alternative label: Nonbinary Bhils
broader: https://homosaurus.org/v3/homoit0002094
change note: Version 3.7.0
has top concept: LGBTQ+ people
in scheme: v3

Bhojpuri non-binary people
type: Concept
issued: 2024-07-11
modified: 2025-02-23
comment: Non-binary people who speak the Bhojpuri language and live in or are descended from those who inhabited the Bhojpuri-Purvanchal region of India and Nepal.
alternative label: Non-binary Bhojpuri people
alternative label: Non-binary Bhojpuriyas
alternative label: Nonbinary Bhojpuri people
alternative label: Nonbinary Bhojpuriyas
broader: https://homosaurus.org/v3/homoit0002078
change note: Version 3.7.0
has top concept: LGBTQ+ people
in scheme: v3

Biracial non-binary people
type: Concept
issued: 2024-07-11
modified: 2025-02-23
comment: Non-binary people who belong to two or more racial groups. Only use to describe people who self-identify as biracial.
alternative label: Bi-racial non-binary people
alternative label: Bi-racial nonbinary people
alternative label: Non-binary bi-racial people
alternative label: Non-binary biracial people
alternative label: Nonbinary bi-racial people
alternative label: Nonbinary biracial people
broader: https://homosaurus.org/v3/homoit0000820
change note: Version 3.7.0
has top concept: LGBTQ+ people
in scheme: v3

Black non-binary people
type: Concept
issued: 2024-07-11
modified: 2025-02-23
comment: Black people who are non-binary. Use only for individuals who self-identity as Black. Follow the individual’s preference for African American or Black whenever possible.
alternative label: Black nonbinary people
alternative label: Non-binary Black people
alternative label: Nonbinary Black people
broader: https://homosaurus.org/v3/homoit0000208
change note: Version 3.7.0
has top concept: LGBTQ+ people
in scheme: v3

Chakma non-binary people
type: Concept
issued: 2024-07-11
modified: 2025-02-23
comment: Non-binary people who belong to or are descended from the Chakma tribal group.
alternative label: Chakma nonbinary people
alternative label: Non-binary Chakma people
alternative label: Nonbinary Chakma people
broader: https://homosaurus.org/v3/homoit0002102
change note: Version 3.7.0
has top concept: LGBTQ+ people
in scheme: v3

Chicano/a/x non-binary people
type: Concept
issued: 2024-07-11
modified: 2025-02-23
comment: Non-binary people of Mexican descent born in the United States; only use to describe people who self-identify as Chicano, Chicana, or Chicanx. Do not conflate with Latino/a/x or Hispanic people.
alternative label: Chicana non-binary people
alternative label: Chicano non-binary people
alternative label: Chicanx non-binary people
alternative label: Non-binary Chicanas
alternative label: Non-binary Chicanos
alternative label: Non-binary Chicanx people
alternative label: Nonbinary Chicanas
alternative label: Nonbinary Chicanos
alternative label: Nonbinary Chicanx people
broader: https://homosaurus.org/v3/homoit0002007
change note: Version 3.7.0
has top concept: LGBTQ+ people
in scheme: v3

Closeted non-binary people
type: Concept
issued: 2024-07-11
modified: 2025-02-23
comment: Non-binary people who do not identify as such to others.
alternative label: Closeted nonbinary people
broader: https://homosaurus.org/v3/homoit0001783
change note: Version 3.7.0
has top concept: LGBTQ+ people
in scheme: v3

Daughters of non-binary people
type: Concept
issued: 2024-07-11
modified: 2025-02-23
comment: Daughters who have one or more non-binary parent.
alternative label: Daughters of nonbinary people
broader: https://homosaurus.org/v3/homoit0002352
change note: Version 3.7.0
has top concept: Family members
in scheme: v3

Dogra non-binary people
type: Concept
issued: 2024-07-11
modified: 2025-02-23
comment: Non-binary people who are of the Dogra people of India and Pakistan and speak the Dogri language.
alternative label: Dogra nonbinary people
alternative label: Non-binary Dogra people
alternative label: Non-binary Dogras
alternative label: Nonbinary Dogra people
alternative label: Nonbinary Dogras
broader: https://homosaurus.org/v3/homoit0002126
change note: Version 3.7.0
has top concept: LGBTQ+ people
in scheme: v3

Fathers of non-binary people
type: Concept
issued: 2024-07-11
modified: 2025-02-23
comment: People who assume the role of father to non-binary people. Only use to describe individuals who identify as fathers.
alternative label: Fathers of nonbinary people
broader: https://homosaurus.org/v3/homoit0002342
change note: Version 3.7.0
has top concept: Family members
in scheme: v3

Garhwali non-binary people
type: Concept
issued: 2024-07-11
modified: 2025-02-23
comment: Non-binary people who belong to or are descended from those native to Garhwal in Uttarakhand and who speak Garhwali.
alternative label: Garhwali nonbinary people
alternative label: Non-binary Garhwali people
alternative label: Non-binary Garhwalis
alternative label: Nonbinary Garhwali people
alternative label: Nonbinary Garhwalis
broader: https://homosaurus.org/v3/homoit0002134
change note: Version 3.7.0
has top concept: LGBTQ+ people
in scheme: v3

Gujarati non-binary people
type: Concept
issued: 2024-07-11
modified: 2025-02-23
comment: Non-binary people who reside in or are descended from those indigenous to the Indian state of Gujarat.
alternative label: Gujarati nonbinary people
alternative label: Non-binary Gujarati people
alternative label: Non-binary Gujaratis
alternative label: Nonbinary Gujarati people
alternative label: Nonbinary Gujaratis
broader: https://homosaurus.org/v3/homoit0002231
change note: Version 3.7.0
has top concept: LGBTQ+ people
in scheme: v3

Haryanvi non-binary people
type: Concept
issued: 2024-07-11
modified: 2025-02-23
comment: Non-binary people who are indigenous to or descended from those indigenous to what is now the Indian state of Haryana. This term can also apply to those who currently reside in Haryana.
alternative label: Haryanvi nonbinary people
alternative label: Non-binary Haryanvi people
alternative label: Non-binary Haryanvis
alternative label: Nonbinary Haryanvi people
alternative label: Nonbinary Haryanvis
broader: https://homosaurus.org/v3/homoit0002239
change note: Version 3.7.0
has top concept: LGBTQ+ people
in scheme: v3

Inuit non-binary people
type: Concept
issued: 2024-07-11
modified: 2025-02-23
comment: Non-binary people who are Inuit, or part of several Indigenous peoples inhabiting the Inuit homeland in the Arctic and subarctic regions of Greenland, Canada, and Alaska. Only use for people who identify as Inuit.
alternative label: Inuit nonbinary people
alternative label: Non-binary Inuit people
alternative label: Non-binary Inuit
alternative label: Nonbinary Inuit people
alternative label: Nonbinary Inuit
broader: https://homosaurus.org/v3/homoit0000676
change note: Version 3.7.0
has top concept: LGBTQ+ people
in scheme: v3

Jewish non-binary people
type: Concept
issued: 2024-07-11
modified: 2025-02-23
comment: Non-binary people who are Jewish.
alternative label: Jewish nonbinary people
alternative label: Non-binary Jewish people
alternative label: Non-binary Jews
alternative label: Nonbinary Jewish people
alternative label: Nonbinary Jews
broader: https://homosaurus.org/v3/homoit0000682
change note: Version 3.7.0
has top concept: LGBTQ+ people
in scheme: v3

Kalash non-binary people
type: Concept
issued: 2024-07-11
modified: 2025-02-23
comment: Non-binary people who belong to the indigenous Kalasha people and reside in the Chitral District of Khyber-Pakhtunkhwa province in Pakistan.
alternative label: Kalash nonbinary people
alternative label: Non-binary Kalash people
alternative label: Non-binary Kalasha
alternative label: Nonbinary Kalash people
alternative label: Nonbinary Kalasha
broader: https://homosaurus.org/v3/homoit0002247
change note: Version 3.7.0
has top concept: LGBTQ+ people
in scheme: v3

Kānaka Maoli non-binary people
type: Concept
issued: 2024-07-11
modified: 2025-02-23
comment: Non-binary people who are part of the Indigenous people of Mokupuni o Hawai‘i, or the Hawaiian Islands; only use to refer to people who identify as Kanaka Maoli.
alternative label: Kanaka Maoli non-binary people
alternative label: Kanaka Maoli nonbinary people
alternative label: Kānaka Maoli nonbinary people
alternative label: Non-binary Kanaka Maoli
alternative label: Non-binary Kānaka Maoli
alternative label: Nonbinary Kanaka Maoli
alternative label: Nonbinary Kānaka Maoli
broader: https://homosaurus.org/v3/homoit0001955
change note: Version 3.7.0
has top concept: LGBTQ+ people
in scheme: v3

Kashmiri non-binary people
type: Concept
issued: 2024-07-11
modified: 2025-02-23
comment: Non-binary people who live in or are descended from those native to the Kashmir Valley in the Indian subcontinent.
alternative label: Kashmiri nonbinary people
alternative label: Non-binary Kashmiri people
alternative label: Non-binary Kashmiris
alternative label: Nonbinary Kashmiri people
alternative label: Nonbinary Kashmiris
broader: https://homosaurus.org/v3/homoit0002295
change note: Version 3.7.0
has top concept: LGBTQ+ people
in scheme: v3

Kho non-binary people
type: Concept
issued: 2024-07-11
modified: 2025-02-23
comment: Non-binary people who belong to or are descended from the people indigenous to the Chitral and Ghizer districts of modern-day Pakistan.
alternative label: Chitrali non-binary people
alternative label: Chitrali nonbinary people
alternative label: Kho nonbinary people
alternative label: Non-binary Kho people
alternative label: Nonbinary Kho people
broader: https://homosaurus.org/v3/homoit0002110
change note: Version 3.7.0
has top concept: LGBTQ+ people
in scheme: v3

Konkan non-binary people
type: Concept
issued: 2024-07-11
modified: 2025-02-23
comment: Non-binary people who are from or descended from those native to the Konkan region of the Indian subcontinent, and who speak any of the dialects of the Konkani language.
alternative label: Konkan nonbinary people
alternative label: Non-binary Konkani people
alternative label: Non-binary Konkani
alternative label: Nonbinary Konkani people
alternative label: Nonbinary Konkani
broader: https://homosaurus.org/v3/homoit0002303
change note: Version 3.7.0
has top concept: LGBTQ+ people
in scheme: v3

Kumaoni non-binary people
type: Concept
issued: 2024-07-11
modified: 2025-02-23
comment: Non-binary people who live mostly in Kumaon region in the Indian Himalayas. They might also speak the Kumaoni language as their first language.
alternative label: Kumain non-binary people
alternative label: Kumain nonbinary people
alternative label: Kumaiye non-binary people
alternative label: Kumaiye nonbinary people
alternative label: Kumaoni nonbinary people
broader: https://homosaurus.org/v3/homoit0002311
change note: Version 3.7.0
has top concept: LGBTQ+ people
in scheme: v3

Kutchi non-binary people
type: Concept
issued: 2024-07-11
modified: 2025-02-23
comment: Non-binary people who are from or are descended from those native to the Kutch district of the Indian state of Gujarat and the Sindh region of Pakistan.
alternative label: Kutchi nonbinary people
alternative label: Non-binary Kutchi people
alternative label: Nonbinary Kutchi people
broader: https://homosaurus.org/v3/homoit0002319
change note: Version 3.7.0
has top concept: LGBTQ+ people
in scheme: v3

Latino/a/x non-binary people
type: Concept
issued: 2024-07-11
modified: 2025-02-23
comment: Latin American people who are non-binary; only use to describe individuals who self-identify as Latino, Latina, or Latinx. Do not conflate with Chicano/a/x or Hispanic.
alternative label: Latina non-binary people
alternative label: Latina nonbinary people
alternative label: Latino non-binary people
alternative label: Latino nonbinary people
alternative label: Latino/a/x nonbinary people
alternative label: Latinx non-binary people
alternative label: Latinx nonbinary people
alternative label: Non-binary Latinas
alternative label: Non-binary Latino/a/x people
alternative label: Non-binary Latinos
alternative label: Non-binary Latinx
alternative label: Nonbinary Latinas
alternative label: Nonbinary Latino/a/x people
alternative label: Nonbinary Latinos
alternative label: Nonbinary Latinx
broader: https://homosaurus.org/v3/homoit0000253
change note: Version 3.7.0
has top concept: LGBTQ+ people
in scheme: v3

Maldivian non-binary people
type: Concept
issued: 2024-07-11
modified: 2025-02-23
comment: Non-binary people who belong to or are descended from the people native to the Maldives (including the island of Minicoy) and speak the Maldivian language.
alternative label: Dhivehin non-binary people
alternative label: Dhivehin nonbinary people
alternative label: Maldivian nonbinary people
alternative label: Non-binary Maldivians
alternative label: Nonbinary Maldivians
broader: https://homosaurus.org/v3/homoit0002118
change note: Version 3.7.0
has top concept: LGBTQ+ people
in scheme: v3

Multiracial non-binary people
type: Concept
issued: 2024-07-11
modified: 2025-02-23
comment: Non-binary people who belong to two or more racial groups.
alternative label: Non-binary muti-racial people
alternative label: Multi-racial nonbinary people
alternative label: Multiracial nonbinary people
alternative label: Muti-racial non-binary people
alternative label: Non-binary multiracial people
alternative label: Nonbinary multi-racial people
alternative label: Nonbinary multiracial people
broader: https://homosaurus.org/v3/homoit0000903
change note: Version 3.7.0
has top concept: LGBTQ+ people
in scheme: v3

Native American non-binary people
type: Concept
issued: 2024-07-11
modified: 2025-02-23
comment: People who are part of the Native peoples of the continental United States and Canada (excluding Inuit people) and self-identity as Non-binary. Do not conflate with Two-Spirit people. Use more specific terms when available.
alternative label: American Indian non-binary people
alternative label: American Indian nonbinary people
alternative label: Native American nonbinary people
alternative label: Non-binary American Indians
alternative label: Non-binary Native Americans
alternative label: Nonbinary American Indians
alternative label: Nonbinary Native Americans
broader: https://homosaurus.org/v3/homoit0001037
change note: Version 3.7.0
has top concept: LGBTQ+ people
in scheme: v3

Pacific Islander American non-binary people
type: Concept
issued: 2024-07-11
modified: 2025-02-23
comment: Non-binary people who identify as both Pacific Islanders (or of Pacific Islander ancestry) and American.
alternative label: Non-binary Pacific Islander Americans
alternative label: Nonbinary Pacific Islander Americans
alternative label: Pacific Islander American nonbinary people
broader: https://homosaurus.org/v3/homoit0001812
change note: Version 3.7.0
has top concept: LGBTQ+ people
in scheme: v3

Papuan non-binary people
type: Concept
issued: 2024-07-11
modified: 2025-02-23
comment: Non-binary people who are Papuan, or part of the Indigenous peoples of new Guinea; only use for people who identify as Papuan.
alternative label: Non-binary Papuans
alternative label: Nonbinary Papuans
alternative label: Papuan nonbinary people
broader: https://homosaurus.org/v3/homoit0000913
change note: Version 3.7.0
has top concept: LGBTQ+ people
in scheme: v3

Romani non-binary people
type: Concept
issued: 2024-07-11
modified: 2025-02-23
comment: Non-binary people who are Romani, or part of the traditionally nomadic Indo-European people.
alternative label: Non-binary Roma
alternative label: Nonbinary Roma
alternative label: Romani nonbinary people
broader: https://homosaurus.org/v3/homoit0000875
change note: Version 3.7.0
has top concept: LGBTQ+ people
in scheme: v3

South Asian non-binary people
type: Concept
issued: 2024-07-11
modified: 2025-02-23
comment: Non-binary people who belong to or are descended from the ethnolinguistic groups of South Asia.
alternative label: Non-binary South Asian people
alternative label: Non-binary South Asians
alternative label: Nonbinary South Asian people
alternative label: Nonbinary South Asians
alternative label: South Asian nonbinary people
broader: https://homosaurus.org/v3/homoit0002044
change note: Version 3.7.0
has top concept: LGBTQ+ people
in scheme: v3

Gay graphic novels
type: Concept
issued: 2024-07-21
modified: 2025-02-23
comment: Works consisting of sequential images often accompanied by text that generally contain stand-alone stories; used in reference to graphic novels focusing on gay male characters or themes.
broader: https://homosaurus.org/v3/homoit0000874
change note: Version 3.7.0
has top concept: Subcultures
in scheme: v3

Lesbian graphic novels
type: Concept
issued: 2024-07-21
modified: 2025-02-23
comment: Works consisting of sequential images often accompanied by text that generally contain stand-alone stories; used in reference to graphic novels focusing on lesbian characters or themes.
broader: https://homosaurus.org/v3/homoit0000874
change note: Version 3.7.0
has top concept: Subcultures
in scheme: v3

Bisexual graphic novels
type: Concept
issued: 2024-07-21
modified: 2025-02-23
comment: Works consisting of sequential images often accompanied by text that generally contain stand-alone stories. Use in reference to graphic novels focusing on bisexual characters or themes.
broader: https://homosaurus.org/v3/homoit0000874
change note: Version 3.7.0
has top concept: Subcultures
in scheme: v3

Megasexual graphic novels
type: Concept
issued: 2024-07-21
modified: 2025-02-23
comment: Works consisting of sequential images often accompanied by text that generally contain stand-alone stories; used in reference to graphic novels focusing on megasexual characters or themes.
broader: https://homosaurus.org/v3/homoit0000874
change note: Version 3.7.0
has top concept: Subcultures
in scheme: v3

Transgender graphic novels
type: Concept
issued: 2024-07-21
modified: 2025-02-23
comment: Works consisting of sequential images often accompanied by text that generally contain stand-alone stories; used in reference to graphic novels focusing on transgender characters or themes.
broader: https://homosaurus.org/v3/homoit0000874
change note: Version 3.7.0
has top concept: Subcultures
in scheme: v3

Queer graphic novels
type: Concept
issued: 2024-07-21
modified: 2025-02-23
comment: Works consisting of sequential images often accompanied by text that generally contain stand-alone stories; used in reference to graphic novels focusing on queer characters or themes.
broader: https://homosaurus.org/v3/homoit0000874
change note: Version 3.7.0
has top concept: Subcultures
in scheme: v3

Child sexual abuse content
type: Concept
issued: 2024-07-21
modified: 2025-02-23
comment: Images and videos that show children and youth who are under the age of consent engaged in sexual activities. While this term is not otherwise within the scope of the Homosaurus vocabulary, it is provided as an alternative to commonly used terms such as "Child pornography" in order to highlight that the production of such materials is a direct product of and contributes to the sexual abuse of children.
alternative label: CSA content
alternative label: CSA materials
alternative label: Child pornography
alternative label: Child sexual abuse materials
broader: https://homosaurus.org/v3/homoit0001305
change note: Version 3.7.0
has top concept: Sexual violence
in scheme: v3

Queer painters
type: Concept
issued: 2024-07-31
modified: 2025-02-23
comment: Queer people who paint, either professionally or as a hobby.
broader: https://homosaurus.org/v3/homoit0003511
change note: Version 3.7.0
has top concept: LGBTQ+ people
in scheme: v3

Intersex painters
type: Concept
issued: 2024-07-31
modified: 2025-02-23
comment: Intersex people who paint, either professionally or as a hobby.
broader: https://homosaurus.org/v3/homoit0003511
change note: Version 3.7.0
has top concept: LGBTQ+ people
in scheme: v3

Two-Spirit painters
type: Concept
issued: 2024-07-31
modified: 2025-02-23
comment: Two-Spirit people who paint, either professionally or as a hobby.
alternative label: 2S painters
alternative label: Two Spirit painters
alternative label: Two-Spirited painters
broader: https://homosaurus.org/v3/homoit0002678
change note: Version 3.7.0
has top concept: Gender
in scheme: v3
related: https://homosaurus.org/v3/homoit0003511

Non-binary painters
type: Concept
issued: 2024-07-31
modified: 2025-02-23
comment: Non-binary people who paint, either professionally or as a hobby.
alternative label: Nonbinary painters
broader: https://homosaurus.org/v3/homoit0003511
change note: Version 3.7.0
has top concept: LGBTQ+ people
in scheme: v3

Aromantic painters
type: Concept
issued: 2024-07-31
modified: 2025-02-23
comment: Aromantic people who paint, either professionally or as a hobby.
broader: https://homosaurus.org/v3/homoit0003511
change note: Version 3.7.0
has top concept: LGBTQ+ people
in scheme: v3

Asexual painters
type: Concept
issued: 2024-07-31
modified: 2025-02-23
comment: Asexual people who paint, either professionally or as a hobby.
broader: https://homosaurus.org/v3/homoit0003511
change note: Version 3.7.0
has top concept: LGBTQ+ people
in scheme: v3

Demisexual painters
type: Concept
issued: 2024-07-31
modified: 2025-02-23
comment: Demisexual people who paint, either professionally or as a hobby.
broader: https://homosaurus.org/v3/homoit0003511
change note: Version 3.7.0
has top concept: LGBTQ+ people
in scheme: v3

Greyromantic painters
type: Concept
issued: 2024-07-31
modified: 2025-02-23
comment: Greyromantic people who paint, either professionally or as a hobby.
broader: https://homosaurus.org/v3/homoit0003511
change note: Version 3.7.0
has top concept: LGBTQ+ people
in scheme: v3

Megasexual painters
type: Concept
issued: 2024-07-31
modified: 2025-02-23
comment: Megasexual people who paint, either professionally or as a hobby.
broader: https://homosaurus.org/v3/homoit0003511
change note: Version 3.7.0
has top concept: LGBTQ+ people
in scheme: v3

Non-binary athletes
type: Concept
issued: 2024-07-31
modified: 2025-02-23
comment: Professional or amateur/recreational sports players who are non-binary.
alternative label: Non-binary sports players
alternative label: Non-binary sportspeople
alternative label: Non-binary sportspersons
alternative label: Nonbinary athletes
alternative label: Nonbinary sports players
alternative label: Nonbinary sportspeople
alternative label: Nonbinary sportspersons
broader: https://homosaurus.org/v3/homoit0001929
change note: Version 3.7.0
has top concept: LGBTQ+ people
in scheme: v3

Rape culture
type: Concept
issued: 2024-07-31
modified: 2025-02-23
comment: A term used in gender studies and feminist writing to describe a setting or culture in which sexual violence is pervasive and normalized due to attitudes about gender and sexuality.
alternative label: Rape-supportive culture
broader: https://homosaurus.org/v3/homoit0002039
change note: Version 3.7.0
has top concept: Theories
in scheme: v3
related: https://homosaurus.org/v3/homoit0000306
related: https://homosaurus.org/v3/homoit0001285
related: https://homosaurus.org/v3/homoit0001305

Bicuriosity
type: Concept
issued: 2024-07-31
modified: 2025-02-23
comment: A term used to describe the phenomena of heterosexual or hetero-presenting individuals expressing curiosity about exploring sexual relationships or experiences with other people of the same gender.
alternative label: Bi-curiosity
alternative label: Bi-curious
alternative label: Bicurious
broader: https://homosaurus.org/v3/homoit0000204
change note: Version 3.7.0
has top concept: Sexual orientation
in scheme: v3
related: https://homosaurus.org/v3/homoit0000620
related: https://homosaurus.org/v3/homoit0000631
related: https://homosaurus.org/v3/homoit0003509

LGBTQ+ photographers
type: Concept
issued: 2024-07-31
modified: 2025-02-23
comment: LGBTQ+ people who take photographs, either professionally or as a hobby.
alternative label: LGBTQ photographers
alternative label: Photographers (LGBTQ)
broader: https://homosaurus.org/v3/homoit0000070
change note: Version 3.7.0
has top concept: LGBTQ+ people
in scheme: v3
narrower: https://homosaurus.org/v3/homoit0003447
narrower: https://homosaurus.org/v3/homoit0003448
narrower: https://homosaurus.org/v3/homoit0003449
narrower: https://homosaurus.org/v3/homoit0003450
narrower: https://homosaurus.org/v3/homoit0003451
narrower: https://homosaurus.org/v3/homoit0003452
narrower: https://homosaurus.org/v3/homoit0003454
narrower: https://homosaurus.org/v3/homoit0003455
narrower: https://homosaurus.org/v3/homoit0003456
narrower: https://homosaurus.org/v3/homoit0003457
narrower: https://homosaurus.org/v3/homoit0003458
narrower: https://homosaurus.org/v3/homoit0003459
related: https://homosaurus.org/v3/homoit0003453

Lesbian photographers
type: Concept
issued: 2024-07-31
modified: 2025-02-23
comment: Lesbians who take photographs, either professionally or as a hobby.
broader: https://homosaurus.org/v3/homoit0003446
change note: Version 3.7.0
has top concept: LGBTQ+ people
in scheme: v3

Gay photographers
type: Concept
issued: 2024-07-31
modified: 2025-02-23
comment: Gay men who take photographs, either professionally or as a hobby.
broader: https://homosaurus.org/v3/homoit0003446
change note: Version 3.7.0
has top concept: LGBTQ+ people
in scheme: v3

Bisexual photographers
type: Concept
issued: 2024-07-31
modified: 2025-02-23
comment: Bisexual people who take photographs, either professionally or as a hobby.
broader: https://homosaurus.org/v3/homoit0003446
change note: Version 3.7.0
has top concept: LGBTQ+ people
in scheme: v3

Transgender photographers
type: Concept
issued: 2024-07-31
modified: 2025-02-23
comment: Trans people who take photographs, either professionally or as a hobby.
alternative label: Trans photographers
broader: https://homosaurus.org/v3/homoit0003446
change note: Version 3.7.0
has top concept: LGBTQ+ people
in scheme: v3

Queer photographers
type: Concept
issued: 2024-07-31
modified: 2025-02-23
comment: Queer people who take photographs, either professionally or as a hobby.
broader: https://homosaurus.org/v3/homoit0003446
change note: Version 3.7.0
has top concept: LGBTQ+ people
in scheme: v3

Intersex photographers
type: Concept
issued: 2024-07-31
modified: 2025-02-23
comment: Intersex people who take photographs, either professionally or as a hobby.
broader: https://homosaurus.org/v3/homoit0003446
change note: Version 3.7.0
has top concept: LGBTQ+ people
in scheme: v3

Two-Spirit photographers
type: Concept
issued: 2024-07-31
modified: 2025-02-23
comment: Two-Spirit people who take photographs, either professionally or as a hobby.
alternative label: 2S photographers
alternative label: Two Spirit photographers
alternative label: Two-Spirited photographers
broader: https://homosaurus.org/v3/homoit0002678
change note: Version 3.7.0
has top concept: Gender
in scheme: v3
related: https://homosaurus.org/v3/homoit0003446

Non-binary photographers
type: Concept
issued: 2024-07-31
modified: 2025-02-23
comment: Non-binary people who take photographs, either professionally or as a hobby.
alternative label: Nonbinary photographers
broader: https://homosaurus.org/v3/homoit0003446
change note: Version 3.7.0
has top concept: LGBTQ+ people
in scheme: v3

Aromantic photographers
type: Concept
issued: 2024-07-31
modified: 2025-02-23
comment: Aromantic people who take photographs, either professionally or as a hobby.
broader: https://homosaurus.org/v3/homoit0003446
change note: Version 3.7.0
has top concept: LGBTQ+ people
in scheme: v3

Asexual photographers
type: Concept
issued: 2024-07-31
modified: 2025-02-23
comment: Asexual people who take photographs, either professionally or as a hobby.
broader: https://homosaurus.org/v3/homoit0003446
change note: Version 3.7.0
has top concept: LGBTQ+ people
in scheme: v3

Demisexual photographers
type: Concept
issued: 2024-07-31
modified: 2025-02-23
comment: Demisexual people who take photographs, either professionally or as a hobby.
broader: https://homosaurus.org/v3/homoit0003446
change note: Version 3.7.0
has top concept: LGBTQ+ people
in scheme: v3

Greyromantic photographers
type: Concept
issued: 2024-07-31
modified: 2025-02-23
comment: Greyromantic people who take photographs, either professionally or as a hobby.
broader: https://homosaurus.org/v3/homoit0003446
change note: Version 3.7.0
has top concept: LGBTQ+ people
in scheme: v3

Megasexual photographers
type: Concept
issued: 2024-07-31
modified: 2025-02-23
comment: Megasexual people who take photographs, either professionally or as a hobby.
broader: https://homosaurus.org/v3/homoit0003446
change note: Version 3.7.0
has top concept: LGBTQ+ people
in scheme: v3

LGBTQ+ youth survivors of bullying
type: Concept
issued: 2024-07-31
modified: 2025-02-23
comment: LGBTQ+ youth between the ages of 12-18 who have experienced and survived bullying due to their gender or sexual identity. Follow the individual's preference for "victims" or "survivors" whenever possible.
alternative label: Survivors of bullying (LGBTQ+)
broader: https://homosaurus.org/v3/homoit0001521
broader: https://homosaurus.org/v3/homoit0001998
change note: Version 3.7.0
has top concept: Youth
in scheme: v3
narrower: https://homosaurus.org/v3/homoit0003461
narrower: https://homosaurus.org/v3/homoit0003462
narrower: https://homosaurus.org/v3/homoit0003463
narrower: https://homosaurus.org/v3/homoit0003464
narrower: https://homosaurus.org/v3/homoit0003465
narrower: https://homosaurus.org/v3/homoit0003466
narrower: https://homosaurus.org/v3/homoit0003467
narrower: https://homosaurus.org/v3/homoit0003468
narrower: https://homosaurus.org/v3/homoit0003469
narrower: https://homosaurus.org/v3/homoit0003470
related: https://homosaurus.org/v3/homoit0003473

Gay youth survivors of bullying
type: Concept
issued: 2024-07-31
modified: 2025-02-23
comment: Gay male youth between the ages of 12-18 who have experienced and survived bullying due to their gender or sexual identity. Follow the individual's preference for "victims" or "survivors" whenever possible.
broader: https://homosaurus.org/v3/homoit0003460
change note: Version 3.7.0
has top concept: Youth
in scheme: v3

Lesbian youth survivors of bullying
type: Concept
issued: 2024-07-31
modified: 2025-02-23
comment: Lesbian youth between the ages of 12-18 who have experienced and survived bullying due to their gender or sexual identity. Follow the individual's preference for "victims" or "survivors" whenever possible.
broader: https://homosaurus.org/v3/homoit0003460
change note: Version 3.7.0
has top concept: Youth
in scheme: v3

Bisexual youth survivors of bullying
type: Concept
issued: 2024-07-31
modified: 2025-02-23
comment: Bisexual youth between the ages of 12-18 who have experienced and survived bullying due to their gender or sexual identity. Follow the individual's preference for "victims" or "survivors" whenever possible.
broader: https://homosaurus.org/v3/homoit0003460
change note: Version 3.7.0
has top concept: Youth
in scheme: v3

Queer youth survivors of bullying
type: Concept
issued: 2024-07-31
modified: 2025-02-23
comment: Queer youth between the ages of 12-18 who have experienced and survived bullying due to their gender or sexual identity. Follow the individual's preference for "victims" or "survivors" whenever possible.
broader: https://homosaurus.org/v3/homoit0003460
change note: Version 3.7.0
has top concept: Youth
in scheme: v3

Intersex youth survivors of bullying
type: Concept
issued: 2024-07-31
modified: 2025-02-23
comment: Intersex youth between the ages of 12-18 who have experienced and survived bullying due to their gender or sexual identity. Follow the individual's preference for "victims" or "survivors" whenever possible.
broader: https://homosaurus.org/v3/homoit0003460
change note: Version 3.7.0
has top concept: Youth
in scheme: v3

Non-binary youth survivors of bullying
type: Concept
issued: 2024-07-31
modified: 2025-02-23
comment: Non-binary youth between the ages of 12-18 who have experienced and survived bullying due to their gender or sexual identity. Follow the individual's preference for "victims" or "survivors" whenever possible.
alternative label: Nonbinary youth survivors of bullying
broader: https://homosaurus.org/v3/homoit0003460
change note: Version 3.7.0
has top concept: Youth
in scheme: v3

Transgender youth survivors of bullying
type: Concept
issued: 2024-07-31
modified: 2025-02-23
comment: Transgender youth between the ages of 12-18 who have experienced and survived bullying due to their gender or sexual identity. Follow the individual's preference for "victims" or "survivors" whenever possible.
broader: https://homosaurus.org/v3/homoit0003460
change note: Version 3.7.0
has top concept: Youth
in scheme: v3

Asexual youth survivors of bullying
type: Concept
issued: 2024-07-31
modified: 2025-02-23
comment: Asexual youth between the ages of 12-18 who have experienced and survived bullying due to their sexual identity. Follow the individual's preference for "victims" or "survivors" whenever possible.
broader: https://homosaurus.org/v3/homoit0003460
change note: Version 3.7.0
has top concept: Youth
in scheme: v3

Aromantic youth survivors of bullying
type: Concept
issued: 2024-07-31
modified: 2025-02-23
comment: Aromantic youth between the ages of 12-18 who have experienced and survived bullying due to their sexual identity. Follow the individual's preference for "victims" or "survivors" whenever possible.
broader: https://homosaurus.org/v3/homoit0003460
change note: Version 3.7.0
has top concept: Youth
in scheme: v3

Greyromantic youth survivors of bullying
type: Concept
issued: 2024-07-31
modified: 2025-02-23
comment: Greyromantic youth between the ages of 12-18 who have experienced and survived bullying due to their gender or sexual identity. Follow the individual's preference for "victims" or "survivors" whenever possible.
broader: https://homosaurus.org/v3/homoit0003460
change note: Version 3.7.0
has top concept: Youth
in scheme: v3

Two-Spirit youth survivors of bullying
type: Concept
issued: 2024-07-31
modified: 2025-02-23
comment: Two Spirit youth between the ages of 12-18 who have experienced and survived bullying due to their gender or sexual identity; follow the individual's preference for "victims" or "survivors" whenever possible.
alternative label: 2S youth survivors of bullying
alternative label: Two Spirited youth survivors of bullying
alternative label: Two-Spirited youth survivors of bullying
broader: https://homosaurus.org/v3/homoit0002006
broader: https://homosaurus.org/v3/homoit0002711
change note: Version 3.7.0
has top concept: Gender
in scheme: v3
related: https://homosaurus.org/v3/homoit0003460

LGBTQ+ youth victims of bullying
type: Concept
issued: 2024-07-31
modified: 2025-02-23
comment: LGBTQ+ youth between the ages of 12-18 who have experienced bullying due to their gender or sexual identity and may or may not have survived; follow the individual's preference for "victims" or "survivors" whenever possible.
broader: https://homosaurus.org/v3/homoit0001521
broader: https://homosaurus.org/v3/homoit0001989
change note: Version 3.7.0
has top concept: Youth
in scheme: v3
narrower: https://homosaurus.org/v3/homoit0001995
narrower: https://homosaurus.org/v3/homoit0003475
narrower: https://homosaurus.org/v3/homoit0003476
narrower: https://homosaurus.org/v3/homoit0003477
narrower: https://homosaurus.org/v3/homoit0003478
narrower: https://homosaurus.org/v3/homoit0003479
narrower: https://homosaurus.org/v3/homoit0003480
narrower: https://homosaurus.org/v3/homoit0003481
narrower: https://homosaurus.org/v3/homoit0003482
narrower: https://homosaurus.org/v3/homoit0003483
narrower: https://homosaurus.org/v3/homoit0003484
related: https://homosaurus.org/v3/homoit0003487

Gay youth victims of bullying
type: Concept
issued: 2024-07-31
modified: 2025-02-23
comment: Gay male youth between the ages of 12-18 who have experienced bullying due to their gender or sexual identity and may or may not have survived. Follow the individual's preference for "victims" or "survivors" whenever possible.
broader: https://homosaurus.org/v3/homoit0003474
change note: Version 3.7.0
has top concept: Youth
in scheme: v3

Lesbian youth victims of bullying
type: Concept
issued: 2024-07-31
modified: 2025-02-23
comment: Lesbian youth between the ages of 12-18 who have experienced bullying due to their gender or sexual identity and may or may not have survived. Follow the individual's preference for "victims" or "survivors" whenever possible.
broader: https://homosaurus.org/v3/homoit0003474
change note: Version 3.7.0
has top concept: Youth
in scheme: v3

Bisexual youth victims of bullying
type: Concept
issued: 2024-07-31
modified: 2025-02-23
comment: Bisexual youth between the ages of 12-18 who have experienced bullying due to their gender or sexual identity and may or may not have survived. Follow the individual's preference for "victims" or "survivors" whenever possible.
broader: https://homosaurus.org/v3/homoit0003474
change note: Version 3.7.0
has top concept: Youth
in scheme: v3

Queer youth victims of bullying
type: Concept
issued: 2024-07-31
modified: 2025-02-23
comment: Queer youth between the ages of 12-18 who have experienced bullying due to their gender or sexual identity and may or may not have survived. Follow the individual's preference for "victims" or "survivors" whenever possible.
broader: https://homosaurus.org/v3/homoit0003474
change note: Version 3.7.0
has top concept: Youth
in scheme: v3

Intersex youth victims of bullying
type: Concept
issued: 2024-07-31
modified: 2025-02-23
comment: Intersex youth between the ages of 12-18 who have experienced bullying due to their gender or sexual identity and may or may not have survived. Follow the individual's preference for "victims" or "survivors" whenever possible.
broader: https://homosaurus.org/v3/homoit0003474
change note: Version 3.7.0
has top concept: Youth
in scheme: v3

Non-binary youth victims of bullying
type: Concept
issued: 2024-07-31
modified: 2025-02-23
comment: Non-binary youth between the ages of 12-18 who have experienced bullying due to their gender or sexual identity and may or may not have survived. Follow the individual's preference for "victims" or "survivors" whenever possible.
alternative label: Nonbinary youth victims of bullying
broader: https://homosaurus.org/v3/homoit0003474
change note: Version 3.7.0
has top concept: Youth
in scheme: v3

Transgender youth victims of bullying
type: Concept
issued: 2024-07-31
modified: 2025-02-23
comment: Transgender youth between the ages of 12-18 who have experienced bullying due to their gender or sexual identity and may or may not have survived. Follow the individual's preference for "victims" or "survivors" whenever possible.
broader: https://homosaurus.org/v3/homoit0003474
change note: Version 3.7.0
has top concept: Youth
in scheme: v3

Asexual youth victims of bullying
type: Concept
issued: 2024-07-31
modified: 2025-02-23
comment: Asexual youth between the ages of 12-18 who have experienced bullying due to their sexual identity and may or may not have survived. Follow the individual's preference for "victims" or "survivors" whenever possible.
broader: https://homosaurus.org/v3/homoit0003474
change note: Version 3.7.0
has top concept: Youth
in scheme: v3

Aromantic youth victims of bullying
type: Concept
issued: 2024-07-31
modified: 2025-02-23
comment: Aromantic youth between the ages of 12-18 who have experienced bullying due to their sexual identity and may or may not have survived. Follow the individual's preference for "victims" or "survivors" whenever possible.
broader: https://homosaurus.org/v3/homoit0003474
change note: Version 3.7.0
has top concept: Youth
in scheme: v3

Greyromantic youth victims of bullying
type: Concept
issued: 2024-07-31
modified: 2025-02-23
comment: Greyromantic youth between the ages of 12-18 who have experienced bullying due to their gender or sexual identity and may or may not have survived. Follow the individual's preference for "victims" or "survivors" whenever possible.
broader: https://homosaurus.org/v3/homoit0003474
change note: Version 3.7.0
has top concept: Youth
in scheme: v3

Two-Spirit youth victims of bullying
type: Concept
issued: 2024-07-31
modified: 2025-02-23
comment: Two Spirit youth between the ages of 12-18 who have experienced bullying due to their gender or sexual identity and may or may not have survived; follow the individual's preference for "victims" or "survivors" whenever possible.
alternative label: 2S youth victims of bullying
alternative label: Two Spirited youth victims of bullying
alternative label: Two-Spirited youth victims of bullying
broader: https://homosaurus.org/v3/homoit0001997
broader: https://homosaurus.org/v3/homoit0002711
change note: Version 3.7.0
has top concept: Gender
in scheme: v3
related: https://homosaurus.org/v3/homoit0001989
related: https://homosaurus.org/v3/homoit0003474

LGBTQ+ children's literature
type: Concept
issued: 2024-07-31
modified: 2025-02-23
comment: Written literary works for an audience of readers up to 12 years of age, also known as kid lit or juvenile literature. Use in reference to children's literature focusing on LGBTQ+ characters or themes.
alternative label: Children's literature (LGBTQ+)
alternative label: LGBTQ+ juvenile literature
alternative label: LGBTQ+ kid lit
broader: https://homosaurus.org/v3/homoit0000972
change note: Version 3.7.0
has top concept: Subcultures
in scheme: v3
narrower: https://homosaurus.org/v3/homoit0003489
narrower: https://homosaurus.org/v3/homoit0003490
narrower: https://homosaurus.org/v3/homoit0003491
narrower: https://homosaurus.org/v3/homoit0003492
narrower: https://homosaurus.org/v3/homoit0003493
narrower: https://homosaurus.org/v3/homoit0003494
narrower: https://homosaurus.org/v3/homoit0003495
narrower: https://homosaurus.org/v3/homoit0003496
narrower: https://homosaurus.org/v3/homoit0003497
related: https://homosaurus.org/v3/homoit0003498

Gay children's literature
type: Concept
issued: 2024-07-31
modified: 2025-02-23
comment: Written literary works for an audience of readers up to 12 years of age, also known as kid lit or juvenile literature. Use in reference to children's literature focusing on gay male characters or themes.
alternative label: Gay juvenile literature
alternative label: Gay kid lit
broader: https://homosaurus.org/v3/homoit0003488
change note: Version 3.7.0
has top concept: Subcultures
in scheme: v3

Lesbian children's literature
type: Concept
issued: 2024-07-31
modified: 2025-02-23
comment: Written literary works for an audience of readers up to 12 years of age, also known as kid lit or juvenile literature. Use in reference to children's literature focusing on lesbian characters or themes.
alternative label: Lesbian juvenile literature
alternative label: Lesbian kid lit
broader: https://homosaurus.org/v3/homoit0003488
change note: Version 3.7.0
has top concept: Subcultures
in scheme: v3

Bisexual children's literature
type: Concept
issued: 2024-07-31
modified: 2025-02-23
comment: Written literary works for an audience of readers up to 12 years of age, also known as kid lit or juvenile literature. Use in reference to children's literature focusing on bisexual characters or themes.
alternative label: Bisexual juvenile literature
alternative label: Bisexual kid lit
broader: https://homosaurus.org/v3/homoit0003488
change note: Version 3.7.0
has top concept: Subcultures
in scheme: v3

Transgender children's literature
type: Concept
issued: 2024-07-31
modified: 2025-02-23
comment: Written literary works for an audience of readers up to 12 years of age, also known as kid lit or juvenile literature. Use in reference to children's literature focusing on transgender characters or themes.
alternative label: Trans children's literature
alternative label: Transgender juvenile literature
alternative label: Transgender kid lit
broader: https://homosaurus.org/v3/homoit0003488
change note: Version 3.7.0
has top concept: Subcultures
in scheme: v3

Queer children's literature
type: Concept
issued: 2024-07-31
modified: 2025-02-23
comment: Written literary works for an audience of readers up to 12 years of age, also known as kid lit or juvenile literature. Use in reference to children's literature focusing on queer characters or themes.
alternative label: Queer juvenile literature
alternative label: Queer kid lit
broader: https://homosaurus.org/v3/homoit0003488
change note: Version 3.7.0
has top concept: Subcultures
in scheme: v3

Non-binary children's literature
type: Concept
issued: 2024-07-31
modified: 2025-02-23
comment: Written literary works for an audience of readers up to 12 years of age, also known as kid lit or juvenile literature. Use in reference to children's literature focusing on non-binary characters or themes.
alternative label: Non-binary juvenile literature
alternative label: Non-binary kit lit
alternative label: Nonbinary children's literature
alternative label: Nonbinary juvenile literature
alternative label: Nonbinary kid lit
broader: https://homosaurus.org/v3/homoit0003488
change note: Version 3.7.0
has top concept: Subcultures
in scheme: v3

Asexual children's literature
type: Concept
issued: 2024-07-31
modified: 2025-02-23
comment: Written literary works for an audience of readers up to 12 years of age, also known as kid lit or juvenile literature. Use in reference to children's literature focusing on asexual characters or themes.
alternative label: Asexual juvenile literature
alternative label: Asexual kid lit
broader: https://homosaurus.org/v3/homoit0003488
change note: Version 3.7.0
has top concept: Subcultures
in scheme: v3

Aromantic children's literature
type: Concept
issued: 2024-07-31
modified: 2025-02-23
comment: Written literary works for an audience of readers up to 12 years of age, also known as kid lit or juvenile literature. Use in reference to children's literature focusing on aromantic characters or themes.
alternative label: Aromantic juvenile literature
alternative label: Aromantic kid lit
broader: https://homosaurus.org/v3/homoit0003488
change note: Version 3.7.0
has top concept: Subcultures
in scheme: v3

Intersex children's literature
type: Concept
issued: 2024-07-31
modified: 2025-02-23
comment: Written literary works for an audience of readers up to 12 years of age, also known as kid lit or juvenile literature. Use in reference to children's literature focusing on intersex characters or themes.
alternative label: Intersex juvenile literature
alternative label: Intersex kid lit
broader: https://homosaurus.org/v3/homoit0003488
change note: Version 3.7.0
has top concept: Subcultures
in scheme: v3

Two-Spirit children's literature
type: Concept
issued: 2024-07-31
modified: 2025-02-23
comment: Written literary works for an audience of readers up to 12 years of age, also known as kid lit or juvenile literature. Use in reference to children's literature focusing on Two-Spirit characters or themes.
alternative label: 2S children's literature
alternative label: Two Spirit children's literature
alternative label: Two Spirited children's literature
alternative label: Two-Spirit juvenile literature
alternative label: Two-Spirit kid lit
alternative label: Two-Spirited children's literature
broader: https://homosaurus.org/v3/homoit0002710
change note: Version 3.7.0
has top concept: Two-Spirit literature
in scheme: v3
related: https://homosaurus.org/v3/homoit0003488

Anti-transgender legislation
type: Concept
issued: 2024-07-31
modified: 2025-02-23
comment: Efforts to propose, enact, amend, or strike down laws as a means of restricting the legal rights of transgender people. This includes legislation regarding access to gender-affirming healthcare, participation in sporting events, administrative and judicial procedures such as sex and name registration, and policies affecting the medical treatment, education, and mental health care of transgender youth.
alternative label: Anti-trans law-making
alternative label: Anti-trans legislation
alternative label: Anti-transgender law-making
broader: https://homosaurus.org/v3/homoit0000702
change note: Version 3.7.0
has top concept: Law
in scheme: v3
narrower: https://homosaurus.org/v3/homoit0001139
narrower: https://homosaurus.org/v3/homoit0003502
narrower: https://homosaurus.org/v3/homoit0003503
narrower: https://homosaurus.org/v3/homoit0003504
narrower: https://homosaurus.org/v3/homoit0003510
related: https://homosaurus.org/v3/homoit0000062
related: https://homosaurus.org/v3/homoit0000314
related: https://homosaurus.org/v3/homoit0001467
related: https://homosaurus.org/v3/homoit0001819

Danmei
type: Concept
issued: 2024-07-31
modified: 2025-02-23
comment: A genre focusing on the romantic or sexual relationships between male characters in Chinese novels, comics, movies, animation, and dramas.
alternative label: Dānměi
broader: https://homosaurus.org/v3/homoit0002152
change note: Version 3.7.0
has top concept: Subcultures
in scheme: v3

Turkey baster babies
type: Concept
issued: 2024-07-31
modified: 2025-02-23
comment: Babies conceived through at-home artificial insemination, specifically by injecting semen into one's vagina using a turkey baster. There is an extensive history of at-home artificial insemination undertaken by LGBTQ+ people, including gay men contributing semen to aid lesbian couples in conceiving.
broader: https://homosaurus.org/v3/homoit0000255
change note: Version 3.7.0
has top concept: Family members
in scheme: v3
related: https://homosaurus.org/v3/homoit0002617

Transgender health care bans for children and youth
type: Concept
issued: 2024-07-31
modified: 2025-02-23
comment: Laws or policies instituted that prevent trans and non-binary youth and children from seeking and/or obtaining medical treatment or gender-affirming care, including but not limited to surgery, hormone treatment, and mental health care.
broader: https://homosaurus.org/v3/homoit0003499
change note: Version 3.7.0
has top concept: Law
in scheme: v3
related: https://homosaurus.org/v3/homoit0001400
related: https://homosaurus.org/v3/homoit0001452
related: https://homosaurus.org/v3/homoit0003514

Gender marker change bans
type: Concept
issued: 2024-07-31
modified: 2025-02-23
comment: Laws or policies instituted to prevent trans and non-binary people from changing the gender marker on their birth certificate, driver's license, passport, or other legal documents.
alternative label: Legal documents change ban
broader: https://homosaurus.org/v3/homoit0003499
change note: Version 3.7.0
has top concept: Law
in scheme: v3
related: https://homosaurus.org/v3/homoit0000247
related: https://homosaurus.org/v3/homoit0000573
related: https://homosaurus.org/v3/homoit0000711

Transgender health care bans
type: Concept
issued: 2024-07-31
modified: 2025-02-23
comment: Laws or policies instituted to prevent trans and non-binary individuals from seeking medical treatment or gender-affirming care, including but not limited to surgery, hormone treatment, and mental health care.
broader: https://homosaurus.org/v3/homoit0003499
change note: Version 3.7.0
has top concept: Law
in scheme: v3
related: https://homosaurus.org/v3/homoit0000561
related: https://homosaurus.org/v3/homoit0000614

Kiki (Social Gathering)
type: Concept
issued: 2024-07-31
modified: 2025-02-23
comment: A slang term to describe a gathering of friends for the purpose of chatting and gossiping. The term evolved out of the 1990s ballroom scene in New York City and was further popularized by the 2012 song "Let's Have a Kiki" by the Scissor Sisters. Do not conflate with the term "Ky-ky (Gender role)," sometimes also spelled "Kiki," which refers to lesbians who do not identify as either butches or femmes.
alternative label: Kikiing (Social gathering)
alternative label: Kiking (Social gathering)
broader: https://homosaurus.org/v3/homoit0001317
change note: Version 3.7.0
has top concept: LGBTQ+ slang
in scheme: v3
related: https://homosaurus.org/v3/homoit0000092
related: https://homosaurus.org/v3/homoit0000455

Ky-ky (Gender role)
type: Concept
issued: 2024-07-31
modified: 2025-02-23
comment: A slang term that emerged in the 1940s to describe lesbians who do not identify as butch or femme. Do not conflate with the term "Kiki (Social gathering), which refers to a gathering of friends.
alternative label: Kiki (Gender role)
alternative label: Kyky (Gender role)
broader: https://homosaurus.org/v3/homoit0000577
broader: https://homosaurus.org/v3/homoit0001295
broader: https://homosaurus.org/v3/homoit0001304
change note: Version 3.7.0
has top concept: Role behavior
in scheme: v3

Girls’ Love (Genre)
type: Concept
issued: 2024-07-31
modified: 2025-02-23
comment: A genre focusing on the romantic or sexual relationships between female characters in anime, dramas, comics, novels, and movies. The term is usually used to describe media originating from Asia.
alternative label: GL (Genre)
broader: https://homosaurus.org/v3/homoit0002144
change note: Version 3.7.0
has top concept: Subcultures
in scheme: v3
narrower: https://homosaurus.org/v3/homoit0002221
narrower: https://homosaurus.org/v3/homoit0003508
related: https://homosaurus.org/v3/homoit0000742

Baihe
type: Concept
issued: 2024-07-31
modified: 2025-02-23
comment: A genre focusing on the romantic or sexual relationships between female characters in Chinese novels, comics, movies, animation, and dramas.
alternative label: Bǎihé
broader: https://homosaurus.org/v3/homoit0003507
change note: Version 3.7.0
has top concept: Subcultures
in scheme: v3
related: https://homosaurus.org/v3/homoit0000742

Sports bans
type: Concept
issued: 2024-07-31
modified: 2025-02-23
comment: Laws or policies instituted to prevent trans and non-binary individuals from participating in gendered sports leagues or competitions, typically to force players to compete as their sex assigned at birth rather than as their gender. This ranges from criminalizing schools and programs that allow trans and non-binary youth participation to banning players, particularly trans women, from competing in gendered leagues or competitions.
alternative label: Sport bans
broader: https://homosaurus.org/v3/homoit0003499
change note: Version 3.7.0
has top concept: Law
in scheme: v3
related: https://homosaurus.org/v3/homoit0001933

LGBTQ+ painters
type: Concept
issued: 2024-07-31
modified: 2025-02-23
comment: LGBTQ+ people who paint, either professionally or as a hobby.
alternative label: Painters (LGBTQ)
broader: https://homosaurus.org/v3/homoit0000070
change note: Version 3.7.0
has top concept: LGBTQ+ people
in scheme: v3
narrower: https://homosaurus.org/v3/homoit0003434
narrower: https://homosaurus.org/v3/homoit0003435
narrower: https://homosaurus.org/v3/homoit0003437
narrower: https://homosaurus.org/v3/homoit0003438
narrower: https://homosaurus.org/v3/homoit0003439
narrower: https://homosaurus.org/v3/homoit0003440
narrower: https://homosaurus.org/v3/homoit0003441
narrower: https://homosaurus.org/v3/homoit0003442
narrower: https://homosaurus.org/v3/homoit0003513
narrower: https://homosaurus.org/v3/homoit0003516
narrower: https://homosaurus.org/v3/homoit0003517
narrower: https://homosaurus.org/v3/homoit0003518
related: https://homosaurus.org/v3/homoit0003436

Gender conversion therapy
type: Concept
issued: 2024-07-31
modified: 2025-02-23
comment: Efforts to change the gender identity of a transgender or non-binary person to meet cisgender norms, typically under the belief that their identity is dangerous and/or the result of mental illness or trauma. The processes involved in conversion therapy include visualization training, spiritual interventions, and other aversion treatments.
alternative label: Conversion therapy for gender
alternative label: Conversion therapy for trans people
alternative label: Conversion therapy for transgender people
alternative label: Gender reorientation therapy
alternative label: Trans conversion therapy
alternative label: Transgender conversion therapy
broader: https://homosaurus.org/v3/homoit0000303
change note: Version 3.7.0
has top concept: Medical care
in scheme: v3

Gay painters
type: Concept
issued: 2024-07-31
modified: 2025-02-23
comment: Gay men who paint, either professionally or as a hobby.
broader: https://homosaurus.org/v3/homoit0003511
change note: Version 3.7.0
has top concept: LGBTQ+ people
in scheme: v3

Health care for transgender children and youth
type: Concept
issued: 2024-07-31
modified: 2025-02-23
comment: Organized measures taken for the maintenance or improvement of health via the prevention, diagnosis, and/or treatment of physical and mental health issues faced by transgender children and youth. This includes but is not limited to access to safe, legal therapy and counseling, hormone treatment, and gender-affirming surgery.
alternative label: Health care for trans children and youth
alternative label: Trans health care for children and youth
alternative label: Transgender health care for children and youth
broader: https://homosaurus.org/v3/homoit0000614
change note: Version 3.7.0
has top concept: Health care for LGBTQ+ people
in scheme: v3
related: https://homosaurus.org/v3/homoit0001400
related: https://homosaurus.org/v3/homoit0001452
related: https://homosaurus.org/v3/homoit0003502

Lavender linguistics
type: Concept
issued: 2024-07-31
modified: 2025-02-23
comment: The study of language as used by members of LGBTQ+ communities.
alternative label: LGBTQ+ linguistics
alternative label: Linguistics (LGBTQ)
broader: https://homosaurus.org/v3/homoit0001365
change note: Version 3.7.0
has top concept: Theories
in scheme: v3
related: https://homosaurus.org/v3/homoit0001317

Lesbian painters
type: Concept
issued: 2024-07-31
modified: 2025-02-23
comment: Lesbians who paint, either professionally or as a hobby.
broader: https://homosaurus.org/v3/homoit0003511
change note: Version 3.7.0
has top concept: LGBTQ+ people
in scheme: v3

Bisexual painters
type: Concept
issued: 2024-07-31
modified: 2025-02-23
comment: Bisexual people who paint, either professionally or as a hobby.
broader: https://homosaurus.org/v3/homoit0003511
change note: Version 3.7.0
has top concept: LGBTQ+ people
in scheme: v3

Transgender painters
type: Concept
issued: 2024-07-31
modified: 2025-02-23
comment: Trans people who paint, either professionally or as a hobby.
alternative label: Trans painters
broader: https://homosaurus.org/v3/homoit0003511
change note: Version 3.7.0
has top concept: LGBTQ+ people
in scheme: v3

Queer linguistics
type: Concept
issued: 2024-07-31
modified: 2025-02-23
comment: A field of linguistics that analyzes the effect of heteronormativity on the expression of sexual identity through language.
broader: https://homosaurus.org/v3/homoit0001365
change note: Version 3.7.0
has top concept: Theories
in scheme: v3
related: https://homosaurus.org/v3/homoit0001317

Bisexual political groups
type: Concept
issued: 2024-09-19
modified: 2025-02-23
comment: Organized groups centered on political change and action for bisexual people's rights.
broader: https://homosaurus.org/v3/homoit0003521
change note: Version 3.7.0
has top concept: LGBTQ+ political groups
in scheme: v3

Queer political groups
type: Concept
issued: 2024-09-19
modified: 2025-02-23
comment: Organized groups centered on political change and action for queer people's rights; may include advocacy and other political efforts for LGBTQ+ people's rights more broadly.
broader: https://homosaurus.org/v3/homoit0003521
change note: Version 3.7.0
has top concept: LGBTQ+ political groups
in scheme: v3

Megasexual political groups
type: Concept
issued: 2024-09-19
modified: 2025-02-23
comment: Organized groups centered on political change and action for megasexual people's rights.
broader: https://homosaurus.org/v3/homoit0003521
change note: Version 3.7.0
has top concept: LGBTQ+ political groups
in scheme: v3

Demisexual political groups
type: Concept
issued: 2024-09-19
modified: 2025-02-23
comment: Organized groups centered on political change and action for demisexual people's rights.
broader: https://homosaurus.org/v3/homoit0003521
change note: Version 3.7.0
has top concept: LGBTQ+ political groups
in scheme: v3

Intersex political groups
type: Concept
issued: 2024-09-19
modified: 2025-02-23
comment: Organized groups centered on political change and action for intersex people's rights.
broader: https://homosaurus.org/v3/homoit0003521
change note: Version 3.7.0
has top concept: LGBTQ+ political groups
in scheme: v3

Asexual political groups
type: Concept
issued: 2024-09-19
modified: 2025-02-23
comment: Organized groups centered on political change and action for asexual people's rights.
broader: https://homosaurus.org/v3/homoit0003521
change note: Version 3.7.0
has top concept: LGBTQ+ political groups
in scheme: v3

Non-binary political groups
type: Concept
issued: 2024-09-19
modified: 2025-02-23
comment: Organized groups centered on political change and action for non-binary people's rights.
alternative label: Nonbinary political groups
broader: https://homosaurus.org/v3/homoit0003521
change note: Version 3.7.0
has top concept: LGBTQ+ political groups
in scheme: v3

Aromantic political groups
type: Concept
issued: 2024-09-19
modified: 2025-02-23
comment: Organized groups centered on political change and action for aromantic people's rights.
broader: https://homosaurus.org/v3/homoit0003521
change note: Version 3.7.0
has top concept: LGBTQ+ political groups
in scheme: v3

Transgender political groups
type: Concept
issued: 2024-09-19
modified: 2025-02-23
comment: Organized groups centered on political change and action for trans people's rights.
alternative label: Trans political groups
broader: https://homosaurus.org/v3/homoit0003521
change note: Version 3.7.0
has top concept: LGBTQ+ political groups
in scheme: v3

Greyromantic political groups
type: Concept
issued: 2024-09-19
modified: 2025-02-23
comment: Organized groups centered on political change and action for greyromantic people's rights.
broader: https://homosaurus.org/v3/homoit0003521
change note: Version 3.7.0
has top concept: LGBTQ+ political groups
in scheme: v3

LGBTQ+ students
type: Concept
issued: 2024-09-19
modified: 2025-02-23
comment: LGBTQ+ people who are formally engaged in learning at an educational institution of some kind.
alternative label: Students (LGBTQ)
broader: https://homosaurus.org/v3/homoit0000915
change note: Version 3.7.0
has top concept: LGBTQ+ people
in scheme: v3
narrower: https://homosaurus.org/v3/homoit0003041
narrower: https://homosaurus.org/v3/homoit0003534
narrower: https://homosaurus.org/v3/homoit0003535
narrower: https://homosaurus.org/v3/homoit0003536
narrower: https://homosaurus.org/v3/homoit0003537
narrower: https://homosaurus.org/v3/homoit0003538
narrower: https://homosaurus.org/v3/homoit0003539
narrower: https://homosaurus.org/v3/homoit0003540
narrower: https://homosaurus.org/v3/homoit0003541
narrower: https://homosaurus.org/v3/homoit0003542
narrower: https://homosaurus.org/v3/homoit0003543
narrower: https://homosaurus.org/v3/homoit0003544
narrower: https://homosaurus.org/v3/homoit0003545
narrower: https://homosaurus.org/v3/homoit0003561
narrower: https://homosaurus.org/v3/homoit0003574
narrower: https://homosaurus.org/v3/homoit0003587
related: https://homosaurus.org/v3/homoit0003546
related: https://homosaurus.org/v3/homoit0000951

Aromantic students
type: Concept
issued: 2024-09-19
modified: 2025-02-23
comment: Aromantic people who are formally engaged in learning at an educational institution of some kind.
broader: https://homosaurus.org/v3/homoit0003533
change note: Version 3.7.0
has top concept: LGBTQ+ people
in scheme: v3

Asexual students
type: Concept
issued: 2024-09-19
modified: 2025-02-23
comment: Asexual people who are formally engaged in learning at an educational institution of some kind.
broader: https://homosaurus.org/v3/homoit0003533
change note: Version 3.7.0
has top concept: LGBTQ+ people
in scheme: v3

Bisexual students
type: Concept
issued: 2024-09-19
modified: 2025-02-23
comment: Bisexual people who are formally engaged in learning at an educational institution of some kind.
broader: https://homosaurus.org/v3/homoit0003533
change note: Version 3.7.0
has top concept: LGBTQ+ people
in scheme: v3

Demisexual students
type: Concept
issued: 2024-09-19
modified: 2025-02-23
comment: Demisexual people who are formally engaged in learning at an educational institution of some kind.
broader: https://homosaurus.org/v3/homoit0003533
change note: Version 3.7.0
has top concept: LGBTQ+ people
in scheme: v3

Gay students
type: Concept
issued: 2024-09-19
modified: 2025-02-23
comment: Gay men who are formally engaged in learning at an educational institution of some kind.
broader: https://homosaurus.org/v3/homoit0003533
change note: Version 3.7.0
has top concept: LGBTQ+ people
in scheme: v3

Intersex students
type: Concept
issued: 2024-09-19
modified: 2025-02-23
comment: Intersex people who are formally engaged in learning at an educational institution of some kind.
broader: https://homosaurus.org/v3/homoit0003533
change note: Version 3.7.0
has top concept: LGBTQ+ people
in scheme: v3

Greyromantic students
type: Concept
issued: 2024-09-19
modified: 2025-02-23
comment: Greyromantic people who are formally engaged in learning at an educational institution of some kind.
broader: https://homosaurus.org/v3/homoit0003533
change note: Version 3.7.0
has top concept: LGBTQ+ people
in scheme: v3

Lesbian students
type: Concept
issued: 2024-09-19
modified: 2025-02-23
comment: Lesbians who are formally engaged in learning at an educational institution of some kind.
broader: https://homosaurus.org/v3/homoit0003533
change note: Version 3.7.0
has top concept: LGBTQ+ people
in scheme: v3

Megasexual students
type: Concept
issued: 2024-09-19
modified: 2025-02-23
comment: Megasexual people who are formally engaged in learning at an educational institution of some kind.
broader: https://homosaurus.org/v3/homoit0003533
change note: Version 3.7.0
has top concept: LGBTQ+ people
in scheme: v3

Non-binary students
type: Concept
issued: 2024-09-19
modified: 2025-02-23
comment: Non-binary people who are formally engaged in learning at an educational institution of some kind.
alternative label: Nonbinary students
broader: https://homosaurus.org/v3/homoit0003533
change note: Version 3.7.0
has top concept: LGBTQ+ people
in scheme: v3

Queer students
type: Concept
issued: 2024-09-19
modified: 2025-02-23
comment: Queer people who are formally engaged in learning at an educational institution of some kind.
broader: https://homosaurus.org/v3/homoit0003533
change note: Version 3.7.0
has top concept: LGBTQ+ people
in scheme: v3

Transgender students
type: Concept
issued: 2024-09-19
modified: 2025-02-23
comment: Transgender people who are formally engaged in learning at an educational institution of some kind.
alternative label: Trans students
broader: https://homosaurus.org/v3/homoit0003533
change note: Version 3.7.0
has top concept: LGBTQ+ people
in scheme: v3

Two-Spirit students
type: Concept
issued: 2024-09-19
modified: 2025-02-23
comment: Two-Spirit people who are formally engaged in learning at an educational institution of some kind.
alternative label: 2S students
alternative label: Two Spirited students
alternative label: Two-Spirited students
alternative label: Two Spirit students
broader: https://homosaurus.org/v3/homoit0001480
change note: Version 3.7.0
has top concept: Gender
in scheme: v3
narrower: https://homosaurus.org/v3/homoit0003571
narrower: https://homosaurus.org/v3/homoit0003586
narrower: https://homosaurus.org/v3/homoit0003591
related: https://homosaurus.org/v3/homoit0003533

LGBTQ+ archivists
type: Concept
issued: 2024-10-22
modified: 2025-02-23
comment: LGBTQ+ people who assess, curate, manage, process, preserve, steward, and/or provide access to records and archives of enduring historical value.
alternative label: Archivists (LGBTQ+)
broader: https://homosaurus.org/v3/homoit0003617
change note: Version 3.7.0
has top concept: LGBTQ+ information professionals
in scheme: v3
narrower: https://homosaurus.org/v3/homoit0003548
narrower: https://homosaurus.org/v3/homoit0003549
narrower: https://homosaurus.org/v3/homoit0003550
narrower: https://homosaurus.org/v3/homoit0003551
narrower: https://homosaurus.org/v3/homoit0003552
narrower: https://homosaurus.org/v3/homoit0003553
narrower: https://homosaurus.org/v3/homoit0003554
narrower: https://homosaurus.org/v3/homoit0003555
narrower: https://homosaurus.org/v3/homoit0003633
narrower: https://homosaurus.org/v3/homoit0003634
narrower: https://homosaurus.org/v3/homoit0003635
narrower: https://homosaurus.org/v3/homoit0003636
related: https://homosaurus.org/v3/homoit0000968
related: https://homosaurus.org/v3/homoit0001813
related: https://homosaurus.org/v3/homoit0003556

Lesbian archivists
type: Concept
issued: 2024-10-22
modified: 2025-02-23
comment: Lesbians who assess, curate, manage, process, preserve, steward, and/or provide access to records and archives of enduring historical value.
broader: https://homosaurus.org/v3/homoit0003547
change note: Version 3.7.0
has top concept: LGBTQ+ information professionals
in scheme: v3

Gay archivists
type: Concept
issued: 2024-10-22
modified: 2025-02-23
comment: Gay men who assess, curate, manage, process, preserve, steward, and/or provide access to records and archives of enduring historical value.
broader: https://homosaurus.org/v3/homoit0003547
change note: Version 3.7.0
has top concept: LGBTQ+ information professionals
in scheme: v3

Bisexual archivists
type: Concept
issued: 2024-10-22
modified: 2025-02-23
comment: Bisexual people who assess, curate, manage, process, preserve, steward, and/or provide access to records and archives of enduring historical value.
broader: https://homosaurus.org/v3/homoit0003547
change note: Version 3.7.0
has top concept: LGBTQ+ information professionals
in scheme: v3

Transgender archivists
type: Concept
issued: 2024-10-22
modified: 2025-02-23
comment: Transgender people who assess, curate, manage, process, preserve, steward, and/or provide access to records and archives of enduring historical value.
alternative label: Trans archivists
broader: https://homosaurus.org/v3/homoit0003547
change note: Version 3.7.0
has top concept: LGBTQ+ information professionals
in scheme: v3

Queer archivists
type: Concept
issued: 2024-10-22
modified: 2025-02-23
comment: Queer people who assess, curate, manage, process, preserve, steward, and/or provide access to records and archives of enduring historical value.
broader: https://homosaurus.org/v3/homoit0003547
change note: Version 3.7.0
has top concept: LGBTQ+ information professionals
in scheme: v3

Intersex archivists
type: Concept
issued: 2024-10-22
modified: 2025-02-23
comment: Intersex people who assess, curate, manage, process, preserve, steward, and/or provide access to records and archives of enduring historical value.
broader: https://homosaurus.org/v3/homoit0003547
change note: Version 3.7.0
has top concept: LGBTQ+ information professionals
in scheme: v3

Asexual archivists
type: Concept
issued: 2024-10-22
modified: 2025-02-23
comment: Asexual people who assess, curate, manage, process, preserve, steward, and/or provide access to records and archives of enduring historical value.
broader: https://homosaurus.org/v3/homoit0003547
change note: Version 3.7.0
has top concept: LGBTQ+ information professionals
in scheme: v3

Non-binary archivists
type: Concept
issued: 2024-10-22
modified: 2025-02-23
comment: Non-binary people who assess, curate, manage, process, preserve, steward, and/or provide access to records and archives of enduring historical value.
alternative label: Nonbinary archivists
broader: https://homosaurus.org/v3/homoit0003547
change note: Version 3.7.0
has top concept: LGBTQ+ information professionals
in scheme: v3

Two-Spirit archivists
type: Concept
issued: 2024-10-22
modified: 2025-02-23
comment: Two-Spirit people who assess, curate, manage, process, preserve, steward, and/or provide access to records and archives of enduring historical value.
alternative label: Two Spirit archivists
alternative label: Two Spirited archivists
alternative label: Two-Spirited archivists
alternative label: 2S archivists
broader: https://homosaurus.org/v3/homoit0003619
change note: Version 3.7.0
has top concept: Gender
in scheme: v3
related: https://homosaurus.org/v3/homoit0003547

Non-binary people of color
type: Concept
issued: 2024-10-22
modified: 2025-02-23
comment: Primarily used in the United States, this term refers to non-binary people who are not white and who identify as people of color.
alternative label: Nonbinary people of color
broader: https://homosaurus.org/v3/homoit0001101
change note: Version 3.7.0
has top concept: LGBTQ+ people
in scheme: v3
preferred label: Non-binary people of colour

African American non-binary people
type: Concept
issued: 2024-10-22
modified: 2025-02-23
comment: Non-binary people of African descent born in the United States or non-binary people born in African countries who live in or have a strong connection to the United States. Use for individuals who self-identity as African American. Follow the individual’s preference for African American or Black whenever possible.
alternative label: Non-binary African Americans
alternative label: Non-binary African American people
alternative label: African American nonbinary people
alternative label: Nonbinary African American people
alternative label: Nonbinary African Americans
broader: https://homosaurus.org/v3/homoit0000015
change note: Version 3.7.0
has top concept: LGBTQ+ people
in scheme: v3

Asian non-binary people
type: Concept
issued: 2024-10-22
modified: 2025-02-23
comment: Non-binary people of Asian heritage or descent, living in Asia or part of the Asian diaspora. Only use for people who self-identify as Asian.
alternative label: Non-binary Asians
alternative label: Non-binary Asian people
alternative label: Nonbinary Asians
alternative label: Nonbinary Asian people
alternative label: Asian nonbinary people
broader: https://homosaurus.org/v3/homoit0000074
change note: Version 3.7.0
has top concept: LGBTQ+ people
in scheme: v3

LGBTQ+ high school students
type: Concept
issued: 2024-10-22
modified: 2025-02-23
comment: LGBTQ+ people who attend high school, generally consisting of grades 9-12 (sometimes referred to as freshman through senior year) with students between the ages of 14 and 18.
alternative label: High school students (LGBTQ)
alternative label: LGBTQ+ secondary school students
alternative label: Secondary school students (LGBTQ)
broader: https://homosaurus.org/v3/homoit0003533
change note: Version 3.7.0
has top concept: LGBTQ+ people
in scheme: v3
narrower: https://homosaurus.org/v3/homoit0003562
narrower: https://homosaurus.org/v3/homoit0003563
narrower: https://homosaurus.org/v3/homoit0003564
narrower: https://homosaurus.org/v3/homoit0003565
narrower: https://homosaurus.org/v3/homoit0003566
narrower: https://homosaurus.org/v3/homoit0003567
narrower: https://homosaurus.org/v3/homoit0003568
narrower: https://homosaurus.org/v3/homoit0003569
narrower: https://homosaurus.org/v3/homoit0003570
narrower: https://homosaurus.org/v3/homoit0003572
narrower: https://homosaurus.org/v3/homoit0003573
related: https://homosaurus.org/v3/homoit0003571

Lesbian high school students
type: Concept
issued: 2024-10-22
modified: 2025-02-23
comment: Lesbians who who attend high school, generally consisting of grades 9-12 (sometimes referred to as freshman through senior year) with students between the ages of 14 and 18.
alternative label: Lesbian secondary school students
broader: https://homosaurus.org/v3/homoit0003561
change note: Version 3.7.0
has top concept: LGBTQ+ people
in scheme: v3

Gay high school students
type: Concept
issued: 2024-10-22
modified: 2025-02-23
comment: Gay people who attend high school, generally consisting of grades 9-12 (sometimes referred to as freshman through senior year) with students between the ages of 14 and 18.
alternative label: Gay secondary school students
broader: https://homosaurus.org/v3/homoit0003561
change note: Version 3.7.0
has top concept: LGBTQ+ people
in scheme: v3

Bisexual high school students
type: Concept
issued: 2024-10-22
modified: 2025-02-23
comment: Bisexual people who attend high school, generally consisting of grades 9-12 (sometimes referred to as freshman through senior year) with students between the ages of 14 and 18.
alternative label: Bisexual secondary school students
broader: https://homosaurus.org/v3/homoit0003561
change note: Version 3.7.0
has top concept: LGBTQ+ people
in scheme: v3

Transgender high school students
type: Concept
issued: 2024-10-22
modified: 2025-02-23
comment: Transgender people who attend high school, generally consisting of grades 9-12 (sometimes referred to as freshman through senior year) with students between the ages of 14 and 18.
alternative label: Trans high school students
alternative label: Transgender secondary school students
alternative label: Trans secondary school students
broader: https://homosaurus.org/v3/homoit0003561
change note: Version 3.7.0
has top concept: LGBTQ+ people
in scheme: v3

Queer high school students
type: Concept
issued: 2024-10-22
modified: 2025-02-23
comment: Queer people who attend high school, generally consisting of grades 9-12 (sometimes referred to as freshman through senior year) with students between the ages of 14 and 18.
alternative label: Queer secondary school students
broader: https://homosaurus.org/v3/homoit0003561
change note: Version 3.7.0
has top concept: LGBTQ+ people
in scheme: v3

Intersex high school students
type: Concept
issued: 2024-10-22
modified: 2025-02-23
comment: Intersex people who attend high school, generally consisting of grades 9-12 (sometimes referred to as freshman through senior year) with students between the ages of 14 and 18.
alternative label: Intersex secondary school students
broader: https://homosaurus.org/v3/homoit0003561
change note: Version 3.7.0
has top concept: LGBTQ+ people
in scheme: v3

Asexual high school students
type: Concept
issued: 2024-10-22
modified: 2025-02-23
comment: Asexual people who attend high school, generally consisting of grades 9-12 (sometimes referred to as freshman through senior year) with students between the ages of 14 and 18.
alternative label: Asexual secondary school students
broader: https://homosaurus.org/v3/homoit0003561
change note: Version 3.7.0
has top concept: LGBTQ+ people
in scheme: v3

Aromantic high school students
type: Concept
issued: 2024-10-22
modified: 2025-02-23
comment: Aromantic people who attend high school, generally consisting of grades 9-12 (sometimes referred to as freshman through senior year) with students between the ages of 14 and 18.
alternative label: Aromantic secondary school students
broader: https://homosaurus.org/v3/homoit0003561
change note: Version 3.7.0
has top concept: LGBTQ+ people
in scheme: v3

Non-binary high school students
type: Concept
issued: 2024-10-22
modified: 2025-02-23
comment: Non-binary people who attend high school, generally consisting of grades 9-12 (sometimes referred to as freshman through senior year) with students between the ages of 14 and 18.
alternative label: Nonbinary high school students
alternative label: Non-binary secondary school students
alternative label: Nonbinary secondary school students
broader: https://homosaurus.org/v3/homoit0003561
change note: Version 3.7.0
has top concept: LGBTQ+ people
in scheme: v3

Two-Spirit high school students
type: Concept
issued: 2024-10-22
modified: 2025-02-23
comment: Two-Spirit people who attend high school, generally consisting of grades 9-12 (sometimes referred to as freshman through senior year) with students between the ages of 14 and 18.
alternative label: 2S high school students
alternative label: Two Spirit high school students
alternative label: Two-Spirited high school students
alternative label: Two Spirited high school students
alternative label: 2S secondary school students
alternative label: Two Spirit secondary school students
alternative label: Two-Spirited secondary school students
alternative label: Two Spirited secondary school students
broader: https://homosaurus.org/v3/homoit0003546
change note: Version 3.7.0
has top concept: Gender
in scheme: v3
related: https://homosaurus.org/v3/homoit0003561

Demisexual high school students
type: Concept
issued: 2024-10-22
modified: 2025-02-23
comment: Demisexual people who attend high school, generally consisting of grades 9-12 (sometimes referred to as freshman through senior year) with students between the ages of 14 and 18.
alternative label: Demisexual secondary school students
broader: https://homosaurus.org/v3/homoit0003561
change note: Version 3.7.0
has top concept: LGBTQ+ people
in scheme: v3

Greyromantic high school students
type: Concept
issued: 2024-10-22
modified: 2025-02-23
comment: Greyromantic people who attend high school, generally consisting of grades 9-12 (sometimes referred to as freshman through senior year) with students between the ages of 14 and 18.
alternative label: Greyromantic secondary school students
broader: https://homosaurus.org/v3/homoit0003561
change note: Version 3.7.0
has top concept: LGBTQ+ people
in scheme: v3

LGBTQ+ middle school students
type: Concept
issued: 2024-10-22
modified: 2025-02-23
comment: LGBTQ+ people who attend middle school, generally consisting of grades 6 through 8 with students between the ages of 11 and 14.
alternative label: Middle school students (LGBTQ)
alternative label: LGBTQ+ junion high students
alternative label: Junior high students (LGBTQ)
broader: https://homosaurus.org/v3/homoit0003533
change note: Version 3.7.0
has top concept: LGBTQ+ people
in scheme: v3
narrower: https://homosaurus.org/v3/homoit0003575
narrower: https://homosaurus.org/v3/homoit0003576
narrower: https://homosaurus.org/v3/homoit0003577
narrower: https://homosaurus.org/v3/homoit0003578
narrower: https://homosaurus.org/v3/homoit0003579
narrower: https://homosaurus.org/v3/homoit0003580
narrower: https://homosaurus.org/v3/homoit0003581
narrower: https://homosaurus.org/v3/homoit0003582
narrower: https://homosaurus.org/v3/homoit0003583
narrower: https://homosaurus.org/v3/homoit0003584
narrower: https://homosaurus.org/v3/homoit0003585
related: https://homosaurus.org/v3/homoit0003586

Lesbian middle school students
type: Concept
issued: 2024-10-22
modified: 2025-02-23
comment: Lesbians who attend middle school, generally consisting of grades 6 through 8 with students between the ages of 11 and 14.
alternative label: Lesbian junior high school students
broader: https://homosaurus.org/v3/homoit0003574
change note: Version 3.7.0
has top concept: LGBTQ+ people
in scheme: v3

Gay middle school students
type: Concept
issued: 2024-10-22
modified: 2025-02-23
comment: Gay people who attend middle school, generally consisting of grades 6 through 8 with students between the ages of 11 and 14.
alternative label: Gay junior high school students
broader: https://homosaurus.org/v3/homoit0003574
change note: Version 3.7.0
has top concept: LGBTQ+ people
in scheme: v3

Bisexual middle school students
type: Concept
issued: 2024-10-22
modified: 2025-02-23
comment: Bisexual people who attend middle school, generally consisting of grades 6 through 8 with students between the ages of 11 and 14.
alternative label: Bi middle school students
alternative label: Bisexual junior high school students
broader: https://homosaurus.org/v3/homoit0003574
change note: Version 3.7.0
has top concept: LGBTQ+ people
in scheme: v3

Transgender middle school students
type: Concept
issued: 2024-10-22
modified: 2025-02-23
comment: Transgender people who attend middle school, generally consisting of grades 6 through 8 with students between the ages of 11 and 14.
alternative label: Trans middle school students
alternative label: Trans junior high school students
alternative label: Transgender junior high school students
broader: https://homosaurus.org/v3/homoit0003574
change note: Version 3.7.0
has top concept: LGBTQ+ people
in scheme: v3

Queer middle school students
type: Concept
issued: 2024-10-22
modified: 2025-02-23
comment: Queer people who attend middle school, generally consisting of grades 6 through 8 with students between the ages of 11 and 14.
alternative label: Queer junior high school students
broader: https://homosaurus.org/v3/homoit0003574
change note: Version 3.7.0
has top concept: LGBTQ+ people
in scheme: v3

Intersex middle school students
type: Concept
issued: 2024-10-22
modified: 2025-02-23
comment: Intersex people who attend middle school, generally consisting of grades 6 through 8 with students between the ages of 11 and 14.
alternative label: Intersex junior high school students
broader: https://homosaurus.org/v3/homoit0003574
change note: Version 3.7.0
has top concept: LGBTQ+ people
in scheme: v3

Asexual middle school students
type: Concept
issued: 2024-10-22
modified: 2025-02-23
comment: Asexual people who attend middle school, generally consisting of grades 6 through 8 with students between the ages of 11 and 14.
alternative label: Asexual junior high school students
broader: https://homosaurus.org/v3/homoit0003574
change note: Version 3.7.0
has top concept: LGBTQ+ people
in scheme: v3

Aromantic middle school students
type: Concept
issued: 2024-10-22
modified: 2025-02-23
comment: Aromantic people who attend middle school, generally consisting of grades 6 through 8 with students between the ages of 11 and 14.
alternative label: Aromantic junior high school students
broader: https://homosaurus.org/v3/homoit0003574
change note: Version 3.7.0
has top concept: LGBTQ+ people
in scheme: v3

Non-binary middle school students
type: Concept
issued: 2024-10-22
modified: 2025-02-23
comment: Non-binary people who attend middle school, generally consisting of grades 6 through 8 with students between the ages of 11 and 14.
alternative label: Nonbinary middle school students
alternative label: Non-binary junior high school students
alternative label: Nonbinary junion high school students
broader: https://homosaurus.org/v3/homoit0003574
change note: Version 3.7.0
has top concept: LGBTQ+ people
in scheme: v3

Demisexual middle school students
type: Concept
issued: 2024-10-22
modified: 2025-02-23
comment: Demisexual people who attend middle school, generally consisting of grades 6 through 8 with students between the ages of 11 and 14.
alternative label: Demisexual junior high school students
broader: https://homosaurus.org/v3/homoit0003574
change note: Version 3.7.0
has top concept: LGBTQ+ people
in scheme: v3

Greyromantic middle school students
type: Concept
issued: 2024-10-22
modified: 2025-02-23
comment: Greyromantic people who attend middle school, generally consisting of grades 6 through 8 with students between the ages of 11 and 14.
broader: https://homosaurus.org/v3/homoit0003574
change note: Version 3.7.0
has top concept: LGBTQ+ people
in scheme: v3

Two-Spirit middle school students
type: Concept
issued: 2024-10-22
modified: 2025-02-23
comment: Two-Spirit people who attend middle school, generally consisting of grades 6 through 8 with students between the ages of 11 and 14.
alternative label: Two-Spirit junior high school students
alternative label: Two Spirit junior high school students
alternative label: Two Spirited junior high school students
alternative label: Two-Spirited junior high school students
alternative label: 2S junior high school students
alternative label: Two Spirit middle school students
alternative label: Two-Spirited middle school students
alternative label: Two Spirited middle school students
alternative label: 2S middle school students
broader: https://homosaurus.org/v3/homoit0003546
change note: Version 3.7.0
has top concept: Gender
in scheme: v3
related: https://homosaurus.org/v3/homoit0003574

LGBTQ+ elementary school students
type: Concept
issued: 2024-10-22
modified: 2025-02-23
comment: LGBTQ+ people who attend elementary school, generally consisting of grades k through 5 with students between the ages of 4 and 10.
alternative label: Elementary school students (LGBTQ)
alternative label: LGBTQ+ primary school students
alternative label: Primary school students (LGBTQ)
broader: https://homosaurus.org/v3/homoit0003533
change note: Version 3.7.0
has top concept: LGBTQ+ people
in scheme: v3
narrower: https://homosaurus.org/v3/homoit0003588
narrower: https://homosaurus.org/v3/homoit0003589
narrower: https://homosaurus.org/v3/homoit0003590
related: https://homosaurus.org/v3/homoit0003591

Transgender elementary school students
type: Concept
issued: 2024-10-22
modified: 2025-02-23
comment: Transgender people who attend elementary school, generally consisting of grades k through 5 with students between the ages of 4 and 10.
alternative label: Trans elementary school students
alternative label: Transgender primary school students
alternative label: Trans primary school students
broader: https://homosaurus.org/v3/homoit0003587
change note: Version 3.7.0
has top concept: LGBTQ+ people
in scheme: v3

Intersex elementary school students
type: Concept
issued: 2024-10-22
modified: 2025-02-23
comment: Intersex people who attend elementary school, generally consisting of grades k through 5 with students between the ages of 4 and 10.
alternative label: Intersex primary school students
broader: https://homosaurus.org/v3/homoit0003587
change note: Version 3.7.0
has top concept: LGBTQ+ people
in scheme: v3

Non-binary elementary school students
type: Concept
issued: 2024-10-22
modified: 2025-02-23
comment: Non-binary people who attend elementary school, generally consisting of grades k through 5 with students between the ages of 4 and 10.
alternative label: Nonbinary elementary school students
alternative label: Non-binary primary school students
alternative label: Nonbinary primary school students
broader: https://homosaurus.org/v3/homoit0003587
change note: Version 3.7.0
has top concept: LGBTQ+ people
in scheme: v3

Two-Spirit elementary school students
type: Concept
issued: 2024-10-22
modified: 2025-02-23
comment: Two-Spirit people who attend elementary school, generally consisting of grades k through 5 with students between the ages of 4 and 10.
alternative label: Two Spirit elementary school students
alternative label: Two Spirited elementary school students
alternative label: Two-Spirited elementary school students
alternative label: 2S elementary school students
alternative label: Two-Spirit primary school students
alternative label: Two Spirit primary school students
alternative label: Two Spirited primary school students
alternative label: Two-Spirited primary school students
alternative label: 2S primary school students
broader: https://homosaurus.org/v3/homoit0003546
change note: Version 3.7.0
has top concept: Gender
in scheme: v3
related: https://homosaurus.org/v3/homoit0003587

Queerplatonic relationships
type: Concept
issued: 2024-10-22
modified: 2025-02-23
comment: A term that originated in aromantic and asexual spaces to describe committed intimate relationships between significant others that are not romantic in nature.
alternative label: QPR
alternative label: Queerplatonic partnerships
alternative label: QPP
broader: https://homosaurus.org/v3/homoit0001237
change note: Version 3.7.0
has top concept: LGBTQ+ relationships
in scheme: v3
related: https://homosaurus.org/v3/homoit0000921

Lesbian events
type: Concept
issued: 2024-10-22
modified: 2025-02-23
comment: Organized public or social occasions for lesbians and lesbian communities.
broader: https://homosaurus.org/v3/homoit0000861
change note: Version 3.7.0
has top concept: LGBTQ+ events
in scheme: v3

Gay events
type: Concept
issued: 2024-10-22
modified: 2025-02-23
comment: Organized public or social occasions for gay men and gay communities.
broader: https://homosaurus.org/v3/homoit0000861
change note: Version 3.7.0
has top concept: LGBTQ+ events
in scheme: v3

Bisexual events
type: Concept
issued: 2024-10-22
modified: 2025-02-23
comment: Organized public or social occasions for bisexual people and communities.
broader: https://homosaurus.org/v3/homoit0000861
change note: Version 3.7.0
has top concept: LGBTQ+ events
in scheme: v3

Transgender events
type: Concept
issued: 2024-10-22
modified: 2025-02-23
comment: Organized public or social occasions for trans people and communities.
alternative label: Trans events
broader: https://homosaurus.org/v3/homoit0000861
change note: Version 3.7.0
has top concept: LGBTQ+ events
in scheme: v3

Queer events
type: Concept
issued: 2024-10-22
modified: 2025-02-23
comment: Organized public or social occasions for queer people and communities.
broader: https://homosaurus.org/v3/homoit0000861
change note: Version 3.7.0
has top concept: LGBTQ+ events
in scheme: v3

Non-binary events
type: Concept
issued: 2024-10-22
modified: 2025-02-23
comment: Organized public or social occasions for non-binary people and communities.
alternative label: Nonbinary events
broader: https://homosaurus.org/v3/homoit0000861
change note: Version 3.7.0
has top concept: LGBTQ+ events
in scheme: v3

Intersex events
type: Concept
issued: 2024-10-22
modified: 2025-02-23
comment: Organized public or social occasions for intersex people and communities.
broader: https://homosaurus.org/v3/homoit0000861
change note: Version 3.7.0
has top concept: LGBTQ+ events
in scheme: v3

Asexual events
type: Concept
issued: 2024-10-22
modified: 2025-02-23
comment: Organized public or social occasions for asexual people and communities.
broader: https://homosaurus.org/v3/homoit0000861
change note: Version 3.7.0
has top concept: LGBTQ+ events
in scheme: v3

Aromantic events
type: Concept
issued: 2024-10-22
modified: 2025-02-23
comment: Organized public or social occasions for aromantic people and communities.
broader: https://homosaurus.org/v3/homoit0000861
change note: Version 3.7.0
has top concept: LGBTQ+ events
in scheme: v3

Demisexual events
type: Concept
issued: 2024-10-22
modified: 2025-02-23
comment: Organized public or social occasions for demisexual people and communities.
broader: https://homosaurus.org/v3/homoit0000861
change note: Version 3.7.0
has top concept: LGBTQ+ events
in scheme: v3

Greyromantic events
type: Concept
issued: 2024-10-22
modified: 2025-02-23
comment: Organized public or social occasions for greyromantic people and communities.
broader: https://homosaurus.org/v3/homoit0000861
change note: Version 3.7.0
has top concept: LGBTQ+ events
in scheme: v3

Megasexual events
type: Concept
issued: 2024-10-22
modified: 2025-02-23
comment: Organized public or social occasions for megasexual people and communities.
broader: https://homosaurus.org/v3/homoit0000861
change note: Version 3.7.0
has top concept: LGBTQ+ events
in scheme: v3

Black queer archives
type: Concept
issued: 2024-10-22
modified: 2025-02-23
comment: Collections of records and materials relating to Black queer people and communities, or collections of records and materials relating to Black people and communities that are curated, organized, and presented from a queer perspective. Can include a variety of organizations and institutions from community to government archives.
alternative label: Queer Black archives
broader: https://homosaurus.org/v3/homoit0000066
change note: Version 3.7.0
has top concept: LGBTQ+ cultural heritage institutions
in scheme: v3
related: https://homosaurus.org/v3/homoit0001163

LGBTQ+ music
type: Concept
issued: 2024-10-22
modified: 2025-02-23
comment: Music created by LGBTQ+ artists, for LGBTQ+ audiences, and/or that expresses an LGBTQ+ sensibility.
alternative label: Music (LGBTQ)
broader: https://homosaurus.org/v3/homoit0000816
change note: Version 3.7.0
has top concept: Subcultures
in scheme: v3
narrower: https://homosaurus.org/v3/homoit0003159
narrower: https://homosaurus.org/v3/homoit0003611
narrower: https://homosaurus.org/v3/homoit0003612
related: https://homosaurus.org/v3/homoit0000908

LGBTQ+ rap music
type: Concept
issued: 2024-10-22
modified: 2025-02-23
comment: Rap music created by LGBTQ+ artists, for LGBTQ+ audiences, and/or that expresses an LGBTQ+ sensibility.
alternative label: Rap music (LGBTQ)
alternative label: Rap (LGBTQ)
broader: https://homosaurus.org/v3/homoit0003610
change note: Version 3.7.0
has top concept: Subcultures
in scheme: v3

LGBTQ+ pop music
type: Concept
issued: 2024-10-22
modified: 2025-02-23
comment: Pop music created by LGBTQ+ artists, for LGBTQ+ audiences, and/or that expresses an LGBTQ+ sensibility.
alternative label: Pop music (LGBTQ)
alternative label: Pop (LGBTQ)
alternative label: LGBTQ+ popular music
alternative label: Popular music (LGBTQ)
broader: https://homosaurus.org/v3/homoit0003610
change note: Version 3.7.0
has top concept: Subcultures
in scheme: v3

Women's sexuality
type: Concept
issued: 2024-10-22
modified: 2025-02-23
comment: Term used to describe the ways in which women experience and express themselves sexually, including the types of people and practices they are sexually interested in.
alternative label: Female sexuality
broader: https://homosaurus.org/v3/homoit0001306
change note: Version 3.7.0
has top concept: Sexuality
in scheme: v3
related: https://homosaurus.org/v3/homoit0002279
related: https://homosaurus.org/v3/homoit0001510

Queer architecture
type: Concept
issued: 2024-10-22
modified: 2025-02-23
comment: A school of architecture that seeks to create spaces that critique normative conceptions of gender and sexuality.
alternative label: Queer design
broader: https://homosaurus.org/v3/homoit0002601
broader: https://homosaurus.org/v3/homoit0001219
change note: Version 3.7.0
has top concept: Subcultures
in scheme: v3

Queer ecology
type: Concept
issued: 2024-10-22
modified: 2025-02-23
comment: A school of ecology that seeks to understand nature, biology, and sexuality through the framing of queer theory. Queer ecology rejects the presumption of heterosexuality and cisgenderedness as natural, as well as notions of human exceptionalism and anthropocentrism.
alternative label: Queer ecologies
broader: https://homosaurus.org/v3/homoit0001219
change note: Version 3.7.0
has top concept: Theories
in scheme: v3

Decolonial theory
type: Concept
issued: 2024-10-22
modified: 2025-02-23
comment: A school of thought that rejects Eurocentric knowledge hierarchies and ways of being, including the presumed superiority of white Western culture.
alternative label: Decoloniality
alternative label: Decolonizing theory
alternative label: Postcolonial theory
alternative label: Postcolonialism
broader: https://homosaurus.org/v3/homoit0001365
change note: Version 3.7.0
has top concept: Theories
in scheme: v3

LGBTQ+ librarians
type: Concept
issued: 2024-10-22
modified: 2025-02-23
comment: LGBTQ+ people, typically with degrees in library science, who work, manage, or assist in a library setting.
alternative label: Librarians (LGBTQ+)
broader: https://homosaurus.org/v3/homoit0003617
change note: Version 3.7.0
has top concept: LGBTQ+ information professionals
in scheme: v3
narrower: https://homosaurus.org/v3/homoit0003620
narrower: https://homosaurus.org/v3/homoit0003621
narrower: https://homosaurus.org/v3/homoit0003622
narrower: https://homosaurus.org/v3/homoit0003623
narrower: https://homosaurus.org/v3/homoit0003624
narrower: https://homosaurus.org/v3/homoit0003625
narrower: https://homosaurus.org/v3/homoit0003626
narrower: https://homosaurus.org/v3/homoit0003628
narrower: https://homosaurus.org/v3/homoit0003629
narrower: https://homosaurus.org/v3/homoit0003630
narrower: https://homosaurus.org/v3/homoit0003631
narrower: https://homosaurus.org/v3/homoit0003632
related: https://homosaurus.org/v3/homoit0000968
related: https://homosaurus.org/v3/homoit0000972
related: https://homosaurus.org/v3/homoit0003247
related: https://homosaurus.org/v3/homoit0003627

Two-Spirit information professionals
type: Concept
issued: 2024-10-22
modified: 2025-02-23
comment: Two-Spirit people whose profession involves managing information by collecting, organizing, storing and disseminating it. This can include but is not limited to librarians, archivists, metadata and IT workers, web developers, and chief information officers. Use more specific terms when possible.
alternative label: Two Spirit information professionals
alternative label: Two-Spirited information professionals
alternative label: Two Spirited information professionals
alternative label: 2s information professionals
broader: https://homosaurus.org/v3/homoit0001480
change note: Version 3.7.0
has top concept: Gender
in scheme: v3
narrower: https://homosaurus.org/v3/homoit0003556
narrower: https://homosaurus.org/v3/homoit0003627
related: https://homosaurus.org/v3/homoit0003617

Lesbian librarians
type: Concept
issued: 2024-10-22
modified: 2025-02-23
comment: Lesbians, typically with degrees in library science, who work, manage, or assist in a library setting.
broader: https://homosaurus.org/v3/homoit0003618
change note: Version 3.7.0
has top concept: LGBTQ+ information professionals
in scheme: v3

Gay librarians
type: Concept
issued: 2024-10-22
modified: 2025-02-23
comment: Gay people, typically with degrees in library science, who work, manage, or assist in a library setting.
broader: https://homosaurus.org/v3/homoit0003618
change note: Version 3.7.0
has top concept: LGBTQ+ information professionals
in scheme: v3

Bisexual librarians
type: Concept
issued: 2024-10-22
modified: 2025-02-23
comment: Bisexual people, typically with degrees in library science, who work, manage, or assist in a library setting.
broader: https://homosaurus.org/v3/homoit0003618
change note: Version 3.7.0
has top concept: LGBTQ+ information professionals
in scheme: v3

Transgender librarians
type: Concept
issued: 2024-10-22
modified: 2025-02-23
comment: Transgender people, typically with degrees in library science, who work, manage, or assist in a library setting.
alternative label: Trans librarians
broader: https://homosaurus.org/v3/homoit0003618
change note: Version 3.7.0
has top concept: LGBTQ+ information professionals
in scheme: v3

Queer librarians
type: Concept
issued: 2024-10-22
modified: 2025-02-23
comment: Queer people, typically with degrees in library science, who work, manage, or assist in a library setting.
broader: https://homosaurus.org/v3/homoit0003618
change note: Version 3.7.0
has top concept: LGBTQ+ information professionals
in scheme: v3

Non-binary librarians
type: Concept
issued: 2024-10-22
modified: 2025-02-23
comment: Non-binary people, typically with degrees in library science, who work, manage, or assist in a library setting.
alternative label: Nonbinary librarians
broader: https://homosaurus.org/v3/homoit0003618
change note: Version 3.7.0
has top concept: LGBTQ+ information professionals
in scheme: v3

Intersex librarians
type: Concept
issued: 2024-10-22
modified: 2025-02-23
comment: Intersex people, typically with degrees in library science, who work, manage, or assist in a library setting.
broader: https://homosaurus.org/v3/homoit0003618
change note: Version 3.7.0
has top concept: LGBTQ+ information professionals
in scheme: v3

Two-Spirit librarians
type: Concept
issued: 2024-10-22
modified: 2025-02-23
comment: Two-Spirit people, typically with degrees in library science, who work, manage, or assist in a library setting.
alternative label: 2S librarians
alternative label: Two Spirit librarians
alternative label: Two-Spirited librarians
alternative label: Two Spirited librarians
broader: https://homosaurus.org/v3/homoit0003619
change note: Version 3.7.0
has top concept: Gender
in scheme: v3
related: https://homosaurus.org/v3/homoit0003618

Asexual librarians
type: Concept
issued: 2024-10-22
modified: 2025-02-23
comment: Asexual people, typically with degrees in library science, who work, manage, or assist in a library setting.
broader: https://homosaurus.org/v3/homoit0003618
change note: Version 3.7.0
has top concept: LGBTQ+ information professionals
in scheme: v3

Aromantic librarians
type: Concept
issued: 2024-10-22
modified: 2025-02-23
comment: Aromantic people, typically with degrees in library science, who work, manage, or assist in a library setting.
broader: https://homosaurus.org/v3/homoit0003618
change note: Version 3.7.0
has top concept: LGBTQ+ information professionals
in scheme: v3

Demisexual librarians
type: Concept
issued: 2024-10-22
modified: 2025-02-23
comment: Demisexual people, typically with degrees in library science, who work, manage, or assist in a library setting.
broader: https://homosaurus.org/v3/homoit0003618
change note: Version 3.7.0
has top concept: LGBTQ+ information professionals
in scheme: v3

Greyromantic librarians
type: Concept
issued: 2024-10-22
modified: 2025-02-23
comment: Greyromantic people, typically with degrees in library science, who work, manage, or assist in a library setting.
broader: https://homosaurus.org/v3/homoit0003618
change note: Version 3.7.0
has top concept: LGBTQ+ information professionals
in scheme: v3

Megasexual librarians
type: Concept
issued: 2024-10-22
modified: 2025-02-23
comment: Megasexual people, typically with degrees in library science, who work, manage, or assist in a library setting.
broader: https://homosaurus.org/v3/homoit0003618
change note: Version 3.7.0
has top concept: LGBTQ+ information professionals
in scheme: v3

Aromantic archivists
type: Concept
issued: 2024-10-22
modified: 2025-02-23
comment: Aromantic people who assess, curate, manage, process, preserve, steward, and/or provide access to records and archives of enduring historical value.
broader: https://homosaurus.org/v3/homoit0003547
change note: Version 3.7.0
has top concept: LGBTQ+ information professionals
in scheme: v3

Demisexual archivists
type: Concept
issued: 2024-10-22
modified: 2025-02-23
comment: Demisexual people who assess, curate, manage, process, preserve, steward, and/or provide access to records and archives of enduring historical value.
broader: https://homosaurus.org/v3/homoit0003547
change note: Version 3.7.0
has top concept: LGBTQ+ information professionals
in scheme: v3

Greyromantic archivists
type: Concept
issued: 2024-10-22
modified: 2025-02-23
comment: Greyromantic people who assess, curate, manage, process, preserve, steward, and/or provide access to records and archives of enduring historical value.
broader: https://homosaurus.org/v3/homoit0003547
change note: Version 3.7.0
has top concept: LGBTQ+ information professionals
in scheme: v3

Megasexual archivists
type: Concept
issued: 2024-10-22
modified: 2025-02-23
comment: Megasexual people who assess, curate, manage, process, preserve, steward, and/or provide access to records and archives of enduring historical value.
broader: https://homosaurus.org/v3/homoit0003547
change note: Version 3.7.0
has top concept: LGBTQ+ information professionals
in scheme: v3

LGBTQ+ scientists
type: Concept
issued: 2024-10-22
modified: 2025-02-23
comment: LGBTQ+ people who either study or have expert knowledge in one of the fields of the physical and/or natural sciences, including but not limited to chemists, biologists, physicists, psychologists, and multidisciplinary researchers.
alternative label: Scientists (LGBTQ+)
broader: https://homosaurus.org/v3/homoit0000915
change note: Version 3.7.0
has top concept: LGBTQ+ people
in scheme: v3
narrower: https://homosaurus.org/v3/homoit0003638
narrower: https://homosaurus.org/v3/homoit0003639
narrower: https://homosaurus.org/v3/homoit0003640
narrower: https://homosaurus.org/v3/homoit0003641
narrower: https://homosaurus.org/v3/homoit0003642
narrower: https://homosaurus.org/v3/homoit0003643
narrower: https://homosaurus.org/v3/homoit0003644
narrower: https://homosaurus.org/v3/homoit0003645
narrower: https://homosaurus.org/v3/homoit0003647
narrower: https://homosaurus.org/v3/homoit0003648
narrower: https://homosaurus.org/v3/homoit0003649
narrower: https://homosaurus.org/v3/homoit0003650
related: https://homosaurus.org/v3/homoit0003646

Lesbian scientists
type: Concept
issued: 2024-10-22
modified: 2025-02-23
comment: Lesbians who either study or have expert knowledge in one of the fields of the physical and/or natural sciences, including but not limited to chemists, biologists, physicists, psychologists, and multidisciplinary researchers.
broader: https://homosaurus.org/v3/homoit0003637
change note: Version 3.7.0
has top concept: LGBTQ+ people
in scheme: v3

Gay scientists
type: Concept
issued: 2024-10-22
modified: 2025-02-23
comment: Gay men who either study or have expert knowledge in one of the fields of the physical and/or natural sciences, including but not limited to chemists, biologists, physicists, psychologists, and multidisciplinary researchers.
broader: https://homosaurus.org/v3/homoit0003637
change note: Version 3.7.0
has top concept: LGBTQ+ people
in scheme: v3

Bisexual scientists
type: Concept
issued: 2024-10-22
modified: 2025-02-23
comment: Bisexual people who either study or have expert knowledge in one of the fields of the physical and/or natural sciences, including but not limited to chemists, biologists, physicists, psychologists, and multidisciplinary researchers.
broader: https://homosaurus.org/v3/homoit0003637
change note: Version 3.7.0
has top concept: LGBTQ+ people
in scheme: v3

Transgender scientists
type: Concept
issued: 2024-10-22
modified: 2025-02-23
comment: Transgender people who either study or have expert knowledge in one of the fields of the physical and/or natural sciences, including but not limited to chemists, biologists, physicists, psychologists, and multidisciplinary researchers.
alternative label: Trans scientists
broader: https://homosaurus.org/v3/homoit0003637
change note: Version 3.7.0
has top concept: LGBTQ+ people
in scheme: v3

Queer scientists
type: Concept
issued: 2024-10-22
modified: 2025-02-23
comment: Queer people who either study or have expert knowledge in one of the fields of the physical and/or natural sciences, including but not limited to chemists, biologists, physicists, psychologists, and multidisciplinary researchers.
broader: https://homosaurus.org/v3/homoit0003637
change note: Version 3.7.0
has top concept: LGBTQ+ people
in scheme: v3

Intersex scientists
type: Concept
issued: 2024-10-22
modified: 2025-02-23
comment: Intersex people who either study or have expert knowledge in one of the fields of the physical and/or natural sciences, including but not limited to chemists, biologists, physicists, psychologists, and multidisciplinary researchers.
broader: https://homosaurus.org/v3/homoit0003637
change note: Version 3.7.0
has top concept: LGBTQ+ people
in scheme: v3

Asexual scientists
type: Concept
issued: 2024-10-22
modified: 2025-02-23
comment: Asexual people who either study or have expert knowledge in one of the fields of the physical and/or natural sciences, including but not limited to chemists, biologists, physicists, psychologists, and multidisciplinary researchers.
broader: https://homosaurus.org/v3/homoit0003637
change note: Version 3.7.0
has top concept: LGBTQ+ people
in scheme: v3

Aromantic scientists
type: Concept
issued: 2024-10-22
modified: 2025-02-23
comment: Aromantic people who either study or have expert knowledge in one of the fields of the physical and/or natural sciences, including but not limited to chemists, biologists, physicists, psychologists, and multidisciplinary researchers.
broader: https://homosaurus.org/v3/homoit0003637
change note: Version 3.7.0
has top concept: LGBTQ+ people
in scheme: v3

Two-Spirit scientists
type: Concept
issued: 2024-10-22
modified: 2025-02-23
comment: Two-Spirit people who either study or have expert knowledge in one of the fields of the physical and/or natural sciences, including but not limited to chemists, biologists, physicists, psychologists, and multidisciplinary researchers.
alternative label: Two-Spirited scientists
alternative label: Two Spirit scientists
alternative label: 2S scientists
broader: https://homosaurus.org/v3/homoit0001480
change note: Version 3.7.0
has top concept: Gender
in scheme: v3
related: https://homosaurus.org/v3/homoit0003637

Non-binary scientists
type: Concept
issued: 2024-10-22
modified: 2025-02-23
comment: Non-binary people who either study or have expert knowledge in one of the fields of the physical and/or natural sciences, including but not limited to chemists, biologists, physicists, psychologists, and multidisciplinary researchers.
alternative label: Nonbinary scientists
broader: https://homosaurus.org/v3/homoit0003637
change note: Version 3.7.0
has top concept: LGBTQ+ people
in scheme: v3

Greyromantic scientists
type: Concept
issued: 2024-10-22
modified: 2025-02-23
comment: Greyromantic people who either study or have expert knowledge in one of the fields of the physical and/or natural sciences, including but not limited to chemists, biologists, physicists, psychologists, and multidisciplinary researchers.
broader: https://homosaurus.org/v3/homoit0003637
change note: Version 3.7.0
has top concept: LGBTQ+ people
in scheme: v3

Demisexual scientists
type: Concept
issued: 2024-10-22
modified: 2025-02-23
comment: Demisexual people who either study or have expert knowledge in one of the fields of the physical and/or natural sciences, including but not limited to chemists, biologists, physicists, psychologists, and multidisciplinary researchers.
broader: https://homosaurus.org/v3/homoit0003637
change note: Version 3.7.0
has top concept: LGBTQ+ people
in scheme: v3

Megasexual scientists
type: Concept
issued: 2024-10-22
modified: 2025-02-23
comment: Megasexual people who either study or have expert knowledge in one of the fields of the physical and/or natural sciences, including but not limited to chemists, biologists, physicists, psychologists, and multidisciplinary researchers.
broader: https://homosaurus.org/v3/homoit0003637
change note: Version 3.7.0
has top concept: LGBTQ+ people
in scheme: v3

Pride events
type: Concept
issued: 2024-10-22
modified: 2025-02-23
comment: Events that recognize and celebrate LGBTQ+ people and culture, thereby affirming the visibility, dignity, and diversity of LGBTQ+ communities.
alternative label: LGBTQ+ pride events
broader: https://homosaurus.org/v3/homoit0000861
change note: Version 3.7.0
has top concept: LGBTQ+ events
in scheme: v3
narrower: https://homosaurus.org/v3/homoit0001379
narrower: https://homosaurus.org/v3/homoit0000383
narrower: https://homosaurus.org/v3/homoit0003652
narrower: https://homosaurus.org/v3/homoit0003654
related: https://homosaurus.org/v3/homoit0002386

Pride parades
type: Concept
issued: 2024-10-22
modified: 2025-02-23
comment: Public parades that recognize and celebrate LGBTQ+ people and culture, thereby affirming the visibility, dignity, and diversity of LGBTQ+ communities.
alternative label: LGBTQ+ pride parades
broader: https://homosaurus.org/v3/homoit0003651
change note: Version 3.7.0
has top concept: LGBTQ+ events
in scheme: v3

Pride Month
type: Concept
issued: 2024-10-22
modified: 2025-02-23
comment: A period of public recognition and celebration of LGBTQ+ people and culture, usually organized over the course of a month with local events, parades, marches, and rallies. Pride occurs at different times during the year in different places but is typically held in June in the United States to commemorate the Stonewall uprising.
alternative label: LGBTQ+ Pride Month
broader: https://homosaurus.org/v3/homoit0003653
broader: https://homosaurus.org/v3/homoit0003651
change note: Version 3.7.0
has top concept: LGBTQ+ pride
in scheme: v3
narrower: https://homosaurus.org/v3/homoit0000523
related: https://homosaurus.org/v3/homoit0003656

Transgender pride
type: Concept
issued: 2024-10-22
modified: 2025-02-23
comment: The recognition and celebration of transgender people and culture, thereby affirming the visibility, dignity, and diversity of transgender communities.
alternative label: Trans pride
broader: https://homosaurus.org/v3/homoit0003653
change note: Version 3.7.0
has top concept: LGBTQ+ pride
in scheme: v3
related: https://homosaurus.org/v3/homoit0001379

LGBTQ+ History Month
type: Concept
issued: 2024-10-22
modified: 2025-02-23
comment: An annual, month-long observance of LGBTQ+ history and related civil rights movements. The month in which LGBTQ+ History Month is observed differs depending on the country.
alternative label: Gay History Month
broader: https://homosaurus.org/v3/homoit0000861
change note: Version 3.7.0
has top concept: LGBTQ+ events
in scheme: v3
related: https://homosaurus.org/v3/homoit0002260
related: https://homosaurus.org/v3/homoit0003654

Gender-affirming care
type: Concept
issued: 2024-10-22
modified: 2025-02-23
comment: Social, psychological, behavioral, and medical interventions designed to support and affirm an individual's gender identity. Gender-affirming care includes but is not limited to equal access to health care facilities, counseling, puberty blockers, hormone therapy, and gender-affirming surgeries. It can also include resources to aid in social transition, such as affirming policies regarding name and pronoun changes, access to non-gendered restrooms and facilities, etc.
alternative label: Gender affirming care
broader: https://homosaurus.org/v3/homoit0000614
change note: Version 3.7.0
has top concept: Health care for LGBTQ+ people
in scheme: v3
narrower: https://homosaurus.org/v3/homoit0000561
narrower: https://homosaurus.org/v3/homoit0003658
narrower: https://homosaurus.org/v3/homoit0003659

Intersex-affirming care
type: Concept
issued: 2024-10-22
modified: 2025-02-23
comment: Social, psychological, behavioral, and medical interventions designed to support and affirm individuals belonging to the intersex community. Intersex-affirming care includes but is not limited to equal access to health care facilities, access to medical records and information about one's intersex status and traits, and informed consent regarding medical procedures or treatments related to intersex traits.
alternative label: Intersex affirming care
broader: https://homosaurus.org/v3/homoit0003657
change note: Version 3.7.0
has top concept: Health care for LGBTQ+ people
in scheme: v3

Transgender-affirming care
type: Concept
issued: 2024-10-22
modified: 2025-02-23
comment: Social, psychological, behavioral, and medical interventions designed to support and affirm a transgender individual's gender identity. Transgender-affirming care includes but is not limited to equal access to health care facilities, counseling, puberty blockers, hormone therapy, and gender-affirming surgeries. It can also include resources to aid in social transition, such as affirming policies regarding name and pronoun changes, access to non-gendered restrooms and facilities, etc.
alternative label: Trans-affirming care
alternative label: Transgender affirming care
alternative label: Trans affirming care
broader: https://homosaurus.org/v3/homoit0003657
change note: Version 3.7.0
has top concept: Health care for LGBTQ+ people
in scheme: v3

LGBTQ+ superheroes
type: Concept
issued: 2024-10-22
modified: 2025-02-23
comment: Benevolent fictional characters who possess superhuman powers or abilities beyond those of ordinary people which they use to fight evil and help the public. Use to refer to superheroes who are explicitly identified as LGBTQ+ within their source material.
alternative label: Superheroes (LGBTQ)
alternative label: LGBTQ+ super heroes
alternative label: LGBTQ+ comic book heroes
alternative label: Super heroes (LGBTQ)
broader: https://homosaurus.org/v3/homoit0000249
change note: Version 3.7.0
has top concept: LGBTQ+ characters
in scheme: v3
related: https://homosaurus.org/v3/homoit0000841

LGBTQ+ supervillains
type: Concept
issued: 2024-10-22
modified: 2025-02-23
comment: Villainous fictional characters who possess superhuman powers or abilities beyond those of ordinary people which they use to do evil and harm the public. Use to refer to supervillains who are explicitly identified as LGBTQ+ within their source material.
alternative label: Supervillains (LGBTQ)
alternative label: LGBTQ+ super villains
alternative label: Super villains (LGBTQ)
alternative label: LGBTQ+ comic book villains
broader: https://homosaurus.org/v3/homoit0000249
change note: Version 3.7.0
has top concept: LGBTQ+ characters
in scheme: v3
related: https://homosaurus.org/v3/homoit0000841

LGBTQ+ video games
type: Concept
issued: 2024-10-22
modified: 2025-02-23
comment: Games played by electronically manipulating images produced by a computer program on a display screen. Use in reference to video games intended for LGBTQ+ audiences and/or focusing on LGBTQ+ characters or themes.
alternative label: Video games (LGBTQ)
alternative label: LGBTQ+ computer games
alternative label: Computer games (LGBTQ)
broader: https://homosaurus.org/v3/homoit0000816
change note: Version 3.7.0
has top concept: Subcultures
in scheme: v3
related: https://homosaurus.org/v3/homoit0002209

LGBTQ+ poets
type: Concept
issued: 2024-10-22
modified: 2025-02-23
comment: Creators of written or spoken verse who identify as LGBTQ+.
alternative label: Poets (LGBTQ)
broader: https://homosaurus.org/v3/homoit0001723
change note: Version 3.7.0
has top concept: LGBTQ+ people
in scheme: v3
narrower: https://homosaurus.org/v3/homoit0003664
narrower: https://homosaurus.org/v3/homoit0003665
narrower: https://homosaurus.org/v3/homoit0003666
narrower: https://homosaurus.org/v3/homoit0003667
narrower: https://homosaurus.org/v3/homoit0003668
narrower: https://homosaurus.org/v3/homoit0003669
narrower: https://homosaurus.org/v3/homoit0003670
narrower: https://homosaurus.org/v3/homoit0003672
narrower: https://homosaurus.org/v3/homoit0003673
narrower: https://homosaurus.org/v3/homoit0003674
narrower: https://homosaurus.org/v3/homoit0003675
narrower: https://homosaurus.org/v3/homoit0003676
related: https://homosaurus.org/v3/homoit0003671

Lesbian poets
type: Concept
issued: 2024-10-22
modified: 2025-02-23
comment: Creators of written or spoken verse who identify as lesbian.
broader: https://homosaurus.org/v3/homoit0003663
change note: Version 3.7.0
has top concept: LGBTQ+ people
in scheme: v3

Gay poets
type: Concept
issued: 2024-10-22
modified: 2025-02-23
comment: Creators of written or spoken verse who identify as gay.
broader: https://homosaurus.org/v3/homoit0003663
change note: Version 3.7.0
has top concept: LGBTQ+ people
in scheme: v3

Bisexual poets
type: Concept
issued: 2024-10-22
modified: 2025-02-23
comment: Creators of written or spoken verse who identify as bisexual.
broader: https://homosaurus.org/v3/homoit0003663
change note: Version 3.7.0
has top concept: LGBTQ+ people
in scheme: v3

Transgender poets
type: Concept
issued: 2024-10-22
modified: 2025-02-23
comment: Creators of written or spoken verse who identify as transgender.
alternative label: Trans poets
broader: https://homosaurus.org/v3/homoit0003663
change note: Version 3.7.0
has top concept: LGBTQ+ people
in scheme: v3

Queer poets
type: Concept
issued: 2024-10-22
modified: 2025-02-23
comment: Creators of written or spoken verse who identify as queer.
broader: https://homosaurus.org/v3/homoit0003663
change note: Version 3.7.0
has top concept: LGBTQ+ people
in scheme: v3

Non-binary poets
type: Concept
issued: 2024-10-22
modified: 2025-02-23
comment: Creators of written or spoken verse who identify as non-binary.
alternative label: Nonbinary poets
broader: https://homosaurus.org/v3/homoit0003663
change note: Version 3.7.0
has top concept: LGBTQ+ people
in scheme: v3

Intersex poets
type: Concept
issued: 2024-10-22
modified: 2025-02-23
comment: Creators of written or spoken verse who identify as intersex.
broader: https://homosaurus.org/v3/homoit0003663
change note: Version 3.7.0
has top concept: LGBTQ+ people
in scheme: v3

Two-Spirit poets
type: Concept
issued: 2024-10-22
modified: 2025-02-23
comment: Creators of written or spoken verse who identify as Two-Spirit.
alternative label: Two-Spirited poets
alternative label: Two Spirit poets
alternative label: Two Spirited poets
alternative label: 2S poets
broader: https://homosaurus.org/v3/homoit0001750
change note: Version 3.7.0
has top concept: Gender
in scheme: v3
related: https://homosaurus.org/v3/homoit0003663

Asexual poets
type: Concept
issued: 2024-10-22
modified: 2025-02-23
comment: Creators of written or spoken verse who identify as asexual.
broader: https://homosaurus.org/v3/homoit0003663
change note: Version 3.7.0
has top concept: LGBTQ+ people
in scheme: v3

Aromantic poets
type: Concept
issued: 2024-10-22
modified: 2025-02-23
comment: Creators of written or spoken verse who identify as aromantic.
broader: https://homosaurus.org/v3/homoit0003663
change note: Version 3.7.0
has top concept: LGBTQ+ people
in scheme: v3

Demisexual poets
type: Concept
issued: 2024-10-22
modified: 2025-02-23
comment: Creators of written or spoken verse who identify as demisexual.
broader: https://homosaurus.org/v3/homoit0003663
change note: Version 3.7.0
has top concept: LGBTQ+ people
in scheme: v3

Greyromantic poets
type: Concept
issued: 2024-10-22
modified: 2025-02-23
comment: Creators of written or spoken verse who identify as greyromantic.
broader: https://homosaurus.org/v3/homoit0003663
change note: Version 3.7.0
has top concept: LGBTQ+ people
in scheme: v3

Megasexual poets
type: Concept
issued: 2024-10-22
modified: 2025-02-23
comment: Creators of written or spoken verse who identify as megasexual.
broader: https://homosaurus.org/v3/homoit0003663
change note: Version 3.7.0
has top concept: LGBTQ+ people
in scheme: v3

LGBTQ+ television personalities
type: Concept
issued: 2024-10-22
modified: 2025-02-23
comment: LGBTQ+ people who are well-known to the public through their appearances on television shows, typically as themselves rather than in scripted roles.
alternative label: Television personalities (LGBTQ)
alternative label: LGBTQ+ TV personalities
alternative label: TV personalities (LGBTQ)
broader: https://homosaurus.org/v3/homoit0000915
change note: Version 3.7.0
has top concept: LGBTQ+ people
in scheme: v3
narrower: https://homosaurus.org/v3/homoit0003678
narrower: https://homosaurus.org/v3/homoit0003679
narrower: https://homosaurus.org/v3/homoit0003680
narrower: https://homosaurus.org/v3/homoit0003681
narrower: https://homosaurus.org/v3/homoit0003682
narrower: https://homosaurus.org/v3/homoit0003683
narrower: https://homosaurus.org/v3/homoit0003684
narrower: https://homosaurus.org/v3/homoit0003685
narrower: https://homosaurus.org/v3/homoit0003687
narrower: https://homosaurus.org/v3/homoit0003688
narrower: https://homosaurus.org/v3/homoit0003689
narrower: https://homosaurus.org/v3/homoit0003690
related: https://homosaurus.org/v3/homoit0003686

Lesbian television personalities
type: Concept
issued: 2024-10-22
modified: 2025-02-23
comment: Lesbians who are well-known to the public through their appearances on television shows, typically as themselves rather than in scripted roles.
alternative label: Lesbian TV personalities
broader: https://homosaurus.org/v3/homoit0003677
change note: Version 3.7.0
has top concept: LGBTQ+ people
in scheme: v3

Gay television personalities
type: Concept
issued: 2024-10-22
modified: 2025-02-23
comment: Gay men who are well-known to the public through their appearances on television shows, typically as themselves rather than in scripted roles.
alternative label: Gay TV personalities
broader: https://homosaurus.org/v3/homoit0003677
change note: Version 3.7.0
has top concept: LGBTQ+ people
in scheme: v3

Bisexual television personalities
type: Concept
issued: 2024-10-22
modified: 2025-02-23
comment: Bisexual people who are well-known to the public through their appearances on television shows, typically as themselves rather than in scripted roles.
alternative label: Bisexual TV personalities
broader: https://homosaurus.org/v3/homoit0003677
change note: Version 3.7.0
has top concept: LGBTQ+ people
in scheme: v3

Transgender television personalities
type: Concept
issued: 2024-10-22
modified: 2025-02-23
comment: Transgender people who are well-known to the public through their appearances on television shows, typically as themselves rather than in scripted roles.
alternative label: Trans television personalities
alternative label: Transgender TV personalities
alternative label: Trans TV personalities
broader: https://homosaurus.org/v3/homoit0003677
change note: Version 3.7.0
has top concept: LGBTQ+ people
in scheme: v3

Queer television personalities
type: Concept
issued: 2024-10-22
modified: 2025-02-23
comment: Queer people who are well-known to the public through their appearances on television shows, typically as themselves rather than in scripted roles.
alternative label: Queer TV personalities
broader: https://homosaurus.org/v3/homoit0003677
change note: Version 3.7.0
has top concept: LGBTQ+ people
in scheme: v3

Intersex television personalities
type: Concept
issued: 2024-10-22
modified: 2025-02-23
comment: Intersex people who are well-known to the public through their appearances on television shows, typically as themselves rather than in scripted roles.
alternative label: Intersex TV personalities
broader: https://homosaurus.org/v3/homoit0003677
change note: Version 3.7.0
has top concept: LGBTQ+ people
in scheme: v3

Asexual television personalities
type: Concept
issued: 2024-10-22
modified: 2025-02-23
comment: Asexual people who are well-known to the public through their appearances on television shows, typically as themselves rather than in scripted roles.
alternative label: Asexual TV personalities
broader: https://homosaurus.org/v3/homoit0003677
change note: Version 3.7.0
has top concept: LGBTQ+ people
in scheme: v3

Aromantic television personalities
type: Concept
issued: 2024-10-22
modified: 2025-02-23
comment: Aromantic people who are well-known to the public through their appearances on television shows, typically as themselves rather than in scripted roles.
alternative label: Aromantic TV personalities
broader: https://homosaurus.org/v3/homoit0003677
change note: Version 3.7.0
has top concept: LGBTQ+ people
in scheme: v3

Two-Spirit television personalities
type: Concept
issued: 2024-10-22
modified: 2025-02-23
comment: Two-Spirit people who are well-known to the public through their appearances on television shows, typically as themselves rather than in scripted roles.
alternative label: Two-Spirited television personalities
alternative label: Two Spirit television personalities
alternative label: Two Spirited television personalities
alternative label: 2S television personalities
alternative label: Two-Spirited TV personalities
alternative label: Two Spirit TV personalities
alternative label: Two Spirited TV personalities
alternative label: 2S TV personalities
broader: https://homosaurus.org/v3/homoit0001480
change note: Version 3.7.0
has top concept: Gender
in scheme: v3
related: https://homosaurus.org/v3/homoit0003677

Non-binary television personalities
type: Concept
issued: 2024-10-22
modified: 2025-02-23
comment: Non-binary people who are well-known to the public through their appearances on television shows, typically as themselves rather than in scripted roles.
alternative label: Nonbinary television personalities
alternative label: Non-binary TV personalities
alternative label: Nonbinary TV personalities
broader: https://homosaurus.org/v3/homoit0003677
change note: Version 3.7.0
has top concept: LGBTQ+ people
in scheme: v3

Demisexual television personalities
type: Concept
issued: 2024-10-22
modified: 2025-02-23
comment: Demisexual people who are well-known to the public through their appearances on television shows, typically as themselves rather than in scripted roles.
alternative label: Demisexual TV personalities
broader: https://homosaurus.org/v3/homoit0003677
change note: Version 3.7.0
has top concept: LGBTQ+ people
in scheme: v3

Greyromantic television personalities
type: Concept
issued: 2024-10-22
modified: 2025-02-23
comment: Greyromantic people who are well-known to the public through their appearances on television shows, typically as themselves rather than in scripted roles.
alternative label: Greyromantic TV personalities
broader: https://homosaurus.org/v3/homoit0003677
change note: Version 3.7.0
has top concept: LGBTQ+ people
in scheme: v3

Megasexual television personalities
type: Concept
issued: 2024-10-22
modified: 2025-02-23
comment: Megasexual people who are well-known to the public through their appearances on television shows, typically as themselves rather than in scripted roles.
alternative label: Megasexual TV personalities
broader: https://homosaurus.org/v3/homoit0003677
change note: Version 3.7.0
has top concept: LGBTQ+ people
in scheme: v3

LGBTQ+ safe spaces
type: Concept
issued: 2024-10-22
modified: 2025-02-23
comment: Public spaces designated as safe for, or accepting and affirming of, LGBTQ+ people, often by allies. LGBTQ+ safe spaces are sometimes identified through the display of stickers or placards.
alternative label: Safe spaces (LGBTQ)
alternative label: Safe places (LGBTQ)
alternative label: LGBTQ+ safe places
alternative label: LGBTQ+ safe zones
alternative label: Safe zones (LGBTQ)
broader: https://homosaurus.org/v3/homoit0003699
change note: Version 3.7.0
has top concept: LGBTQ+ meeting places
in scheme: v3
related: https://homosaurus.org/v3/homoit0000038
related: https://homosaurus.org/v3/homoit0000538
related: https://homosaurus.org/v3/homoit0000873

LGBTQ+ philanthropists
type: Concept
issued: 2024-10-23
modified: 2025-02-23
comment: LGBTQ+ people who seek to improve the welfare of others, especially by the donation of money or resources to charitable causes.
alternative label: Philanthropists (LGBTQ)
broader: https://homosaurus.org/v3/homoit0000915
change note: Version 3.7.0
has top concept: LGBTQ+ people
in scheme: v3
related: https://homosaurus.org/v3/homoit0003695

LGBTQ+ punks
type: Concept
issued: 2024-10-23
modified: 2025-02-23
comment: LGBTQ+ people involved in the punk community, which originated in the 1970s with punk rock music and is now associated with various music subgenres, fashions, and ideologies.
alternative label: Punks (LGBTQ)
broader: https://homosaurus.org/v3/homoit0000915
change note: Version 3.7.0
has top concept: LGBTQ+ people
in scheme: v3
related: https://homosaurus.org/v3/homoit0003698

LGBTQ+ punk community
type: Concept
issued: 2024-10-23
modified: 2025-02-23
comment: A subset of the punk community to which LGBTQ+ punks and allies belong. The punk community originated in the 1970s with punk rock music and is now associated with various music subgrenes, fashions, and ideologies.
alternative label: Punk community (LGBTQ)
alternative label: Punk scene (LGBTQ)
alternative label: Punk culture (LGBTQ)
alternative label: LGBTQ+ punk scene
alternative label: LGBTQ+ punk culture
broader: https://homosaurus.org/v3/homoit0000297
change note: Version 3.7.0
has top concept: LGBTQ+ communities
in scheme: v3
related: https://homosaurus.org/v3/homoit0001831
related: https://homosaurus.org/v3/homoit0003697

LGBTQ+ spaces
type: Concept
issued: 2024-10-23
modified: 2025-02-23
comment: Spaces maintained and intended for use by LGBTQ+ people. Includes physical spaces as well as online spaces.
alternative label: Spaces (LGBTQ)
broader: https://homosaurus.org/v3/homoit0000900
change note: Version 3.7.0
has top concept: LGBTQ+ meeting places
in scheme: v3
narrower: https://homosaurus.org/v3/homoit0003693
related: https://homosaurus.org/v3/homoit0000297

LGBTQ+ film criticism
type: Concept
issued: 2024-10-23
modified: 2025-02-23
comment: The analysis and evaluation of LGBTQ+ films and film history, or film criticism from an LGBTQ+ perspective.
alternative label: Film criticism (LGBTQ)
alternative label: LGBTQ+ film critique
alternative label: Film critique (LGBTQ)
alternative label: LGBTQ+ film analysis
alternative label: Film analysis (LGBTQ)
broader: https://homosaurus.org/v3/homoit0002327
change note: Version 3.7.0
has top concept: Subcultures
in scheme: v3
narrower: https://homosaurus.org/v3/homoit0003701
narrower: https://homosaurus.org/v3/homoit0003702
narrower: https://homosaurus.org/v3/homoit0003703
narrower: https://homosaurus.org/v3/homoit0003704
narrower: https://homosaurus.org/v3/homoit0003705
related: https://homosaurus.org/v3/homoit0001602
related: https://homosaurus.org/v3/homoit0003706

Lesbian film criticism
type: Concept
issued: 2024-10-23
modified: 2025-02-23
comment: The analysis and evaluation of lesbian films and film history, or film criticism from a lesbian perspective.
alternative label: Lesbian film critique
alternative label: Lesbian film analysis
broader: https://homosaurus.org/v3/homoit0003700
change note: Version 3.7.0
has top concept: Subcultures
in scheme: v3

Gay film criticism
type: Concept
issued: 2024-10-23
modified: 2025-02-23
comment: The analysis and evaluation of gay films and film history, or film criticism from a gay perspective.
alternative label: Gay film critique
alternative label: Gay film analysis
broader: https://homosaurus.org/v3/homoit0003700
change note: Version 3.7.0
has top concept: Subcultures
in scheme: v3

Bisexual film criticism
type: Concept
issued: 2024-10-23
modified: 2025-02-23
comment: The analysis and evaluation of bisexual films and film history, or film criticism from a bisexual perspective.
alternative label: Bisexual film critique
alternative label: Bisexual film analysis
broader: https://homosaurus.org/v3/homoit0003700
change note: Version 3.7.0
has top concept: Subcultures
in scheme: v3

Transgender film criticism
type: Concept
issued: 2024-10-23
modified: 2025-02-23
comment: The analysis and evaluation of trans films and film history, or film criticism from a trans perspective.
alternative label: Transgender film critique
alternative label: Transgender film analysis
alternative label: Trans film criticism
alternative label: Trans film critique
alternative label: Trans film analysis
broader: https://homosaurus.org/v3/homoit0003700
change note: Version 3.7.0
has top concept: Subcultures
in scheme: v3

Queer film criticism
type: Concept
issued: 2024-10-23
modified: 2025-02-23
comment: The analysis and evaluation of queer films and film history, or film criticism from a queer perspective.
alternative label: Queer film critique
alternative label: Queer film analysis
broader: https://homosaurus.org/v3/homoit0003700
change note: Version 3.7.0
has top concept: Subcultures
in scheme: v3

Feminist film criticism
type: Concept
issued: 2024-10-23
modified: 2025-02-23
comment: The analysis and evaluation of feminist films and film history, or film criticism from a feminist perspective.
alternative label: Feminist film critique
alternative label: Feminist film analysis
broader: https://homosaurus.org/v3/homoit0000579
broader: https://homosaurus.org/v3/homoit0002039
change note: Version 3.7.0
has top concept: Gender studies
in scheme: v3
related: https://homosaurus.org/v3/homoit0003700
related: https://homosaurus.org/v3/homoit0001602

Decolonial queer theory
type: Concept
issued: 2024-10-23
modified: 2025-02-23
comment: The intersection of decolonial and queer theory, which critiques Eurocentric conceptions of gender and sexuality as a tool of colonization.
alternative label: Queer decoloniality
alternative label: Postcolonial queer theory
alternative label: Queer decolonial theory
alternative label: Queer postcolonial theory
broader: https://homosaurus.org/v3/homoit0001219
change note: Version 3.7.0
has top concept: Theories
in scheme: v3

Sensation play
type: Concept
issued: 2024-10-23
modified: 2025-02-23
comment: The act of engaging one's or one's partner(s) senses in various ways to heighten erotic pleasure.
alternative label: Sensual play
alternative label: Sensory play
broader: https://homosaurus.org/v3/homoit0000442
broader: https://homosaurus.org/v3/homoit0001299
change note: Version 3.7.0
has top concept: Eroticism
in scheme: v3

Lesbian film festivals
type: Concept
issued: 2024-10-23
modified: 2025-02-23
comment: Organized presentations of films in a single location, often with prizes awarded in various categories. Use in reference to film festivals focusing on films created by lesbians or featuring lesbian characters and themes.
broader: https://homosaurus.org/v3/homoit0000868
change note: Version 3.7.0
has top concept: LGBTQ+ film festivals
in scheme: v3

Gay film festivals
type: Concept
issued: 2024-10-23
modified: 2025-02-23
comment: Organized presentations of films in a single location, often with prizes awarded in various categories. Use in reference to film festivals focusing on films created by gay men or featuring gay characters and themes.
broader: https://homosaurus.org/v3/homoit0000868
change note: Version 3.7.0
has top concept: LGBTQ+ film festivals
in scheme: v3

Bisexual film festivals
type: Concept
issued: 2024-10-23
modified: 2025-02-23
comment: Organized presentations of films in a single location, often with prizes awarded in various categories. Use in reference to film festivals focusing on films created by bisexual people or featuring bisexual characters and themes.
broader: https://homosaurus.org/v3/homoit0000868
change note: Version 3.7.0
has top concept: LGBTQ+ film festivals
in scheme: v3

Transgender film festivals
type: Concept
issued: 2024-10-23
modified: 2025-02-23
comment: Organized presentations of films in a single location, often with prizes awarded in various categories. Use in reference to film festivals focusing on films created by trans people or featuring trans characters and themes.
alternative label: Trans film festivals
broader: https://homosaurus.org/v3/homoit0000868
change note: Version 3.7.0
has top concept: LGBTQ+ film festivals
in scheme: v3

Queer film festivals
type: Concept
issued: 2024-10-23
modified: 2025-02-23
comment: Organized presentations of films in a single location, often with prizes awarded in various categories. Use in reference to film festivals focusing on films created by queer people or featuring queer characters and themes.
broader: https://homosaurus.org/v3/homoit0000868
change note: Version 3.7.0
has top concept: LGBTQ+ film festivals
in scheme: v3

Non-binary film festivals
type: Concept
issued: 2024-10-23
modified: 2025-02-23
comment: Organized presentations of films in a single location, often with prizes awarded in various categories. Use in reference to film festivals focusing on films created by non-binary people or featuring non-binary characters and themes.
alternative label: Nonbinary film festivals
broader: https://homosaurus.org/v3/homoit0000868
change note: Version 3.7.0
has top concept: LGBTQ+ film festivals
in scheme: v3

Intersex film festivals
type: Concept
issued: 2024-10-23
modified: 2025-02-23
comment: Organized presentations of films in a single location, often with prizes awarded in various categories. Use in reference to film festivals focusing on films created by intersex people or featuring intersex characters and themes.
broader: https://homosaurus.org/v3/homoit0000868
change note: Version 3.7.0
has top concept: LGBTQ+ film festivals
in scheme: v3

Two-Spirit film festivals
type: Concept
issued: 2024-10-23
modified: 2025-02-23
comment: Organized presentations of films in a single location, often with prizes awarded in various categories. Use in reference to film festivals focusing on films created by Two-Spirit people or featuring Two-Spirit characters and themes.
alternative label: Two Spirit film festivals
alternative label: Two-Spirited film festivals
alternative label: Two Spirited film festivals
alternative label: 2S film festivals
broader: https://homosaurus.org/v3/homoit0000868
change note: Version 3.7.0
has top concept: LGBTQ+ film festivals
in scheme: v3

Bear bars
type: Concept
issued: 2024-10-23
modified: 2025-02-23
comment: Drinking establishments that primarily cater to gay men who identify as bears, or hairy and large or muscular.
broader: https://homosaurus.org/v3/homoit0000474
change note: Version 3.7.0
has top concept: LGBTQ+ meeting places
in scheme: v3
related: https://homosaurus.org/v3/homoit0000105

Dyke bars
type: Concept
issued: 2024-10-23
modified: 2025-02-23
comment: Drinking establishments that primarily cater to dykes. For establishments that cater to lesbians more broadly, use "Lesbian bars."
broader: https://homosaurus.org/v3/homoit0000724
change note: Version 3.7.0
has top concept: LGBTQ+ meeting places
in scheme: v3
related: https://homosaurus.org/v3/homoit0000384

LGBTQ+ documentaries
type: Concept
issued: 2024-10-23
modified: 2025-02-23
comment: Non-fictional films that center LGBTQ+ people or topics, created for the purposes of education, advocacy, or personal expression.
alternative label: Documentaries (LGBTQ)
alternative label: LGBTQ+ documentary films
alternative label: Documentary films (LGBTQ)
broader: https://homosaurus.org/v3/homoit0000869
change note: Version 3.7.0
has top concept: Subcultures
in scheme: v3
narrower: https://homosaurus.org/v3/homoit0003721
narrower: https://homosaurus.org/v3/homoit0003722
narrower: https://homosaurus.org/v3/homoit0003723
narrower: https://homosaurus.org/v3/homoit0003724
narrower: https://homosaurus.org/v3/homoit0003725
narrower: https://homosaurus.org/v3/homoit0003726
narrower: https://homosaurus.org/v3/homoit0003727
narrower: https://homosaurus.org/v3/homoit0003728
narrower: https://homosaurus.org/v3/homoit0003729
narrower: https://homosaurus.org/v3/homoit0003730
narrower: https://homosaurus.org/v3/homoit0003731
narrower: https://homosaurus.org/v3/homoit0003732

Lesbian documentaries
type: Concept
issued: 2024-10-23
modified: 2025-02-23
comment: Non-fictional films that center lesbians or lesbian topics, created for the purposes of education, advocacy, or personal expression.
alternative label: Lesbian documentary films
broader: https://homosaurus.org/v3/homoit0003720
change note: Version 3.7.0
has top concept: Subcultures
in scheme: v3

Gay documentaries
type: Concept
issued: 2024-10-23
modified: 2025-02-23
comment: Non-fictional films that center LGBTQ+ gay men or topics, created for the purposes of education, advocacy, or personal expression.
alternative label: Gay documentary films
broader: https://homosaurus.org/v3/homoit0003720
change note: Version 3.7.0
has top concept: Subcultures
in scheme: v3

Bisexual documentaries
type: Concept
issued: 2024-10-23
modified: 2025-02-23
comment: Non-fictional films that center bisexual people or topics, created for the purposes of education, advocacy, or personal expression.
alternative label: Bisexual documentary films
broader: https://homosaurus.org/v3/homoit0003720
change note: Version 3.7.0
has top concept: Subcultures
in scheme: v3

Transgender documentaries
type: Concept
issued: 2024-10-23
modified: 2025-02-23
comment: Non-fictional films that center trans people or topics, created for the purposes of education, advocacy, or personal expression.
alternative label: Transgender documentary films
alternative label: Trans documentaries
alternative label: Trans documentary films
broader: https://homosaurus.org/v3/homoit0003720
change note: Version 3.7.0
has top concept: Subcultures
in scheme: v3

Queer documentaries
type: Concept
issued: 2024-10-23
modified: 2025-02-23
comment: Non-fictional films that center queer people or topics, created for the purposes of education, advocacy, or personal expression.
alternative label: Queer documentary films
broader: https://homosaurus.org/v3/homoit0003720
change note: Version 3.7.0
has top concept: Subcultures
in scheme: v3

Non-binary documentaries
type: Concept
issued: 2024-10-23
modified: 2025-02-23
comment: Non-fictional films that center non-binary people or topics, created for the purposes of education, advocacy, or personal expression.
alternative label: Non-binary documentary films
alternative label: Nonbinary documentaries
alternative label: Nonbinary documentary films
broader: https://homosaurus.org/v3/homoit0003720
change note: Version 3.7.0
has top concept: Subcultures
in scheme: v3

Intersex documentaries
type: Concept
issued: 2024-10-23
modified: 2025-02-23
comment: Non-fictional films that center intersex people or topics, created for the purposes of education, advocacy, or personal expression.
alternative label: Intersex documentary films
broader: https://homosaurus.org/v3/homoit0003720
change note: Version 3.7.0
has top concept: Subcultures
in scheme: v3

Two-Spirit documentaries
type: Concept
issued: 2024-10-23
modified: 2025-02-23
comment: Non-fictional films that center Two-Spirit people or topics, created for the purposes of education, advocacy, or personal expression.
alternative label: Two Spirit documentaries
alternative label: Two-Spirited documentaries
alternative label: Two Spirited documentaries
alternative label: 2S documentaries
alternative label: Two-Spirit documentary films
broader: https://homosaurus.org/v3/homoit0003720
change note: Version 3.7.0
has top concept: Subcultures
in scheme: v3

Asexual documentaries
type: Concept
issued: 2024-10-23
modified: 2025-02-23
comment: Non-fictional films that center asexual people or topics, created for the purposes of education, advocacy, or personal expression.
alternative label: Asexual documentary films
broader: https://homosaurus.org/v3/homoit0003720
change note: Version 3.7.0
has top concept: Subcultures
in scheme: v3

Aromantic documentaries
type: Concept
issued: 2024-10-23
modified: 2025-02-23
comment: Non-fictional films that center aromantic people or topics, created for the purposes of education, advocacy, or personal expression.
alternative label: Aromantic documentary films
broader: https://homosaurus.org/v3/homoit0003720
change note: Version 3.7.0
has top concept: Subcultures
in scheme: v3

Demisexual documentaries
type: Concept
issued: 2024-10-23
modified: 2025-02-23
comment: Non-fictional films that center demisexual people or topics, created for the purposes of education, advocacy, or personal expression.
alternative label: Demisexual documentary films
broader: https://homosaurus.org/v3/homoit0003720
change note: Version 3.7.0
has top concept: Subcultures
in scheme: v3

Greyromantic documentaries
type: Concept
issued: 2024-10-23
modified: 2025-02-23
comment: Non-fictional films that center greyromantic people or topics, created for the purposes of education, advocacy, or personal expression.
alternative label: Greyromantic documentary films
broader: https://homosaurus.org/v3/homoit0003720
change note: Version 3.7.0
has top concept: Subcultures
in scheme: v3

LGBTQ+ street fairs
type: Concept
issued: 2024-10-23
modified: 2025-02-23
comment: Festivals held on public streets that celebrate the character of the surrounding neighborhood or community. Use to refer to street fairs specifically celebrating the local LGBTQ+ community.
alternative label: Street fairs (LGBTQ)
alternative label: LGBTQ+ street festivals
alternative label: Street festivals (LGBTQ)
alternative label: LGBTQ+ block parties
alternative label: Block parties (LGBTQ)
broader: https://homosaurus.org/v3/homoit0000861
change note: Version 3.7.0
has top concept: LGBTQ+ events
in scheme: v3

LGBTQ+ conferences
type: Concept
issued: 2024-10-23
modified: 2025-02-23
comment: Large formal meetings or assemblies of LGBTQ+ people.
alternative label: Conferences (LGBTQ)
alternative label: LGBTQ+ conventions
alternative label: Conventions (LGBTQ)
broader: https://homosaurus.org/v3/homoit0000861
change note: Version 3.7.0
has top concept: LGBTQ+ events
in scheme: v3

Clit twisting
type: Concept
issued: 2024-10-23
modified: 2025-02-23
comment: Twisting or squeezing the clitoris to induce sexual pleasure.
alternative label: Clitoris twisting
broader: https://homosaurus.org/v3/homoit0000280
change note: Version 3.7.0
has top concept: Sex (Act)
in scheme: v3
related: https://homosaurus.org/v3/homoit0000282

Anti-gender movement
type: Concept
issued: 2024-10-23
modified: 2025-02-23
comment: A movement that opposes what is referred to as "gender ideology," or the belief that gender is a social construct that exists on a spectrum. Members of the anti-gender movement oppose the visibility, acceptance, and civil and reproductive rights of trans, non-binary, intersex, Two-Spirit, gender diverse, and gender non-conforming people.
alternative label: Gender critical movement
broader: https://homosaurus.org/v3/homoit0001322
change note: Version 3.7.0
has top concept: Social movements
in scheme: v3
related: https://homosaurus.org/v3/homoit0003158
related: https://homosaurus.org/v3/homoit0001819
related: https://homosaurus.org/v3/homoit0001467
related: https://homosaurus.org/v3/homoit0000062
related: https://homosaurus.org/v3/homoit0001893
related: https://homosaurus.org/v3/homoit0001885

Uranic people
type: Concept
issued: 2024-10-23
modified: 2025-02-23
comment: People who are attracted to all genders except women, femmes, and feminine-aligned non-binary people, regardless of what gender they were assigned at birth.
alternative label: Androsexual people
broader: https://homosaurus.org/v3/homoit0000915
change note: Version 3.7.0
has top concept: LGBTQ+ people
in scheme: v3

Neptunic people
type: Concept
issued: 2024-10-23
modified: 2025-02-23
comment: People who are attracted to all genders except men, mascs, and masculine-aligned non-binary people, regardless of what gender they were assigned at birth.
alternative label: Gynesexual people
alternative label: Gynosexual people
broader: https://homosaurus.org/v3/homoit0000915
change note: Version 3.7.0
has top concept: LGBTQ+ people
in scheme: v3

Saturnic people
type: Concept
issued: 2024-10-23
modified: 2025-02-23
comment: People who are solely attracted to androgynous non-binary people, rather than monogender-aligned people, regardless of what gender they were assigned at birth.
alternative label: Skoliosexual people
broader: https://homosaurus.org/v3/homoit0000915
change note: Version 3.7.0
has top concept: LGBTQ+ people
in scheme: v3

Sex trafficking
type: Concept
issued: 2024-10-30
modified: 2025-02-23
comment: Human trafficking for the purpose of sexual exploitation, including recruiting, holding, moving, defrauding, and/or coercing people into engaging in sexual services and performances they cannot or have not meaningfully consented to.
alternative label: Coerced sex work
alternative label: Forced sex work
alternative label: Non-consensual sex work
alternative label: Coerced prostitution
alternative label: Forced prostitution
alternative label: Non-consensual prostitution
broader: https://homosaurus.org/v3/homoit0003742
change note: Version 3.7.0
has top concept: Human trafficking
in scheme: v3
related: https://homosaurus.org/v3/homoit0001276

Labor trafficking
type: Concept
issued: 2024-10-30
modified: 2025-02-23
comment: Human trafficking for the purpose of labor exploitation, including recruiting, holding, moving, defrauding, and/or coercing people into labor, such as through debt bondage or involuntary servitude, against their will.
alternative label: Forced labor
alternative label: Coerced labor
broader: https://homosaurus.org/v3/homoit0003742
change note: Version 3.7.0
has top concept: Human trafficking
in scheme: v3
preferred label: Labour trafficking

LGBTQ+ victims of human trafficking
type: Concept
issued: 2024-10-30
modified: 2025-02-23
comment: LGBTQ+ people who have experienced and may or may not have survived human trafficking. Follow the individual's preference for "victims" or "survivors" whenever possible.
alternative label: Victims of human trafficking (LGBTQ)
alternative label: LGBTQ+ trafficking victims
alternative label: Trafficking victims (LGBTQ)
broader: https://homosaurus.org/v3/homoit0000312
change note: Version 3.7.0
has top concept: LGBTQ+ people
in scheme: v3
narrower: https://homosaurus.org/v3/homoit0003746
narrower: https://homosaurus.org/v3/homoit0003750
narrower: https://homosaurus.org/v3/homoit0003754
related: https://homosaurus.org/v3/homoit0003747

LGBTQ+ survivors of human trafficking
type: Concept
issued: 2024-10-30
modified: 2025-02-23
comment: LGBTQ+ people who have experienced and survived human trafficking. Follow the individual's preference for "victims" or "survivors" whenever possible.
alternative label: Survivors of human trafficking (LGBTQ)
alternative label: LGBTQ+ trafficking survivors
alternative label: Trafficking survivors (LGBTQ)
broader: https://homosaurus.org/v3/homoit0003745
change note: Version 3.7.0
has top concept: LGBTQ+ people
in scheme: v3
related: https://homosaurus.org/v3/homoit0003749

Two-Spirit victims of human trafficking
type: Concept
issued: 2024-10-30
modified: 2025-02-23
comment: Two-Spirit people who have experienced and may or may not have survived human trafficking. Follow the individual's preference for "victims" or "survivors" whenever possible.
alternative label: Two Spirit victims of human trafficking
alternative label: Two-Spirited victims of human trafficking
alternative label: Two Spirited victims of human trafficking
alternative label: 2S victims of human trafficking
alternative label: Two-Spirit human trafficking victims
broader: https://homosaurus.org/v3/homoit0003748
change note: Version 3.7.0
has top concept: Gender
in scheme: v3
narrower: https://homosaurus.org/v3/homoit0003749
narrower: https://homosaurus.org/v3/homoit0003752
narrower: https://homosaurus.org/v3/homoit0003756
related: https://homosaurus.org/v3/homoit0003745

Two-Spirit victims of crime
type: Concept
issued: 2024-10-30
modified: 2025-02-23
comment: Two-Spirit people who have experienced crimes and may or may not have survived. Use more specific terms and follow the individual's preference for "victims" or "survivors" whenever possible.
alternative label: Two Spirit victims of crime
alternative label: Two-Spirited victims of crime
alternative label: Two Spirited victims of crime
alternative label: 2S victims of crime
alternative label: Two-Spirit crime victims
broader: https://homosaurus.org/v3/homoit0001480
change note: Version 3.7.0
has top concept: Gender
in scheme: v3
narrower: https://homosaurus.org/v3/homoit0002732
narrower: https://homosaurus.org/v3/homoit0002733
narrower: https://homosaurus.org/v3/homoit0002734
narrower: https://homosaurus.org/v3/homoit0002735
narrower: https://homosaurus.org/v3/homoit0003747
related: https://homosaurus.org/v3/homoit0001997

Two-Spirit survivors of human trafficking
type: Concept
issued: 2024-10-30
modified: 2025-02-23
comment: Two-Spirit people who have experienced and survived human trafficking. Follow the individual's preference for "victims" or "survivors" whenever possible.
alternative label: Two Spirit survivors of human trafficking
alternative label: Two-Spirited survivors of human trafficking
alternative label: Two Spirited survivors of human trafficking
alternative label: 2S survivors of human trafficking
alternative label: Two-Spirit human trafficking survivors
broader: https://homosaurus.org/v3/homoit0003747
change note: Version 3.7.0
has top concept: Gender
in scheme: v3
related: https://homosaurus.org/v3/homoit0003746

LGBTQ+ victims of sex trafficking
type: Concept
issued: 2024-10-30
modified: 2025-02-23
comment: LGBTQ+ people who have experienced and may or may not have survived sex trafficking. Follow the individual's preference for "victims" or "survivors" whenever possible.
alternative label: Victims of sex trafficking (LGBTQ)
alternative label: LGBTQ+ sex trafficking victims
alternative label: Sex trafficking victims (LGBTQ)
broader: https://homosaurus.org/v3/homoit0003745
change note: Version 3.7.0
has top concept: LGBTQ+ people
in scheme: v3
narrower: https://homosaurus.org/v3/homoit0003751
related: https://homosaurus.org/v3/homoit0003752

LGBTQ+ survivors of sex trafficking
type: Concept
issued: 2024-10-30
modified: 2025-02-23
comment: LGBTQ+ people who have experienced and survived sex trafficking. Follow the individual's preference for "victims" or "survivors" whenever possible.
alternative label: Survivors of sex trafficking (LGBTQ)
alternative label: LGBTQ+ sex trafficking survivors
alternative label: Sex trafficking survivors (LGBTQ)
broader: https://homosaurus.org/v3/homoit0003750
change note: Version 3.7.0
has top concept: LGBTQ+ people
in scheme: v3
related: https://homosaurus.org/v3/homoit0003753

Two-Spirit victims of sex trafficking
type: Concept
issued: 2024-10-30
modified: 2025-02-23
comment: Two-Spirit people who have experienced and may or may not have survived sex trafficking. Follow the individual's preference for "victims" or "survivors" whenever possible.
alternative label: Two Spirit victims of sex trafficking
alternative label: Two-Spirited victims of sex trafficking
alternative label: Two Spirited victims of sex trafficking
alternative label: 2S victims of sex trafficking
alternative label: Two-Spirit sex trafficking victims
broader: https://homosaurus.org/v3/homoit0003747
change note: Version 3.7.0
has top concept: Gender
in scheme: v3
narrower: https://homosaurus.org/v3/homoit0003753
related: https://homosaurus.org/v3/homoit0003750

Two-Spirit survivors of sex trafficking
type: Concept
issued: 2024-10-30
modified: 2025-02-23
comment: Two-Spirit people who have experienced and survived sex trafficking. Follow the individual's preference for "victims" or "survivors" whenever possible.
alternative label: Two Spirit survivors of sex trafficking
alternative label: Two-Spirited survivors of sex trafficking
alternative label: Two Spirited survivors of sex trafficking
alternative label: 2S survivors of sex trafficking
alternative label: Two-Spirit sex trafficking survivors
broader: https://homosaurus.org/v3/homoit0003752
change note: Version 3.7.0
has top concept: Gender
in scheme: v3
related: https://homosaurus.org/v3/homoit0003751

LGBTQ+ victims of labor trafficking
type: Concept
issued: 2024-10-30
modified: 2025-02-23
comment: LGBTQ+ people who have experienced and may or may not have survived labor trafficking. Follow the individual's preference for "victims" or "survivors" whenever possible.
alternative label: Victims of labor trafficking (LGBTQ)
alternative label: LGBTQ+ labor trafficking victims
alternative label: Labor trafficking victims (LGBTQ)
broader: https://homosaurus.org/v3/homoit0003745
change note: Version 3.7.0
has top concept: LGBTQ+ people
in scheme: v3
narrower: https://homosaurus.org/v3/homoit0003755
preferred label: LGBTQ+ victims of labour trafficking
related: https://homosaurus.org/v3/homoit0003756

LGBTQ+ survivors of labor trafficking
type: Concept
issued: 2024-10-30
modified: 2025-02-23
comment: LGBTQ+ people who have experienced and survived labor trafficking. Follow the individual's preference for "victims" or "survivors" whenever possible.
alternative label: Survivors of labor trafficking (LGBTQ)
alternative label: LGBTQ+ labor trafficking survivors
alternative label: Labor trafficking survivors (LGBTQ)
broader: https://homosaurus.org/v3/homoit0003754
change note: Version 3.7.0
has top concept: LGBTQ+ people
in scheme: v3
preferred label: LGBTQ+ survivors of labour trafficking
related: https://homosaurus.org/v3/homoit0003757

Two-Spirit victims of labor trafficking
type: Concept
issued: 2024-10-30
modified: 2025-02-23
comment: Two-Spirit people who have experienced and may or may not have survived labor trafficking. Follow the individual's preference for "victims" or "survivors" whenever possible.
alternative label: Two Spirit victims of labor trafficking
alternative label: Two-Spirited victims of labor trafficking
alternative label: Two Spirited victims of labor trafficking
alternative label: 2S victims of labor trafficking
alternative label: Two-Spirit labor trafficking victims
broader: https://homosaurus.org/v3/homoit0003747
change note: Version 3.7.0
has top concept: Gender
in scheme: v3
narrower: https://homosaurus.org/v3/homoit0003757
preferred label: Two-Spirit victims of labour trafficking
related: https://homosaurus.org/v3/homoit0003754

Two-Spirit survivors of labor trafficking
type: Concept
issued: 2024-10-30
modified: 2025-02-23
comment: Two-Spirit people who have experienced and survived labor trafficking. Follow the individual's preference for "victims" or "survivors" whenever possible.
alternative label: Two Spirit survivors of labor trafficking
alternative label: Two-Spirited survivors of labor trafficking
alternative label: Two Spirited survivors of labor trafficking
alternative label: 2S survivors of labor trafficking
alternative label: Two-Spirit labor trafficking survivors
broader: https://homosaurus.org/v3/homoit0003756
change note: Version 3.7.0
has top concept: Gender
in scheme: v3
preferred label: Two-Spirit survivors of labour trafficking
related: https://homosaurus.org/v3/homoit0003755

Intersex sex workers
type: Concept
issued: 2024-10-30
modified: 2025-02-23
comment: Intersex people who receive money or goods in exchange for sexual services, performances, or companionship. Use to describe intersex people working across the broad spectrum of sex work.
alternative label: Intersex prostitutes
alternative label: Intersex prostitution
broader: https://homosaurus.org/v3/homoit0001277
change note: Version 3.7.0
has top concept: Sex workers
in scheme: v3

Non-binary sex workers
type: Concept
issued: 2024-10-30
modified: 2025-02-23
comment: Non-binary people who receive money or goods in exchange for sexual services, performances, or companionship. Use to describe non-binary people working across the broad spectrum of sex work.
alternative label: Nonbinary sex workers
alternative label: Non-binary prostitutes
alternative label: Nonbinary prostitutes
alternative label: Non-binary prostitution
alternative label: Nonbinary prostitution
broader: https://homosaurus.org/v3/homoit0001277
change note: Version 3.7.0
has top concept: Sex workers
in scheme: v3

Two-Spirit sex workers
type: Concept
issued: 2024-10-30
modified: 2025-02-23
comment: Two-Spirit people who receive money or goods in exchange for sexual services, performances, or companionship. Use to describe Two-Spirit people working across the broad spectrum of sex work.
alternative label: Two Spirit sex workers
alternative label: Two-Spirited sex workers
alternative label: Two Spirited sex workers
alternative label: 2S sex workers
alternative label: Two-Spirit prostitutes
alternative label: Two Spirit prostitutes
alternative label: Two-Spirited prostitutes
alternative label: Two Spirited prostitutes
alternative label: 2S prostitutes
alternative label: Two-Spirit prostitution
broader: https://homosaurus.org/v3/homoit0001480
broader: https://homosaurus.org/v3/homoit0003758
change note: Version 3.7.0
has top concept: Gender
in scheme: v3
related: https://homosaurus.org/v3/homoit0001277

Māhū sex workers
type: Concept
issued: 2024-10-30
modified: 2025-02-23
comment: Māhū who receive money or goods in exchange for sexual services, performances, or companionship. Use to describe Māhū working across the broad spectrum of sex work.
alternative label: Mahu sex workers
alternative label: Māhū prostitutes
alternative label: Mahu prostitutes
alternative label: Māhū prostitution
alternative label: Mahu prostitution
alternative label: Māhū sex work
alternative label: Mahu sex work
broader: https://homosaurus.org/v3/homoit0000979
broader: https://homosaurus.org/v3/homoit0003758
change note: Version 3.7.0
has top concept: Gender
in scheme: v3
related: https://homosaurus.org/v3/homoit0001277

Phone sex work
type: Concept
issued: 2024-10-30
modified: 2025-02-23
comment: Real-time sex work via phone calls, text messaging, or online voice calls. Use "Cam modeling" for real-time sex work via online video calls and livestreams.
alternative label: Telephone sex work
broader: https://homosaurus.org/v3/homoit0001276
change note: Version 3.7.0
has top concept: Sex industry
in scheme: v3
related: https://homosaurus.org/v3/homoit0001111

Stripping
type: Concept
issued: 2024-10-30
modified: 2025-02-23
comment: A form of sex work that involves undressing to music while using a pole to perform dance moves, whether in a venue like a strip club or by hire at private parties. Stripping may also be performed by amateurs in private settings.
alternative label: Pole dancing
alternative label: Pole-dancing
alternative label: Peeling
alternative label: Stripteasing
alternative label: Exotic dancing
broader: https://homosaurus.org/v3/homoit0001276
change note: Version 3.7.0
has top concept: Sex industry
in scheme: v3
related: https://homosaurus.org/v3/homoit0001343

Anti-sex work feminism
type: Concept
issued: 2024-10-30
modified: 2025-02-23
comment: A form of feminism that alleges that sex work is inherently coercive and exploitative. Although not all sex workers are women and not all clients are men, anti-sex work feminism largely centers this gender dynamic, viewing sex work as a result and reinforcement of the patriarchy.
alternative label: Anti sex work feminism
alternative label: Anti-sex-work feminism
broader: https://homosaurus.org/v3/homoit0000437
change note: Version 3.7.0
has top concept: Feminism
in scheme: v3
related: https://homosaurus.org/v3/homoit0003766
related: https://homosaurus.org/v3/homoit0003777

SWERFs
type: Concept
issued: 2024-10-30
modified: 2025-02-23
comment: An acronym for "sex work-exclusionary radical feminists," this term refers to people who subscribe to a subset of radical feminism that rejects sex worker rights and solidarity with sex workers under the belief that sex work is antithetical to their ideology and inherently perpetuates oppression against women.
alternative label: Sex work exclusionary radical feminists
alternative label: Sex worker exclusionary radical feminists
broader: https://homosaurus.org/v3/homoit0003177
change note: Version 3.7.0
has top concept: Feminists
in scheme: v3
related: https://homosaurus.org/v3/homoit0003765

Anti-pornography feminism
type: Concept
issued: 2024-10-30
modified: 2025-02-23
comment: A form of feminism that alleges that pornography is a result and reinforcement of the patriarchy and is thus inherently violent and exploitative.
alternative label: Anti-porn feminism
alternative label: Anti pornography feminism
alternative label: Anti porn feminism
broader: https://homosaurus.org/v3/homoit0000437
change note: Version 3.7.0
has top concept: Feminism
in scheme: v3

Cam modeling
type: Concept
issued: 2024-10-30
modified: 2025-02-23
comment: Short for "webcam modeling," this term refers to real-time sex work via online video calls and livestreams.
alternative label: Camming
alternative label: Webcam modeling
broader: https://homosaurus.org/v3/homoit0001276
change note: Version 3.7.0
has top concept: Sex industry
in scheme: v3
related: https://homosaurus.org/v3/homoit0003769

Cam models
type: Concept
issued: 2024-10-30
modified: 2025-02-23
comment: Short for "webcam models," this term refers to sex workers who exchange sexual services, performances, or companionship via online video calls and livestreams.
alternative label: Webcam models
alternative label: Cammodels
broader: https://homosaurus.org/v3/homoit0003758
change note: Version 3.7.0
has top concept: Sex workers
in scheme: v3
narrower: https://homosaurus.org/v3/homoit0003770
narrower: https://homosaurus.org/v3/homoit0003771
related: https://homosaurus.org/v3/homoit0003768

Camboys
type: Concept
issued: 2024-10-30
modified: 2025-02-23
comment: Short for "webcam boys," this term refers to men sex workers who exchange sexual services, performances, or companionship via online video calls and livestreams. Use only for individuals who self-identify as camboys; otherwise, use "Cam models."
alternative label: Cam boys
alternative label: Webcam boys
broader: https://homosaurus.org/v3/homoit0003769
change note: Version 3.7.0
has top concept: Sex workers
in scheme: v3

Camgirls
type: Concept
issued: 2024-10-30
modified: 2025-02-23
comment: Short for "webcam girls," this term refers to women sex workers who exchange sexual services, performances, or companionship via online video calls and livestreams. Use only for individuals who self-identify as camgirls; otherwise, use "Cam models."
alternative label: Cam girls
alternative label: Webcam girls
broader: https://homosaurus.org/v3/homoit0003769
change note: Version 3.7.0
has top concept: Sex workers
in scheme: v3

Sex work legislation
type: Concept
issued: 2024-10-30
modified: 2025-02-23
comment: Laws and regulations addressing the practice, solitiation, and/or facilitation of sex work, including its legality. Legislation may variously address the actions of sex workers, their clients, third parties, and/or other individuals who work in proximity to or seek to aid sex workers.
alternative label: Sex work laws
alternative label: Prostitution legislation
alternative label: Prostitution laws
broader: https://homosaurus.org/v3/homoit0000702
change note: Version 3.7.0
has top concept: Law
in scheme: v3
narrower: https://homosaurus.org/v3/homoit0003775
narrower: https://homosaurus.org/v3/homoit0003776
related: https://homosaurus.org/v3/homoit0003773
related: https://homosaurus.org/v3/homoit0003774

Criminalization of sex work
type: Concept
issued: 2024-10-30
modified: 2025-02-23
comment: The process by which the practice and solicitation of sex work is made criminal, typically by introducing laws, regulations, and criminal penalties. Efforts to criminalize sex work often target street sex work and other forms of "direct," visible sex work.
alternative label: Sex work criminalization
alternative label: Criminalization of prostitution
alternative label: Prostitution criminalization
broader: https://homosaurus.org/v3/homoit0000314
change note: Version 3.7.0
has top concept: Law
in scheme: v3
preferred label: Criminalisation of sex work
related: https://homosaurus.org/v3/homoit0003772
related: https://homosaurus.org/v3/homoit0003774
related: https://homosaurus.org/v3/homoit0003775
related: https://homosaurus.org/v3/homoit0003776
related: https://homosaurus.org/v3/homoit0003777

Decriminalization of sex work
type: Concept
issued: 2024-10-30
modified: 2025-02-23
comment: The process of lessening or removing laws, regulations, and/or criminal penalties targeting the practice, solicitation, and/or facilitation of sex work. Decriminalization efforts may variously address the actions of sex workers, their clients, third parties, and/or other individuals who work in proximity to or seek to aid sex workers.
alternative label: Sex work decriminalization
alternative label: Decriminalization of prostitution
alternative label: Prostitution decriminalization
broader: https://homosaurus.org/v3/homoit0000339
change note: Version 3.7.0
has top concept: Law
in scheme: v3
preferred label: Decriminalisation of sex work
related: https://homosaurus.org/v3/homoit0003772
related: https://homosaurus.org/v3/homoit0003773
related: https://homosaurus.org/v3/homoit0003775
related: https://homosaurus.org/v3/homoit0003776
related: https://homosaurus.org/v3/homoit0003777

Legalization of sex work
type: Concept
issued: 2024-10-30
modified: 2025-02-23
comment: The creation of a set of laws and regulations intended to legalize the practice and solicitation of sex work, particularly street sex work and other forms of "direct," visible sex work, within certain parameters. This may variously include legalizing the actions of sex workers, their clients, third parties, and/or other individuals who work in proximity to or seek to aid sex workers. Individuals operating outside of these laws and regulations remain subject to penalties.
alternative label: Sex work legalization
alternative label: Legalization of prostitution
alternative label: Prostitution legalization
broader: https://homosaurus.org/v3/homoit0003772
change note: Version 3.7.0
has top concept: Law
in scheme: v3
preferred label: Legalisation of sex work
related: https://homosaurus.org/v3/homoit0003774
related: https://homosaurus.org/v3/homoit0003773
related: https://homosaurus.org/v3/homoit0003777

Nordic model (Sex work)
type: Concept
issued: 2024-10-30
modified: 2025-02-23
comment: A legislative approach to sex work first instituted in Sweden in 1999 and then in Norway in 2009 that centers on the criminalization of clients, third parties, and many of the ways sex workers operate. The Nordic model is a form of sex work abolition predicated on the idea that no person can consent to engage in commercial sexual services and that sex workers must therefore be educated and reformed. Sex workers and activists have heavily criticized and opposed the Nordic model.
alternative label: End demand (Sex work)
alternative label: Equality model (Sex work)
alternative label: Neo-abolition movement (Sex work)
alternative label: Nordic and Swedish model (Sex work)
alternative label: Swedish model (Sex work)
broader: https://homosaurus.org/v3/homoit0003772
broader: https://homosaurus.org/v3/homoit0003777
change note: Version 3.7.0
has top concept: Law
in scheme: v3
related: https://homosaurus.org/v3/homoit0003773
related: https://homosaurus.org/v3/homoit0003774

Curb crawling
type: Concept
issued: 2024-10-30
modified: 2025-02-23
comment: The practice of driving or idling in one's car around areas known for street sex work in order to solicit sex workers.
broader: https://homosaurus.org/v3/homoit0003779
change note: Version 3.7.0
has top concept: Solicitation of sex work
in scheme: v3
preferred label: Kerb crawling
related: https://homosaurus.org/v3/homoit0000278

Street sex work
type: Concept
issued: 2024-10-30
modified: 2025-02-23
comment: Sex work that is generally solicited in a public place such as a street, street corner, or park.
alternative label: Street prostitution
broader: https://homosaurus.org/v3/homoit0001276
change note: Version 3.7.0
has top concept: Sex industry
in scheme: v3

Survival sex work
type: Concept
issued: 2024-10-30
modified: 2025-02-23
comment: A form of sex work performed in lieu of other employment or in order to meet immediate needs, such as shelter, food, clothing, familial care, etc. Use only for sex work that is self-described as survival.
alternative label: Survival prostitution
broader: https://homosaurus.org/v3/homoit0001276
change note: Version 3.7.0
has top concept: Sex industry
in scheme: v3

Madams (Sex work)
type: Concept
issued: 2024-10-30
modified: 2025-02-23
comment: People who mediate between sex workers and clients. This term has historically been used to describe women but can be used for individuals of any gender based on their preference. Follow the individual's preference for "Madams," "Pimps," or "Sex work concierges" whenever possible.
alternative label: Procuresses
broader: https://homosaurus.org/v3/homoit0003782
change note: Version 3.7.0
has top concept: Third parties (Sex work)
in scheme: v3

Pimps
type: Concept
issued: 2024-10-30
modified: 2025-02-23
comment: People who mediate between sex workers and clients. Since the 20th century, this term has been used as a derogatory way of describing urban, working-class Black American men, regardless of their involvement in the facilitation of sex work. While some Black Americans--including women--have embraced an evolved version of the word "pimp," often stripped of its association with sex work facilitation, it still carries racist and classist connotations and should be used with caution. Follow the individual's preference for "Pimps," "Madams," or "Sex work concierges" whenever possible.
alternative label: Procurers
broader: https://homosaurus.org/v3/homoit0003782
change note: Version 3.7.0
has top concept: Third parties (Sex work)
in scheme: v3

Sex work concierges
type: Concept
issued: 2024-10-30
modified: 2025-02-23
comment: People who mediate between sex workers and clients. Follow the individual's preference for "Sex work concierges," "Pimps," or "Madams" whenever possible.
broader: https://homosaurus.org/v3/homoit0003782
change note: Version 3.7.0
has top concept: Third parties (Sex work)
in scheme: v3

Murder of sex workers
type: Concept
issued: 2024-10-30
modified: 2025-02-23
comment: Intentional killing of sex workers on the basis of their work or identity as a sex worker.
alternative label: Murder of prostitutes
broader: https://homosaurus.org/v3/homoit0003787
change note: Version 3.7.0
has top concept: Anti-sex worker violence
in scheme: v3
related: https://homosaurus.org/v3/homoit0000109
related: https://homosaurus.org/v3/homoit0003786

Sugaring
type: Concept
issued: 2024-10-30
modified: 2025-02-23
comment: A form of sex work in which companionship and sexual services are exchanged for money, gifts, and other material benefits. Generally but not always sugaring describes a relationship between an older client and a younger sex worker.
alternative label: Sugar dating
alternative label: Girlfriend experience
alternative label: Boyfriend experience
broader: https://homosaurus.org/v3/homoit0001276
change note: Version 3.7.0
has top concept: Sex industry
in scheme: v3
related: https://homosaurus.org/v3/homoit0003793
related: https://homosaurus.org/v3/homoit0003794
related: https://homosaurus.org/v3/homoit0003795

Sugar babies
type: Concept
issued: 2024-10-30
modified: 2025-02-23
comment: People who provide companionship and sexual services to sugar mamas or daddies in exchange for money, gifts, and other material benefits.
broader: https://homosaurus.org/v3/homoit0003758
change note: Version 3.7.0
has top concept: Sex workers
in scheme: v3
related: https://homosaurus.org/v3/homoit0003792
related: https://homosaurus.org/v3/homoit0003794
related: https://homosaurus.org/v3/homoit0003795

Sugar daddies
type: Concept
issued: 2024-10-30
modified: 2025-02-23
comment: People who provide money, gifts, and other material benefits to sugar babies in exchange for companionship and sexual services. Follow the individual's preference for "Sugar daddies" or "Sugar mamas" whenever possible.
broader: https://homosaurus.org/v3/homoit0000278
change note: Version 3.7.0
has top concept: Sex workers' clients
in scheme: v3
related: https://homosaurus.org/v3/homoit0003793
related: https://homosaurus.org/v3/homoit0003792

Sugar mamas
type: Concept
issued: 2024-10-30
modified: 2025-02-23
comment: People who provide money, gifts, and other material benefits to sugar babies in exchange for companionship and sexual services. Follow the individual's preference for "Sugar mamas" or "Sugar daddies" whenever possible.
alternative label: Sugar mommas
alternative label: Sugar mommies
broader: https://homosaurus.org/v3/homoit0000278
change note: Version 3.7.0
has top concept: Sex workers' clients
in scheme: v3
related: https://homosaurus.org/v3/homoit0003793
related: https://homosaurus.org/v3/homoit0003792

Erotic massage businesses
type: Concept
issued: 2024-10-30
modified: 2025-02-23
comment: Massage businesses that provide sexual services, either legally or under the table.
alternative label: Sexual massage parlors
alternative label: Rub and tug massage parlors
alternative label: Full service massage parlors
alternative label: Erotic massage parlors
broader: https://homosaurus.org/v3/homoit0000011
change note: Version 3.7.0
has top concept: Sex industry
in scheme: v3
related: https://homosaurus.org/v3/homoit0000402

LGBTQ+ strippers
type: Concept
issued: 2024-10-30
modified: 2025-02-23
comment: LGBTQ+ sex workers who undress to music while using a pole to perform dance moves, whether in a venue like a strip club or by hire at private parties. For stripping performed by amateurs in private settings, use "Stripping."
alternative label: Strippers (LGBTQ)
alternative label: LGBTQ+ stripteasers
alternative label: Stripteasers (LGBTQ)
alternative label: LGBTQ+ pole dancers
alternative label: Pole dancers (LGBTQ)
alternative label: LGBTQ+ peelers
alternative label: Peelers (LGBTQ)
alternative label: LGBTQ+ exotic dancers
alternative label: Exotic dancers (LGBTQ)
broader: https://homosaurus.org/v3/homoit0001277
change note: Version 3.7.0
has top concept: Sex workers
in scheme: v3

LGBTQ+ porn stars
type: Concept
issued: 2024-10-30
modified: 2025-02-23
comment: LGBTQ+ actors in erotic or sexually explicit films.
alternative label: LGBTQ+ pornstars
alternative label: LGBTQ+ porn actors
alternative label: LGBTQ+ porn actresses
alternative label: Porn stars (LGBTQ)
alternative label: Pornstars (LGBTQ)
alternative label: Porn actors (LGBTQ)
alternative label: Porn actresses (LGBTQ)
alternative label: LGBTQ+ adult entertainers
alternative label: Adult entertainers (LGBTQ)
broader: https://homosaurus.org/v3/homoit0001127
broader: https://homosaurus.org/v3/homoit0000008
broader: https://homosaurus.org/v3/homoit0001277
change note: Version 3.7.0
has top concept: Sex workers
in scheme: v3
related: https://homosaurus.org/v3/homoit0000013

Red light districts
type: Concept
issued: 2024-10-30
modified: 2025-02-23
comment: Areas designated (often but not always legally) for the practice and solicitation of sex work.
alternative label: Red-light districts
alternative label: Pleasure disticts
broader: https://homosaurus.org/v3/homoit0000011
change note: Version 3.7.0
has top concept: Sex industry
in scheme: v3
narrower: https://homosaurus.org/v3/homoit0003800

Sex drive-ins
type: Concept
issued: 2024-10-30
modified: 2025-02-23
comment: Partitioned car garages found in a few countries in Europe that are designed to allow and facilitate sex work in cars. Sex drive-ins are often created by local authorities to help regulate where sex work occurs.
alternative label: Sex boxes
broader: https://homosaurus.org/v3/homoit0003799
change note: Version 3.7.0
has top concept: Sex industry
in scheme: v3

Sex workers of color
type: Concept
issued: 2024-10-30
modified: 2025-02-23
comment: Sex workers who are not white and self-identify as people of color.
alternative label: People of color sex workers
alternative label: Racialized sex workers
alternative label: Non-white sex workers
broader: https://homosaurus.org/v3/homoit0003758
change note: Version 3.7.0
has top concept: Sex workers
in scheme: v3
preferred label: Sex workers of colour
related: https://homosaurus.org/v3/homoit0001101

LGBTQ+ pornography
type: Concept
issued: 2024-10-30
modified: 2025-02-23
comment: Printed or visual materials that explicitly depict sexual acts. Use in reference to pornography featuring LGBTQ+ performers and/or made for LGBTQ+ people.
alternative label: Pornography (LGBTQ)
alternative label: Porn (LGBTQ)
broader: https://homosaurus.org/v3/homoit0001128
change note: Version 3.7.0
has top concept: Sex industry
in scheme: v3
narrower: https://homosaurus.org/v3/homoit0000013
narrower: https://homosaurus.org/v3/homoit0000923
narrower: https://homosaurus.org/v3/homoit0003803
narrower: https://homosaurus.org/v3/homoit0003804
narrower: https://homosaurus.org/v3/homoit0003805
narrower: https://homosaurus.org/v3/homoit0003806
narrower: https://homosaurus.org/v3/homoit0003807
narrower: https://homosaurus.org/v3/homoit0003808
narrower: https://homosaurus.org/v3/homoit0003809
related: https://homosaurus.org/v3/homoit0003810

Lesbian pornography
type: Concept
issued: 2024-10-30
modified: 2025-02-23
comment: Printed or visual materials that explicitly depict sexual acts. Use in reference to pornography featuring lesbian performers and/or made for lesbians.
broader: https://homosaurus.org/v3/homoit0003802
change note: Version 3.7.0
has top concept: Sex industry
in scheme: v3

Gay pornography
type: Concept
issued: 2024-10-30
modified: 2025-02-23
comment: Printed or visual materials that explicitly depict sexual acts. Use in reference to pornography featuring gay performers and/or made for gay men.
broader: https://homosaurus.org/v3/homoit0003802
change note: Version 3.7.0
has top concept: Sex industry
in scheme: v3

Bisexual pornography
type: Concept
issued: 2024-10-30
modified: 2025-02-23
comment: Printed or visual materials that explicitly depict sexual acts. Use in reference to pornography featuring bisexual performers and/or made for bisexual people.
broader: https://homosaurus.org/v3/homoit0003802
change note: Version 3.7.0
has top concept: Sex industry
in scheme: v3

Transgender pornography
type: Concept
issued: 2024-10-30
modified: 2025-02-23
comment: Printed or visual materials that explicitly depict sexual acts. Use in reference to pornography featuring transgender performers and/or made for transgender people.
alternative label: Trans pornography
broader: https://homosaurus.org/v3/homoit0003802
change note: Version 3.7.0
has top concept: Sex industry
in scheme: v3

Queer pornography
type: Concept
issued: 2024-10-30
modified: 2025-02-23
comment: Printed or visual materials that explicitly depict sexual acts. Use in reference to pornography featuring queer performers and/or made for queer people.
broader: https://homosaurus.org/v3/homoit0003802
change note: Version 3.7.0
has top concept: Sex industry
in scheme: v3

Intersex pornography
type: Concept
issued: 2024-10-30
modified: 2025-02-23
comment: Printed or visual materials that explicitly depict sexual acts. Use in reference to pornography featuring intersex performers and/or made for intersex people.
broader: https://homosaurus.org/v3/homoit0003802
change note: Version 3.7.0
has top concept: Sex industry
in scheme: v3

Non-binary pornography
type: Concept
issued: 2024-10-30
modified: 2025-02-23
comment: Printed or visual materials that explicitly depict sexual acts. Use in reference to pornography featuring non-binary performers and/or made for non-binary people.
alternative label: Nonbinary pornography
broader: https://homosaurus.org/v3/homoit0003802
change note: Version 3.7.0
has top concept: Sex industry
in scheme: v3

Binders (Chest)
type: Concept
issued: 2024-11-27
modified: 2025-02-23
comment: Tight-fitting shirts, straps, or similar materials worn to flatten or conceal the chest area, often by transgender men and transmasculine people.
alternative label: Chest binders
broader: https://homosaurus.org/v3/homoit0000289
change note: Version 3.7.0
has top concept: Gender
in scheme: v3
related: https://homosaurus.org/v3/homoit0000114

Female impersonation shows
type: Concept
issued: 2024-11-27
modified: 2025-02-23
comment: Theater or stage shows featuring female impersonators, a historical term used to describe performers, often male-identified people, who enact female personas for the purpose of entertainment, typically for straight audiences. Only use in historical contexts.
alternative label: Female impersonator shows
alternative label: Female impersonators' shows
broader: https://homosaurus.org/v3/homoit0000878
change note: Version 3.7.0
has top concept: LGBTQ+ historical terms
in scheme: v3
related: https://homosaurus.org/v3/homoit0000431
related: https://homosaurus.org/v3/homoit0003359

Male impersonation shows
type: Concept
issued: 2024-11-27
modified: 2025-02-23
comment: Theater or stage shows featuring male impersonators, a historical term used to describe performers, often female-identified people, who enact male personas for the purpose of entertainment, typically for straight audiences. Only use in historical contexts.
alternative label: Male impersonator shows
alternative label: Male impersonators' shows
broader: https://homosaurus.org/v3/homoit0000878
change note: Version 3.7.0
has top concept: LGBTQ+ historical terms
in scheme: v3
related: https://homosaurus.org/v3/homoit0000983
related: https://homosaurus.org/v3/homoit0003359

Hispanic non-binary people
type: Concept
issued: 2024-11-27
modified: 2025-02-23
comment: Non-binary people who are from or descended from Spain or other regions formerly colonized by Spain that are primarily Spanish-speaking. Only use for individuals who self-identify as Hispanic; do not conflate with Latino/a/x or Chicano/a/x.
alternative label: Hispanic nonbinary people
alternative label: Non-binary Hispanic people
alternative label: Nonbinary Hispanic people
alternative label: Non-binary Hispanics
alternative label: Nonbinary Hispanics
broader: https://homosaurus.org/v3/homoit0002022
change note: Version 3.7.0
has top concept: LGBTQ+ people
in scheme: v3

Hispanic asexual people
type: Concept
issued: 2024-11-27
modified: 2025-02-23
comment: Asexual people who are from or descended from Spain or other regions formerly colonized by Spain that are primarily Spanish-speaking. Only use for individuals who self-identify as Hispanic; do not conflate with Latino/a/x or Chicano/a/x.
alternative label: Asexual Hispanic people
alternative label: Asexual Hispanics
broader: https://homosaurus.org/v3/homoit0002022
change note: Version 3.7.0
has top concept: LGBTQ+ people
in scheme: v3

Chicano/a/x asexual people
type: Concept
issued: 2024-12-12
modified: 2025-02-23
comment: Asexual people of Mexican descent born in the United States; only use to describe people who self-identify as Chicano, Chicana, or Chicanx. Do not conflate with Latino/a/x or Hispanic people.
alternative label: Asexual Chicanas
alternative label: Asexual Chicanos
alternative label: Asexual Chicanx people
alternative label: Asexual Chicanxs
alternative label: Chicana asexual people
alternative label: Chicano asexual people
alternative label: Chicanx asexual people
broader: https://homosaurus.org/v3/homoit0002007
change note: Version 3.7.0
has top concept: LGBTQ+ people
in scheme: v3

LGBTQ+ dating
type: Concept
issued: 2024-12-12
modified: 2025-02-23
comment: Term used to describe people spending regular time together due to mutual romantic interest. Use to refer to dating between and/or as experienced by LGBTQ+ people.
alternative label: Dating (LGBTQ)
broader: https://homosaurus.org/v3/homoit0001237
change note: Version 3.7.0
has top concept: LGBTQ+ relationships
in scheme: v3
related: https://homosaurus.org/v3/homoit0000846
related: https://homosaurus.org/v3/homoit0000847

LGBTQ+ essays
type: Concept
issued: 2024-12-12
modified: 2025-02-23
comment: Short pieces of prose writing, typically analytical or interpretive, from an LGBTQ+ perspective or addressing LGBTQ+ issues.
alternative label: Essays (LGBTQ)
alternative label: LGBTQ+ papers
alternative label: Papers (LGBTQ)
broader: https://homosaurus.org/v3/homoit0000972
change note: Version 3.7.0
has top concept: Subcultures
in scheme: v3

Queer bodies
type: Concept
issued: 2024-12-12
modified: 2025-02-23
comment: Bodies that resist definition by defying social norms such as heteronormativity, cisnormativity, and other forms of essentialism, regardless of the individual's identity.
alternative label: Queered bodies
broader: https://homosaurus.org/v3/homoit0001219
change note: Version 3.7.0
has top concept: Theories
in scheme: v3
related: https://homosaurus.org/v3/homoit0001195

Neurogender
type: Concept
issued: 2024-12-12
modified: 2025-02-23
comment: Term used to describe the identity of neurodivergent people whose neurodivergence(s) greatly affect and cannot be unlinked from their gender. Only use to describe neurodivergent people who describe themselves as neurogender.
broader: https://homosaurus.org/v3/homoit0000560
change note: Version 3.7.0
has top concept: Gender
in scheme: v3
narrower: https://homosaurus.org/v3/homoit0003825
related: https://homosaurus.org/v3/homoit0002658

Autigender
type: Concept
issued: 2024-12-12
modified: 2025-02-23
comment: Term used to describe the identity of autistic people whose autism greatly affects and cannot be unlinked from their gender. Only use to describe autistic people who describe themselves as autigender.
broader: https://homosaurus.org/v3/homoit0003824
change note: Version 3.7.0
has top concept: Gender
in scheme: v3
related: https://homosaurus.org/v3/homoit0002667

Queer desire
type: Concept
issued: 2024-12-12
modified: 2025-02-23
comment: Desire that resists definition by defying social norms such as heteronormativity, cisnormativity, and other forms of essentialism, regardless of the individual's identity.
broader: https://homosaurus.org/v3/homoit0001219
change note: Version 3.7.0
has top concept: Theories
in scheme: v3
narrower: https://homosaurus.org/v3/homoit0001205
narrower: https://homosaurus.org/v3/homoit0000894

Hispanic American LGBTQ+ people
type: Concept
issued: 2024-12-12
modified: 2025-02-23
comment: LGBTQ+ people who were born in or currently reside in the United States and are descended from Spain or other regions formerly colonized by Spain that are primarily Spanish-speaking. Only use for individuals who self-identify as Hispanic American; do not conflate with Latino/a/x or Chicano/a/x.
alternative label: Hispanic Americans (LGBTQ)
alternative label: Hispanic American people (LGBTQ)
alternative label: LGBTQ+ Hispanic Americans
alternative label: LGBTQ+ Hispanic American people
broader: https://homosaurus.org/v3/homoit0002022
change note: Version 3.7.0
has top concept: LGBTQ+ people
in scheme: v3
narrower: https://homosaurus.org/v3/homoit0003828
narrower: https://homosaurus.org/v3/homoit0003829
narrower: https://homosaurus.org/v3/homoit0003830
narrower: https://homosaurus.org/v3/homoit0003831
narrower: https://homosaurus.org/v3/homoit0003832
narrower: https://homosaurus.org/v3/homoit0003833
narrower: https://homosaurus.org/v3/homoit0003834
narrower: https://homosaurus.org/v3/homoit0003835

Hispanic American lesbians
type: Concept
issued: 2024-12-12
modified: 2025-02-23
comment: Lesbians who were born in or currently reside in the United States and are descended from Spain or other regions formerly colonized by Spain that are primarily Spanish-speaking. Only use for individuals who self-identify as Hispanic American; do not conflate with Latino/a/x or Chicano/a/x.
alternative label: Lesbian Hispanic Americans
broader: https://homosaurus.org/v3/homoit0003827
change note: Version 3.7.0
has top concept: LGBTQ+ people
in scheme: v3

Hispanic American gay men
type: Concept
issued: 2024-12-12
modified: 2025-02-23
comment: Gay men who were born in or currently reside in the United States and are descended from Spain or other regions formerly colonized by Spain that are primarily Spanish-speaking. Only use for individuals who self-identify as Hispanic American; do not conflate with Latino/a/x or Chicano/a/x.
alternative label: Gay Hispanic Americans
alternative label: Gay Hispanic American men
broader: https://homosaurus.org/v3/homoit0003827
change note: Version 3.7.0
has top concept: LGBTQ+ people
in scheme: v3

Hispanic American bisexual people
type: Concept
issued: 2024-12-12
modified: 2025-02-23
comment: Bisexual people who were born in or currently reside in the United States and are descended from Spain or other regions formerly colonized by Spain that are primarily Spanish-speaking. Only use for individuals who self-identify as Hispanic American; do not conflate with Latino/a/x or Chicano/a/x.
alternative label: Bisexual Hispanic Americans
alternative label: Bisexual Hispanic American people
broader: https://homosaurus.org/v3/homoit0003827
change note: Version 3.7.0
has top concept: LGBTQ+ people
in scheme: v3

Hispanic American transgender people
type: Concept
issued: 2024-12-12
modified: 2025-02-23
comment: Trans people who were born in or currently reside in the United States and are descended from Spain or other regions formerly colonized by Spain that are primarily Spanish-speaking. Only use for individuals who self-identify as Hispanic American; do not conflate with Latino/a/x or Chicano/a/x.
alternative label: Transgender Hispanic Americans
alternative label: Transgender Hispanic American people
alternative label: Hispanic American trans people
alternative label: Trans Hispanic Americans
alternative label: Trans Hispanic American people
broader: https://homosaurus.org/v3/homoit0003827
change note: Version 3.7.0
has top concept: LGBTQ+ people
in scheme: v3

Hispanic American queer people
type: Concept
issued: 2024-12-12
modified: 2025-02-23
comment: Queer people who were born in or currently reside in the United States and are descended from Spain or other regions formerly colonized by Spain that are primarily Spanish-speaking. Only use for individuals who self-identify as Hispanic American; do not conflate with Latino/a/x or Chicano/a/x.
alternative label: Queer Hispanic Americans
alternative label: Queer Hispanic American people
broader: https://homosaurus.org/v3/homoit0003827
change note: Version 3.7.0
has top concept: LGBTQ+ people
in scheme: v3

Hispanic American non-binary people
type: Concept
issued: 2024-12-12
modified: 2025-02-23
comment: Non-binary people who were born in or currently reside in the United States and are descended from Spain or other regions formerly colonized by Spain that are primarily Spanish-speaking. Only use for individuals who self-identify as Hispanic American; do not conflate with Latino/a/x or Chicano/a/x.
alternative label: Non-binary Hispanic Americans
alternative label: Non-binary Hispanic American people
alternative label: Hispanic American Nonbinary people
alternative label: Nonbinary Hispanic Americans
alternative label: Nonbinary Hispanic American people
broader: https://homosaurus.org/v3/homoit0003827
change note: Version 3.7.0
has top concept: LGBTQ+ people
in scheme: v3

Hispanic American intersex people
type: Concept
issued: 2024-12-12
modified: 2025-02-23
comment: Intersex people who were born in or currently reside in the United States and are descended from Spain or other regions formerly colonized by Spain that are primarily Spanish-speaking. Only use for individuals who self-identify as Hispanic American; do not conflate with Latino/a/x or Chicano/a/x.
alternative label: Intersex Hispanic Americans
alternative label: Intersex Hispanic American people
broader: https://homosaurus.org/v3/homoit0003827
change note: Version 3.7.0
has top concept: LGBTQ+ people
in scheme: v3

Hispanic American asexual people
type: Concept
issued: 2024-12-12
modified: 2025-02-23
comment: Asexual people who were born in or currently reside in the United States and are descended from Spain or other regions formerly colonized by Spain that are primarily Spanish-speaking. Only use for individuals who self-identify as Hispanic American; do not conflate with Latino/a/x or Chicano/a/x.
alternative label: Asexual Hispanic Americans
alternative label: Asexual Hispanic American people
broader: https://homosaurus.org/v3/homoit0003827
change note: Version 3.7.0
has top concept: LGBTQ+ people
in scheme: v3

Lesbian organizations
type: Concept
issued: 2024-12-12
modified: 2025-02-23
comment: Groups or clubs of lesbians dedicated to a particular interest or activity.
alternative label: Lesbian groups
broader: https://homosaurus.org/v3/homoit0000836
change note: Version 3.7.0
has top concept: LGBTQ+ clubs and organizations
in scheme: v3
preferred label: Lesbian organisations

Gay organizations
type: Concept
issued: 2024-12-12
modified: 2025-02-23
comment: Groups or clubs of gay men dedicated to a particular interest or activity.
alternative label: Gay groups
broader: https://homosaurus.org/v3/homoit0000836
change note: Version 3.7.0
has top concept: LGBTQ+ clubs and organizations
in scheme: v3
preferred label: Gay organisations

Bisexual organizations
type: Concept
issued: 2024-12-12
modified: 2025-02-23
comment: Groups or clubs of bisexual people dedicated to a particular interest or activity.
alternative label: Bisexual groups
broader: https://homosaurus.org/v3/homoit0000836
change note: Version 3.7.0
has top concept: LGBTQ+ clubs and organizations
in scheme: v3
preferred label: Bisexual organisations

Transgender organizations
type: Concept
issued: 2024-12-12
modified: 2025-02-23
comment: Groups or clubs of trans people dedicated to a particular interest or activity.
alternative label: Trans organizations
alternative label: Transgender groups
alternative label: Trans groups
broader: https://homosaurus.org/v3/homoit0000836
change note: Version 3.7.0
has top concept: LGBTQ+ clubs and organizations
in scheme: v3
preferred label: Transgender organisations

Queer organizations
type: Concept
issued: 2024-12-12
modified: 2025-02-23
comment: Groups or clubs of queer people dedicated to a particular interest or activity.
alternative label: Queer groups
broader: https://homosaurus.org/v3/homoit0000836
change note: Version 3.7.0
has top concept: LGBTQ+ clubs and organizations
in scheme: v3
preferred label: Queer organisations

Intersex organizations
type: Concept
issued: 2024-12-12
modified: 2025-02-23
comment: Groups or clubs of intersex people dedicated to a particular interest or activity.
alternative label: Intersex groups
broader: https://homosaurus.org/v3/homoit0000836
change note: Version 3.7.0
has top concept: LGBTQ+ clubs and organizations
in scheme: v3
preferred label: Intersex organisations

Non-binary organizations
type: Concept
issued: 2024-12-12
modified: 2025-02-23
comment: Groups or clubs of non-binary people dedicated to a particular interest or activity.
alternative label: Non-binary groups
alternative label: Nonbinary organizations
alternative label: Nonbinary groups
broader: https://homosaurus.org/v3/homoit0000836
change note: Version 3.7.0
has top concept: LGBTQ+ clubs and organizations
in scheme: v3
preferred label: Non-binary organisations

Two-Spirit organizations
type: Concept
issued: 2024-12-12
modified: 2025-02-23
comment: Groups or clubs of Two-Spirit people dedicated to a particular interest or activity.
alternative label: Two-Spirit groups
alternative label: Two-Spirited organizations
alternative label: Two-Spirited groups
alternative label: Two Spirit groups
alternative label: Two Spirit organizations
alternative label: Two Spirited groups
alternative label: Two Spirited organizations
alternative label: 2S groups
alternative label: 2S organizations
broader: https://homosaurus.org/v3/homoit0000836
change note: Version 3.7.0
has top concept: LGBTQ+ clubs and organizations
in scheme: v3
preferred label: Two-Spirit organisations

Reproductive health care for intersex people
type: Concept
issued: 2024-12-12
modified: 2025-02-23
comment: Access to and experiences with reproductive health care for intersex people. Reproductive health care includes contraception, abortion, STD testing and treatment, and fertility care.
alternative label: Reproductive healthcare for intersex people
broader: https://homosaurus.org/v3/homoit0003361
change note: Version 3.7.0
has top concept: Health care for LGBTQ+ people
in scheme: v3

Greyromantic artists
type: Concept
issued: 2024-12-12
modified: 2025-02-23
comment: Greyromantic people who practice any of various creative arts.
broader: https://homosaurus.org/v3/homoit0000070
change note: Version 3.7.0
has top concept: LGBTQ+ people
in scheme: v3

Demisexual artists
type: Concept
issued: 2024-12-12
modified: 2025-02-23
comment: Demisexual people who practice any of various creative arts.
broader: https://homosaurus.org/v3/homoit0000070
change note: Version 3.7.0
has top concept: LGBTQ+ people
in scheme: v3

Megasexual artists
type: Concept
issued: 2024-12-12
modified: 2025-02-23
comment: Megasexual people who practice any of various creative arts.
broader: https://homosaurus.org/v3/homoit0000070
change note: Version 3.7.0
has top concept: LGBTQ+ people
in scheme: v3

Aromantic artists
type: Concept
issued: 2024-12-12
modified: 2025-02-23
comment: Aromantic people who practice any of various creative arts.
broader: https://homosaurus.org/v3/homoit0000070
change note: Version 3.7.0
has top concept: LGBTQ+ people
in scheme: v3

PVC (Erotic)
type: Concept
issued: 2025-01-09
modified: 2025-02-23
comment: Short for polyvinal chloride, PVC is a material commonly used in fetish fashion and for inflatables.
alternative label: Polyvinal chloride (Erotic)
broader: https://homosaurus.org/v3/homoit0000442
broader: https://homosaurus.org/v3/homoit0003066
change note: Version 3.7.0
has top concept: Eroticism
in scheme: v3

Sensory deprivation (Erotic)
type: Concept
issued: 2025-01-09
modified: 2025-02-23
comment: Stifling of one or more physical senses with the use of blindfolds, ear plugs, hoods, or bondage for erotic or sensual pleasure.
alternative label: Sensory isolation (Erotic)
alternative label: Stimulus deprivation (Erotic)
broader: https://homosaurus.org/v3/homoit0000442
change note: Version 3.7.0
has top concept: Eroticism
in scheme: v3
related: https://homosaurus.org/v3/homoit0003134
related: https://homosaurus.org/v3/homoit0000209
related: https://homosaurus.org/v3/homoit0003146
related: https://homosaurus.org/v3/homoit0003071

Dehumanization (Erotic)
type: Concept
issued: 2025-01-09
modified: 2025-02-23
comment: Acts or practices in which one person behaves or is treated as an object (e.g., a table) for erotic enjoyment, sometimes as a form of humiliation.
broader: https://homosaurus.org/v3/homoit0000442
change note: Version 3.7.0
has top concept: Eroticism
in scheme: v3
related: https://homosaurus.org/v3/homoit0003052
related: https://homosaurus.org/v3/homoit0003082
related: https://homosaurus.org/v3/homoit0003069
related: https://homosaurus.org/v3/homoit0003126
related: https://homosaurus.org/v3/homoit0003070

Females
type: Concept
is replaced by: homoit0001509
issued: 2019-05-14
modified: 2022-10-25
replaces: females
change note: Version 3.7.0
in scheme: v3
narrower: https://homosaurus.org/v3/homoit0000273
narrower: https://homosaurus.org/v3/homoit0001642

Jealousy
type: Concept
is replaced by: homoit0001658
issued: 2019-05-14
modified: 2022-10-13
replaces: jealousy
change note: Version 3.7.0
in scheme: v3
related: https://homosaurus.org/v3/homoit0000889
related: https://homosaurus.org/v3/homoit0001237
related: https://homosaurus.org/v3/homoit0001649

LGBTQ+ emotions
type: Concept
is replaced by: homoit0000889
issued: 2019-05-14
modified: 2022-10-13
replaces: LGBTQEmotions
alternative label: LGBTQ emotions
change note: Version 3.7.0
in scheme: v3

LGBTQ+ people with visual disabilities
type: Concept
is replaced by: homoit0001854
issued: 2019-05-14
modified: 2022-08-22
replaces: LGBTQPeopleWithVisualDisabilities
alternative label: LGBTQ people with visual impairments
alternative label: People with visual disabilities (LGBTQ)
alternative label: Visually disabled LGBTQ people
alternative label: LGBTQ people with visual disabilities
change note: Version 3.7.0
in scheme: v3

Males
type: Concept
is replaced by: homoit0001008
issued: 2019-05-14
modified: 2022-10-25
replaces: males
change note: Version 3.7.0
in scheme: v3

Relationship satisfaction
type: Concept
is replaced by: homoit0001237
issued: 2019-05-14
modified: 2022-10-13
replaces: relationshipSatisfaction
change note: Version 3.7.0
in scheme: v3

Transgender prostitution
type: Concept
is replaced by: homoit0001437
issued: 2019-05-14
modified: 2025-01-28
replaces: transgenderProstitution
change note: Version 3.7.0
in scheme: v3

Witches (Lesbians)
type: Concept
is replaced by: homoit0001908
issued: 2019-05-14
modified: 2022-08-22
replaces: witchesLesbian
change note: Version 3.7.0
in scheme: v3
related: https://homosaurus.org/v3/homoit0000596
related: https://homosaurus.org/v3/homoit0000761

Al-Anon
type: Concept
is replaced by: homoit0001551
issued: 2020-06-02
modified: 2022-08-22
replaces: al-Anon
change note: Version 3.7.0
in scheme: v3
related: https://homosaurus.org/v3/homoit0001551
related: https://homosaurus.org/v3/homoit0001540
related: https://homosaurus.org/v3/homoit0002227

Alcoholics
type: Concept
is replaced by: homoit0001540
issued: 2020-06-02
modified: 2022-08-22
replaces: alcoholics
comment: Individuals who are addicted to alcohol or have alcohol dependencies
change note: Version 3.7.0
in scheme: v3
narrower: https://homosaurus.org/v3/homoit0001540
related: https://homosaurus.org/v3/homoit0001540
related: https://homosaurus.org/v3/homoit0000256
related: https://homosaurus.org/v3/homoit0001083

Alcoholism
type: Concept
is replaced by: homoit0001540
issued: 2020-06-02
modified: 2022-08-22
replaces: alcoholism
change note: Version 3.7.0
in scheme: v3
related: https://homosaurus.org/v3/homoit0002227
related: https://homosaurus.org/v3/homoit0001551

Crystal meth addiction
type: Concept
is replaced by: homoit0002226
issued: 2020-06-02
modified: 2022-12-16
replaces: crystalMethAddiction
alternative label: Crystal meth misuse
alternative label: Crystal meth abuse
alternative label: Methamphetamine misuse
alternative label: Methamphetamine abuse
change note: Version 3.7.0
in scheme: v3
related: https://homosaurus.org/v3/homoit0001551

LGBTQ+ children of alcoholics
type: Concept
is replaced by: homoit0000256
issued: 2020-06-03
modified: 2022-08-15
replaces: LGBTQChildrenOfAlcoholics
alternative label: LGBTQ children of alcoholics
change note: Version 3.7.0
in scheme: v3
related: https://homosaurus.org/v3/homoit0000256
related: https://homosaurus.org/v3/homoit0002227

Sobriety
type: Concept
is replaced by: homoit0002228
issued: 2020-06-03
modified: 2022-12-16
replaces: sobriety
comment: Conscious abstinence from addictive or mind-altering substances, typically alcohol or drugs.
change note: Version 3.7.0
in scheme: v3
related: https://homosaurus.org/v3/homoit0001235

Cheating
type: Concept
is replaced by: homoit0001658
issued: 2021-06-30
modified: 2022-10-13
replaces: cheating
comment: A violation of a couple's assumed or stated contract regarding emotional and/or sexual exclusivity. Should not be used to refer to non-monogamy in general, as cheating is possible in both monogamous and non-monogamous relationships.
alternative label: Straying
alternative label: Adultery
alternative label: Infidelity
alternative label: Affairs
alternative label: Stepping out
change note: Version 3.7.0
in scheme: v3

Intersexual
type: Concept
is replaced by: homoit0000352
issued: 2023-06-28
modified: 2023-12-08
comment: This term is not common in the English language as to not confuse intersex with a gender identity or sex orientation by adding "ual" but it is used in other languages such as Spanish to mean "intersex."
alternative label: Intersex
change note: Version 3.7.0
in scheme: v3

AIDS awareness
type: Concept
issued: 2019-05-14
modified: 2025-02-23
replaces: AIDSAwareness
comment: Activism and other efforts to bring attention to the AIDS epidemic.
change note: Version 3.7.0
in scheme: v3
related: https://homosaurus.org/v3/homoit0000005
related: https://homosaurus.org/v3/homoit0000034

AIDS organizations
type: Concept
issued: 2019-05-14
modified: 2025-02-23
replaces: AIDSOrganisations
comment: Community-based groups or institutions that provide support and advocacy for people affected by HIV/AIDS.
change note: Version 3.7.0
in scheme: v3
preferred label: AIDS organisations
related: https://homosaurus.org/v3/homoit0000005
related: https://homosaurus.org/v3/homoit0000024
related: https://homosaurus.org/v3/homoit0000031
related: https://homosaurus.org/v3/homoit0000614
related: https://homosaurus.org/v3/homoit0000836

AIDS phobia
type: Concept
issued: 2019-05-14
modified: 2025-02-23
replaces: AIDSPhobia
comment: Antagonism or disgust directed toward individuals with HIV/AIDS or behaviors perceived as putting oneself at risk for contracting HIV/AIDS. AIDS phobia may include isolation, stereotypes, verbal harassment, and physical violence.
alternative label: AIDSphobia
alternative label: Fear of AIDS
change note: Version 3.7.0
in scheme: v3
related: https://homosaurus.org/v3/homoit0000005
related: https://homosaurus.org/v3/homoit0000920

Anti-feminism
type: Concept
issued: 2019-05-14
modified: 2025-02-23
replaces: anti-feminism
comment: Opposition to some or all forms of feminism.
change note: Version 3.7.0
in scheme: v3
related: https://homosaurus.org/v3/homoit0000437
related: https://homosaurus.org/v3/homoit0001133

Normalization
type: Concept
issued: 2019-05-14
modified: 2025-02-23
replaces: normalisation
comment: Social processes through which ideas, characteristics, and behaviors come to be seen as "normal" or "natural" and accepted as such.
alternative label: Assimilation
change note: Version 3.7.0
in scheme: v3
preferred label: Normalisation
related: https://homosaurus.org/v3/homoit0000620
related: https://homosaurus.org/v3/homoit0000644
related: https://homosaurus.org/v3/homoit0000947
related: https://homosaurus.org/v3/homoit0001323

Autoeroticism
type: Concept
issued: 2019-05-14
modified: 2025-02-23
replaces: autoeroticism
comment: Practice of sexually stimulating oneself.
change note: Version 3.7.0
in scheme: v3
related: https://homosaurus.org/v3/homoit0001000

Hate crimes
type: Concept
issued: 2019-05-14
modified: 2025-02-23
replaces: hateCrimes
comment: Criminal acts motivated by the victim’s actual or perceived race, nationality, religion, sexual identity, gender identity, or ability status.
alternative label: Bias-related crimes
change note: Version 3.7.0
in scheme: v3
related: https://homosaurus.org/v3/homoit0000052
related: https://homosaurus.org/v3/homoit0000056
related: https://homosaurus.org/v3/homoit0000058
related: https://homosaurus.org/v3/homoit0000061
related: https://homosaurus.org/v3/homoit0000063
related: https://homosaurus.org/v3/homoit0000112
related: https://homosaurus.org/v3/homoit0000341
related: https://homosaurus.org/v3/homoit0000613
related: https://homosaurus.org/v3/homoit0000641
related: https://homosaurus.org/v3/homoit0001769
related: https://homosaurus.org/v3/homoit0001770
related: https://homosaurus.org/v3/homoit0002900
related: https://homosaurus.org/v3/homoit0003787
related: https://homosaurus.org/v3/homoit0003788

Intolerance towards LGBTQ+ people
type: Concept
issued: 2019-05-14
modified: 2025-02-23
replaces: intoleranceTowardsLGBTQPeople
comment: Unwillingness to accept or affirm LGBTQ+ people or their identities in attitude or practice.
alternative label: Bigotry towards LGBTQ people
alternative label: Prejudice towards LGBTQ people
alternative label: Intolerance towards LGBTQ people
change note: Version 3.7.0
in scheme: v3
related: https://homosaurus.org/v3/homoit0000109
related: https://homosaurus.org/v3/homoit0000341
related: https://homosaurus.org/v3/homoit0000356
related: https://homosaurus.org/v3/homoit0000643
related: https://homosaurus.org/v3/homoit0001015
related: https://homosaurus.org/v3/homoit0001017
related: https://homosaurus.org/v3/homoit0001561
related: https://homosaurus.org/v3/homoit0001885
related: https://homosaurus.org/v3/homoit0001892
related: https://homosaurus.org/v3/homoit0001893
related: https://homosaurus.org/v3/homoit0001903
related: https://homosaurus.org/v3/homoit0002899

Bois
type: Concept
issued: 2019-05-14
modified: 2025-02-23
replaces: bois
comment: Slang for young masculine or transmasculine people. The term is commonly used in lesbian communities.
change note: Version 3.7.0
in scheme: v3
related: https://homosaurus.org/v3/homoit0000231
related: https://homosaurus.org/v3/homoit0000432
related: https://homosaurus.org/v3/homoit0000556
related: https://homosaurus.org/v3/homoit0000779
related: https://homosaurus.org/v3/homoit0001466
related: https://homosaurus.org/v3/homoit0001898
related: https://homosaurus.org/v3/homoit0002061

Brothels
type: Concept
issued: 2019-05-14
modified: 2025-02-23
replaces: brothels
comment: Establishments where clients pay to engage in sexual activity with sex workers. Brothels may be illegal, decriminalized, or legal operations.
alternative label: Bordellos
change note: Version 3.7.0
in scheme: v3

Camp (Gay culture)
type: Concept
issued: 2019-05-14
modified: 2025-02-23
replaces: camp
comment: An aesthetic style and sensibility that values irony and bad taste.
alternative label: Camp
change note: Version 3.7.0
in scheme: v3
related: https://homosaurus.org/v3/homoit0000367
related: https://homosaurus.org/v3/homoit0000487

Celibacy
type: Concept
issued: 2019-05-14
modified: 2025-02-23
replaces: celibacy
comment: Conscious abstinence from sexual activity, often associated with religious beliefs. Celibacy is distinct from asexuality; only use to describe asexual people if they are also choosing to practice conscious abstinence.
change note: Version 3.7.0
in scheme: v3
related: https://homosaurus.org/v3/homoit0000071
related: https://homosaurus.org/v3/homoit0000142
related: https://homosaurus.org/v3/homoit0000484
related: https://homosaurus.org/v3/homoit0000732
related: https://homosaurus.org/v3/homoit0001169
related: https://homosaurus.org/v3/homoit0001282
related: https://homosaurus.org/v3/homoit0001402

Child custody
type: Concept
issued: 2019-05-14
modified: 2025-02-23
replaces: childCustody
comment: Legal term for the guardianship of a child, or the legal and practical relationship between a parent and a child in their care. Typically used to describe legal custody, which is the right to make decisions about the child, as well as physical custody, which is the right and duty to house, provide, and care for the child.
alternative label: Guardianship
alternative label: Parental custody
alternative label: Tutelage
change note: Version 3.7.0
in scheme: v3
related: https://homosaurus.org/v3/homoit0000255
related: https://homosaurus.org/v3/homoit0000809
related: https://homosaurus.org/v3/homoit0000854
related: https://homosaurus.org/v3/homoit0000870
related: https://homosaurus.org/v3/homoit0000918
related: https://homosaurus.org/v3/homoit0000937

Chosen name
type: Concept
issued: 2019-05-14
modified: 2025-02-23
replaces: chosenName
comment: A name chosen by an individual that differs from their birth or legal name; often used to describe names chosen by LGBTQ+ people to better match their identities.
change note: Version 3.7.0
in scheme: v3
related: https://homosaurus.org/v3/homoit0000336
related: https://homosaurus.org/v3/homoit0000592

Cut men
type: Concept
issued: 2019-05-14
modified: 2025-02-23
replaces: cutMen
comment: Men whose penises are circumcised (i.e., the foreskin of the penis has been surgically removed).
alternative label: Circumcised men
change note: Version 3.7.0
in scheme: v3
related: https://homosaurus.org/v3/homoit0000269

Circumcision
type: Concept
issued: 2019-05-14
modified: 2025-02-23
replaces: circumcision
comment: Surgical removal of the foreskin of the penis.
change note: Version 3.7.0
in scheme: v3
related: https://homosaurus.org/v3/homoit0000268
related: https://homosaurus.org/v3/homoit0000281
related: https://homosaurus.org/v3/homoit0000450
related: https://homosaurus.org/v3/homoit0001481

Cissexual people
type: Concept
issued: 2019-05-14
modified: 2025-02-23
replaces: cissexualPeople
comment: Individuals whose sex matches the sex or gender they were assigned at birth. Whereas cisgender refers to people who are not transgender, cissexual refers to people who are not transsexual.
change note: Version 3.7.0
in scheme: v3
related: https://homosaurus.org/v3/homoit0000271
related: https://homosaurus.org/v3/homoit0001381
related: https://homosaurus.org/v3/homoit0001924

Stealth (Transgender)
type: Concept
issued: 2019-05-14
modified: 2025-02-23
replaces: stealthTransgender
comment: Term used to describe the experience of a trans person who is not openly trans and is choosing to pass as cisgender.
alternative label: Stealth
change note: Version 3.7.0
in scheme: v3
related: https://homosaurus.org/v3/homoit0000078
related: https://homosaurus.org/v3/homoit0000295
related: https://homosaurus.org/v3/homoit0000560
related: https://homosaurus.org/v3/homoit0001065
related: https://homosaurus.org/v3/homoit0001090
related: https://homosaurus.org/v3/homoit0001261
related: https://homosaurus.org/v3/homoit0001378
related: https://homosaurus.org/v3/homoit0001781
related: https://homosaurus.org/v3/homoit0001783
related: https://homosaurus.org/v3/homoit0001784
related: https://homosaurus.org/v3/homoit0001785
related: https://homosaurus.org/v3/homoit0001786
related: https://homosaurus.org/v3/homoit0001787

Coming out
type: Concept
issued: 2019-05-14
modified: 2025-02-23
replaces: comingOut
comment: Process of accepting and sharing one’s sexual or gender identity with oneself and/or others.
change note: Version 3.7.0
in scheme: v3
related: https://homosaurus.org/v3/homoit0000088
related: https://homosaurus.org/v3/homoit0000089
related: https://homosaurus.org/v3/homoit0000285
related: https://homosaurus.org/v3/homoit0000286
related: https://homosaurus.org/v3/homoit0000287
related: https://homosaurus.org/v3/homoit0000288
related: https://homosaurus.org/v3/homoit0001065
related: https://homosaurus.org/v3/homoit0001261
related: https://homosaurus.org/v3/homoit0001783
related: https://homosaurus.org/v3/homoit0001784
related: https://homosaurus.org/v3/homoit0001785
related: https://homosaurus.org/v3/homoit0001786
related: https://homosaurus.org/v3/homoit0001787
related: https://homosaurus.org/v3/homoit0002905
related: https://homosaurus.org/v3/homoit0003509

Cybersex
type: Concept
issued: 2019-05-14
modified: 2025-02-23
replaces: cybersex
comment: Erotic or sexual communication and activity between two or more people that takes place online or using technology (e.g., texting, video chatting).
alternative label: Internet sex
alternative label: Online sex
change note: Version 3.7.0
in scheme: v3
related: https://homosaurus.org/v3/homoit0000328
related: https://homosaurus.org/v3/homoit0001306

Hate speech
type: Concept
issued: 2019-05-14
modified: 2025-02-23
replaces: hateSpeech
comment: Any form of expression (written or verbal) with the intention to vilify, humiliate, or incite hatred against a individual or group of people on the basis of their actual or perceived race, religion, nationality, sexual identity, gender identity, or ability status.
alternative label: Defamation against groups
alternative label: Group defamation
alternative label: Group libel
change note: Version 3.7.0
in scheme: v3
related: https://homosaurus.org/v3/homoit0000109
related: https://homosaurus.org/v3/homoit0000112
related: https://homosaurus.org/v3/homoit0000850

Denial of sexual orientation
type: Concept
issued: 2019-05-14
modified: 2025-02-23
replaces: denialOfSexualOrientation
comment: Refusal to acknowledge or affirm one's own sexual identity, or the sexual identity of another individual.
change note: Version 3.7.0
in scheme: v3
related: https://homosaurus.org/v3/homoit0000391
related: https://homosaurus.org/v3/homoit0000699
related: https://homosaurus.org/v3/homoit0000936
related: https://homosaurus.org/v3/homoit0001298
related: https://homosaurus.org/v3/homoit0002590

Desire to have children
type: Concept
issued: 2019-05-14
modified: 2025-02-23
replaces: desireToHaveChildren
comment: A person's drive or desire to have children.
change note: Version 3.7.0
in scheme: v3
related: https://homosaurus.org/v3/homoit0000255
related: https://homosaurus.org/v3/homoit0000843
related: https://homosaurus.org/v3/homoit0000864
related: https://homosaurus.org/v3/homoit0000914

DSM (Diagnostic and Statistical Manual of Mental Disorders)
type: Concept
issued: 2019-05-14
modified: 2025-02-23
replaces: DSM
comment: The Diagnostic and Statistical Manual of Mental Disorders, produced by the American Psychiatric Association; can be used in reference to the DSM's historical or present day descriptions of LGBTQ+ identities and practices.
alternative label: DSM
alternative label: Diagnostic and Statistical Manual of Mental Disorders
change note: Version 3.7.0
in scheme: v3
related: https://homosaurus.org/v3/homoit0001012

Domestic partnership retirement benefits
type: Concept
issued: 2019-05-14
modified: 2025-02-23
replaces: domesticPartnershipRetirementBenefits
comment: Employee benefit plans for people in domestic partnerships that can be accessed upon retirement.
alternative label: Same-sex pension benefits
change note: Version 3.7.0
in scheme: v3
related: https://homosaurus.org/v3/homoit0000360
related: https://homosaurus.org/v3/homoit0000918

Drag kings
type: Concept
issued: 2019-05-14
modified: 2025-02-23
replaces: dragKings
comment: Performers, often people assigned female at birth, who dress in stereotypically masculine attire and enact masculine personas for the purpose of entertainment.
change note: Version 3.7.0
in scheme: v3
related: https://homosaurus.org/v3/homoit0000316
related: https://homosaurus.org/v3/homoit0000367
related: https://homosaurus.org/v3/homoit0000370
related: https://homosaurus.org/v3/homoit0000371
related: https://homosaurus.org/v3/homoit0000372
related: https://homosaurus.org/v3/homoit0000374
related: https://homosaurus.org/v3/homoit0000375
related: https://homosaurus.org/v3/homoit0000983
related: https://homosaurus.org/v3/homoit0001906

Erections
type: Concept
issued: 2019-05-14
modified: 2025-02-23
replaces: erections
comment: Enlargement of the erectile tissue of the penis or clitoris due to increased blood flow; typically associated with sexual arousal.
change note: Version 3.7.0
in scheme: v3
related: https://homosaurus.org/v3/homoit0000398
related: https://homosaurus.org/v3/homoit0000399
related: https://homosaurus.org/v3/homoit0001099

Foreskin restoration
type: Concept
issued: 2019-05-14
modified: 2025-02-23
replaces: foreskinRestoration
comment: The process of altering a circumcised penis to reconstruct or restore the foreskin.
alternative label: Uncircumcision
change note: Version 3.7.0
in scheme: v3
related: https://homosaurus.org/v3/homoit0000269

Social parenthood
type: Concept
issued: 2019-05-14
modified: 2025-02-23
replaces: socialParenthood
comment: A basis of parenthood understood to be in opposition to biological parenthood, that challenges the assumption that parenthood presupposes blood relation. Social parenthood is the full- or part-time care, nurturing, and protection of a child by an adult who has taken on that duty.
alternative label: Foster parenthood
change note: Version 3.7.0
in scheme: v3
related: https://homosaurus.org/v3/homoit0000009
related: https://homosaurus.org/v3/homoit0000010
related: https://homosaurus.org/v3/homoit0000116
related: https://homosaurus.org/v3/homoit0000452

Fuck buddies
type: Concept
issued: 2019-05-14
modified: 2025-02-23
replaces: fuckBuddies
comment: Two friends who regularly have sex with one another but are not committed to a romantic relationship.
change note: Version 3.7.0
in scheme: v3
related: https://homosaurus.org/v3/homoit0000895
related: https://homosaurus.org/v3/homoit0001295
related: https://homosaurus.org/v3/homoit0001302

Gay sensibility
type: Concept
issued: 2019-05-14
modified: 2025-02-23
replaces: gaySensibility
comment: A way of reading and looking at cultural texts (books, movies, television, magazines, etc.) through a gay lens, often including the appropriation of texts otherwise thought of as heterosexual.
change note: Version 3.7.0
in scheme: v3
related: https://homosaurus.org/v3/homoit0000777

Gay shame
type: Concept
issued: 2019-05-14
modified: 2025-02-23
replaces: gayShame
comment: Movement within queer communities that is described as a radical alternative to gay culture being brought into the mainstream; directly posits an alternative view of gay pride events and activities that rejects increasing commercialization, corporate sponsors, and "safer" agendas to avoid offending heterosexual supporters and sponsors.
change note: Version 3.7.0
in scheme: v3
related: https://homosaurus.org/v3/homoit0000006
related: https://homosaurus.org/v3/homoit0001561

Gay theater groups
type: Concept
issued: 2019-05-14
modified: 2025-02-23
replaces: gayTheatreGroups
comment: Groups of theatrical performers comprised of gay men; may focus on performing works written by gay men or about gay issues.
change note: Version 3.7.0
in scheme: v3
preferred label: Gay theatre groups
related: https://homosaurus.org/v3/homoit0000546
related: https://homosaurus.org/v3/homoit0000789
related: https://homosaurus.org/v3/homoit0001031

LGBTQ+ neighborhoods
type: Concept
issued: 2019-05-14
modified: 2025-02-23
replaces: LGBTQNeighbourhoods
comment: Districts or portions of towns or cities that are (typically unofficial) social and/or residential centers for LGBTQ+ people and communities.
change note: Version 3.7.0
in scheme: v3
preferred label: LGBTQ+ neighbourhoods
related: https://homosaurus.org/v3/homoit0000297

Gaydar
type: Concept
issued: 2019-05-14
modified: 2025-02-23
replaces: gaydar
comment: Term describing a person's intuitive ability to identify others' sexual orientations.
change note: Version 3.7.0
in scheme: v3
related: https://homosaurus.org/v3/homoit0001298

Gender binaries
type: Concept
issued: 2019-05-14
modified: 2025-02-23
replaces: genderBinary
comment: Cultural conceptions of gender as two distinct and opposing categories, typically man and woman or masculine and feminine.
change note: Version 3.7.0
in scheme: v3
related: https://homosaurus.org/v3/homoit0000220
related: https://homosaurus.org/v3/homoit0000560
related: https://homosaurus.org/v3/homoit0000571
related: https://homosaurus.org/v3/homoit0000577
related: https://homosaurus.org/v3/homoit0000578
related: https://homosaurus.org/v3/homoit0000590
related: https://homosaurus.org/v3/homoit0001008
related: https://homosaurus.org/v3/homoit0001509
related: https://homosaurus.org/v3/homoit0002589

Gender segregation
type: Concept
issued: 2019-05-14
modified: 2025-02-23
replaces: genderSegregation
comment: Physical, legal, cultural, or rhetorical separation of people according to their gender.
change note: Version 3.7.0
in scheme: v3
related: https://homosaurus.org/v3/homoit0000560
related: https://homosaurus.org/v3/homoit0000563
related: https://homosaurus.org/v3/homoit0000575

Gendercide
type: Concept
issued: 2019-05-14
modified: 2025-02-23
replaces: gendercide
comment: The systematic killing of members of a specific gender for their gender.
change note: Version 3.7.0
in scheme: v3
related: https://homosaurus.org/v3/homoit0000560
related: https://homosaurus.org/v3/homoit0000571
related: https://homosaurus.org/v3/homoit0001108

Genderfuck
type: Concept
issued: 2019-05-14
modified: 2025-02-23
replaces: genderfuck
comment: A form of gender expression that seeks to subvert the gender binary or gender roles by mixing and messing with (or "fucking with") traditionally masculine and feminine components. Typically used to describe gender practices and presentation, though some people identify as "genderfuck" or as "genderfuckers." Only use to describe people and the practices of people who self-identify with genderfuck.
change note: Version 3.7.0
in scheme: v3
related: https://homosaurus.org/v3/homoit0000568
related: https://homosaurus.org/v3/homoit0001816
related: https://homosaurus.org/v3/homoit0001817

Getting off
type: Concept
issued: 2019-05-14
modified: 2025-02-23
replaces: gettingOff
comment: Slang term for the act of experiencing erotic or sexual pleasure, typically referring to an orgasm.
change note: Version 3.7.0
in scheme: v3
related: https://homosaurus.org/v3/homoit0000323
related: https://homosaurus.org/v3/homoit0000610
related: https://homosaurus.org/v3/homoit0000683
related: https://homosaurus.org/v3/homoit0001000
related: https://homosaurus.org/v3/homoit0001062
related: https://homosaurus.org/v3/homoit0001284
related: https://homosaurus.org/v3/homoit0001288

Given name
type: Concept
issued: 2019-05-14
modified: 2025-02-23
replaces: givenName
comment: Personal names ascribed to individuals at birth, typically by their parents. Sometimes referred to as "birth names" or, in cultures where the given name precedes the family name, "first names."
alternative label: Birth names
alternative label: First names
change note: Version 3.7.0
in scheme: v3
related: https://homosaurus.org/v3/homoit0000264
related: https://homosaurus.org/v3/homoit0000336

Goddess movement
type: Concept
issued: 2019-05-14
modified: 2025-02-23
replaces: goddessMovementLesbian
comment: A spiritual movement that emerged in North America, Western Europe, Australia, and New Zealand in 1970s in response to male-dominated organized religion; involves worshiping the Goddess (or several goddesses), as well as a focus on women, femininity, and feminism; often associated with lesbian communities.
alternative label: Goddess movement (Lesbians)
alternative label: Goddess religion
change note: Version 3.7.0
in scheme: v3
related: https://homosaurus.org/v3/homoit0001069
related: https://homosaurus.org/v3/homoit0001907
related: https://homosaurus.org/v3/homoit0001908
related: https://homosaurus.org/v3/homoit0001909
related: https://homosaurus.org/v3/homoit0001910
related: https://homosaurus.org/v3/homoit0001911
related: https://homosaurus.org/v3/homoit0001912
related: https://homosaurus.org/v3/homoit0001913

Happy endings
type: Concept
issued: 2019-05-14
modified: 2025-02-23
replaces: happyEndings
comment: Term used in the context of sex work to describe a massage that ends with the masseuse giving the client an orgasm.
change note: Version 3.7.0
in scheme: v3
related: https://homosaurus.org/v3/homoit0000323
related: https://homosaurus.org/v3/homoit0000402
related: https://homosaurus.org/v3/homoit0000589
related: https://homosaurus.org/v3/homoit0000683
related: https://homosaurus.org/v3/homoit0001062
related: https://homosaurus.org/v3/homoit0001284
related: https://homosaurus.org/v3/homoit0001288

Heterosexism
type: Concept
issued: 2019-05-14
modified: 2025-02-23
replaces: heterosexism
comment: Discrimination, prejudice, or bias against non-heterosexual people based on the assumption or belief that heterosexuality is the only normal or natural expression of sexual identity.
alternative label: Heterocentrism
change note: Version 3.7.0
in scheme: v3
related: https://homosaurus.org/v3/homoit0000117
related: https://homosaurus.org/v3/homoit0000411
related: https://homosaurus.org/v3/homoit0000620
related: https://homosaurus.org/v3/homoit0000631
related: https://homosaurus.org/v3/homoit0000646
related: https://homosaurus.org/v3/homoit0000666
related: https://homosaurus.org/v3/homoit0000803
related: https://homosaurus.org/v3/homoit0001229
related: https://homosaurus.org/v3/homoit0001278
related: https://homosaurus.org/v3/homoit0001467

HIV tests
type: Concept
issued: 2019-05-14
modified: 2025-02-23
replaces: HIVTests
comment: Medical tests used to determine the presence of HIV antibodies or antigens in an individual's blood, saliva, or urine.
change note: Version 3.7.0
in scheme: v3
related: https://homosaurus.org/v3/homoit0000005

HIV-negative people
type: Concept
issued: 2019-05-14
modified: 2025-02-23
replaces: HIV-negativePeople
comment: Individuals who have not contracted HIV.
alternative label: HIV-seronegative people
change note: Version 3.7.0
in scheme: v3
related: https://homosaurus.org/v3/homoit0000005
related: https://homosaurus.org/v3/homoit0000636
related: https://homosaurus.org/v3/homoit0000638
related: https://homosaurus.org/v3/homoit0000639
related: https://homosaurus.org/v3/homoit0000640

Seroconversion
type: Concept
issued: 2019-05-14
modified: 2025-02-23
replaces: seroconversion
comment: Term used to describe the period of time between exposure to a virus and when antibodies for the virus are detectable; often used in reference to HIV testing when a test changes from HIV negative to HIV positive.
alternative label: HIV-seroconversion
change note: Version 3.7.0
in scheme: v3
related: https://homosaurus.org/v3/homoit0000005

Serodiscordant couples
type: Concept
issued: 2019-05-14
modified: 2025-02-23
replaces: serodiscordantCouples
comment: Partnerships in which one person has HIV and the other does not.
alternative label: HIV-serodiscordant couples
change note: Version 3.7.0
in scheme: v3
related: https://homosaurus.org/v3/homoit0000635
related: https://homosaurus.org/v3/homoit0000636

Serostatus
type: Concept
issued: 2019-05-14
modified: 2025-02-23
replaces: serostatus
comment: The presence (seropositivity) or absence (seronegativity) of antibodies in blood serum; commonly used in in reference to HIV testing.
alternative label: HIV-serostatus
change note: Version 3.7.0
in scheme: v3
related: https://homosaurus.org/v3/homoit0000005
related: https://homosaurus.org/v3/homoit0000635
related: https://homosaurus.org/v3/homoit0000636
related: https://homosaurus.org/v3/homoit0000640

LGBTQ+ monuments
type: Concept
is replaced by: homoit0000901
issued: 2019-05-14
modified: 2025-02-23
replaces: homomonuments
comment: Public monuments designed to commemorate LGBTQ+ people who have been persecuted because of their gender and/or sexual identities.
alternative label: Homomonuments
alternative label: Monuments (LGBTQ)
change note: Version 3.7.0
in scheme: v3

Homonationalism
type: Concept
issued: 2019-05-14
modified: 2025-02-23
replaces: homonationalism
comment: Favorable association between a nationalist ideology and LGBTQ+ people or their rights.
change note: Version 3.7.0
in scheme: v3
related: https://homosaurus.org/v3/homoit0000112
related: https://homosaurus.org/v3/homoit0001117
related: https://homosaurus.org/v3/homoit0001323

Homosociality
type: Concept
issued: 2019-05-14
modified: 2025-02-23
replaces: homosociality
comment: A concept used to describe the social bonds that exist between members of the same sex or gender in a given culture.
alternative label: Homosocial bonds
change note: Version 3.7.0
in scheme: v3
narrower: https://homosaurus.org/v3/homoit0000221
narrower: https://homosaurus.org/v3/homoit0000429
narrower: https://homosaurus.org/v3/homoit0000591
narrower: https://homosaurus.org/v3/homoit0000982
related: https://homosaurus.org/v3/homoit0000455
related: https://homosaurus.org/v3/homoit0000628
related: https://homosaurus.org/v3/homoit0000981

Sexual sterilization
type: Concept
issued: 2019-05-14
modified: 2025-02-23
replaces: sexualSterilisation
comment: Refers to any type of medical treatment that intentionally leaves an individual sterile or unable to reproduce. This term encompasses both voluntary and involuntary sterilization.
change note: Version 3.7.0
in scheme: v3
preferred label: Sexual sterilisation
related: https://homosaurus.org/v3/homoit0000430

Online dating
type: Concept
issued: 2019-05-14
modified: 2025-02-23
replaces: onlineDating
comment: Utilizing online websites, applications, or forums to meet romantic or sexual partners.
alternative label: Internet dating
change note: Version 3.7.0
in scheme: v3
related: https://homosaurus.org/v3/homoit0000328
related: https://homosaurus.org/v3/homoit0000329

Intersectionality
type: Concept
issued: 2019-05-14
modified: 2025-02-23
replaces: intersectionality
comment: A theoretical framework first conceptualized by Kimberlé Crenshaw to describe how different facets of social identity (such as gender, race, ethnicity, disability, socioeconomic class, religion, and sexual identity) overlap and intersect, often compounding the individual's experiences with inequality and discrimination.
change note: Version 3.7.0
in scheme: v3
related: https://homosaurus.org/v3/homoit0000358
related: https://homosaurus.org/v3/homoit0000860
related: https://homosaurus.org/v3/homoit0001133
related: https://homosaurus.org/v3/homoit0002270
related: https://homosaurus.org/v3/homoit0002271
related: https://homosaurus.org/v3/homoit0002272
related: https://homosaurus.org/v3/homoit0002274

Intersex identity
type: Concept
issued: 2019-05-14
modified: 2025-02-23
replaces: intersexIdentity
comment: Used to describe the experience of selfhood of intersex people. Intersex identity is not gender identity, sexual identity, nor sexual orientation. For the subject of intersex variations, use "intersex variations" or "intersex". For the subject of intersex people, use "intersex people". Do not use in place of gender-identity-related terms such as non-binary identity or genderfluid identity.
change note: Version 3.7.0
in scheme: v3
related: https://homosaurus.org/v3/homoit0000352
related: https://homosaurus.org/v3/homoit0000618

Kaposi's sarcoma
type: Concept
issued: 2019-05-14
modified: 2025-02-23
replaces: kaposisSarcoma
comment: A type of cancer that causes lesions to grow in the skin, lymph nodes, internal organs, and mucous membranes; often affects people with immune deficiencies, such as AIDS.
change note: Version 3.7.0
in scheme: v3
related: https://homosaurus.org/v3/homoit0000005
related: https://homosaurus.org/v3/homoit0000033
related: https://homosaurus.org/v3/homoit0001980

Latent homosexuality
type: Concept
issued: 2019-05-14
modified: 2025-02-23
replaces: latentHomosexuality
comment: Term coined by Sigmund Freud to describe erotic attraction towards members of the same sex or gender that is not (and may never be) consciously experienced or expressed openly.
change note: Version 3.7.0
in scheme: v3
related: https://homosaurus.org/v3/homoit0000345
related: https://homosaurus.org/v3/homoit0000391

Lavender Scare
type: Concept
issued: 2019-05-14
modified: 2025-02-23
replaces: lavenderScare
comment: Term used to describe the mid-20th century purge of lesbians and gay men in the U.S. government as a result of moral panic incited by Joseph McCarthy and others.
change note: Version 3.7.0
in scheme: v3
related: https://homosaurus.org/v3/homoit0000356
related: https://homosaurus.org/v3/homoit0001108

Lesbian sensibility
type: Concept
issued: 2019-05-14
modified: 2025-02-23
replaces: lesbianSensibility
comment: A way of reading and looking at cultural texts (books, movies, television, magazines, etc.) through a lesbian lens, often including the appropriation of texts otherwise thought of as heterosexual.
change note: Version 3.7.0
in scheme: v3
related: https://homosaurus.org/v3/homoit0000533

Lesbian theater groups
type: Concept
issued: 2019-05-14
modified: 2025-02-23
replaces: lesbianTheatreGroups
comment: Groups of theatrical performers comprised of lesbians; may focus on performing works by lesbians or about lesbian issues.
change note: Version 3.7.0
in scheme: v3
preferred label: Lesbian theatre groups
related: https://homosaurus.org/v3/homoit0000547
related: https://homosaurus.org/v3/homoit0000788
related: https://homosaurus.org/v3/homoit0001031

LGBTQ+ death notices
type: Concept
issued: 2019-05-14
modified: 2025-02-23
replaces: LGBTQDeathNotices
comment: Public announcements in periodicals, online information centers, or social media about the death of an LGBTQ+ person, typically including details about funerals and memorial services.
alternative label: LGBTQ death announcements
alternative label: LGBTQ death notices
change note: Version 3.7.0
in scheme: v3
related: https://homosaurus.org/v3/homoit0000848
related: https://homosaurus.org/v3/homoit0000911
related: https://homosaurus.org/v3/homoit0002258

LGBTQ+ friendliness
type: Concept
issued: 2019-05-14
modified: 2025-02-23
replaces: LGBTQFriendliness
comment: Places, policies, people, or institutions that are open and welcoming to LGBTQ+ people.
alternative label: LGBTQ friendliness
change note: Version 3.7.0
in scheme: v3
related: https://homosaurus.org/v3/homoit0000038
related: https://homosaurus.org/v3/homoit0000538
related: https://homosaurus.org/v3/homoit0001117
related: https://homosaurus.org/v3/homoit0003693

LGBTQIA
type: Concept
issued: 2019-05-14
modified: 2025-02-23
replaces: LGBTQIA
comment: Acronym used to describe describe lesbians, gay people, bisexuals, transgender people, queer people, intersex people, and asexual people as a group.
change note: Version 3.7.0
in scheme: v3
narrower: https://homosaurus.org/v3/homoit0000804
narrower: https://homosaurus.org/v3/homoit0000806
related: https://homosaurus.org/v3/homoit0000004
related: https://homosaurus.org/v3/homoit0000143
related: https://homosaurus.org/v3/homoit0000485
related: https://homosaurus.org/v3/homoit0000672
related: https://homosaurus.org/v3/homoit0000733
related: https://homosaurus.org/v3/homoit0001170
related: https://homosaurus.org/v3/homoit0001403

LGBTQ+ intimacy
type: Concept
issued: 2019-05-14
modified: 2025-02-23
replaces: LGBTQIntimacy
comment: Feelings of close familiarity or connection between two or more LGBTQ+ people that can be romantic, sexual, or platonic in nature. Can be used to describe the particularities of intimacy as experienced by LGBTQ+ people, as well as the ways intimacy is discussed and expressed within LGBTQ+ communities.
alternative label: LGBTQ intimacy
change note: Version 3.7.0
in scheme: v3

LGBTQ+ literary salons
type: Concept
issued: 2019-05-14
modified: 2025-02-23
replaces: LGBTQLiterarySalons
comment: Social gatherings, typically hosted by a notable public figure, for discussing literature or other shared topics; use in reference to literary salons with primarily LGBTQ+ membership or literary salons focused on works featuring LGBTQ+ characters and themes.
alternative label: LGBTQ literary salons
change note: Version 3.7.0
in scheme: v3
related: https://homosaurus.org/v3/homoit0000909
related: https://homosaurus.org/v3/homoit0000972

LGBTQ+ marketing
type: Concept
issued: 2019-05-14
modified: 2025-02-23
replaces: LGBTQMarketing
comment: Marketing strategies and campaigns specifically targeting LGBTQ+ people.
alternative label: LGBTQ marketing
change note: Version 3.7.0
in scheme: v3
related: https://homosaurus.org/v3/homoit0001117
related: https://homosaurus.org/v3/homoit0002191

LGBTQ+ plays
type: Concept
issued: 2019-05-14
modified: 2025-02-23
replaces: LGBTQPlays
comment: Works of drama consisting primarily of dialogue between characters and intended for theatrical performance; use in reference to plays focusing on LGBTQ+ characters or themes.
alternative label: LGBTQ stage performances
alternative label: LGBTQ plays
change note: Version 3.7.0
in scheme: v3
related: https://homosaurus.org/v3/homoit0000376
related: https://homosaurus.org/v3/homoit0000546
related: https://homosaurus.org/v3/homoit0000788
related: https://homosaurus.org/v3/homoit0000816

LGBTQ+ pubs
type: Concept
issued: 2019-05-14
modified: 2025-02-23
replaces: LGBTQPubs
comment: A drinking establishment that serves food and acts as a community gathering place; use in reference to pubs that primarily cater to LGBTQ+ people.
alternative label: LGBTQ public houses
alternative label: LGBTQ pubs
change note: Version 3.7.0
in scheme: v3
related: https://homosaurus.org/v3/homoit0000100
related: https://homosaurus.org/v3/homoit0000369
related: https://homosaurus.org/v3/homoit0000474
related: https://homosaurus.org/v3/homoit0000724

LGBTQ+ restaurants
type: Concept
issued: 2019-05-14
modified: 2025-02-23
replaces: LGBTQRestaurants
comment: Commercial establishments that prepare and serve food and drinks; use in reference to restaurants that cater primarily to LGBTQ+ people or are known to be frequented by LGBTQ+ people.
alternative label: LGBTQ restaurants
change note: Version 3.7.0
in scheme: v3
related: https://homosaurus.org/v3/homoit0000909
related: https://homosaurus.org/v3/homoit0000956

LGBTQ+ retirement homes
type: Concept
issued: 2019-05-14
modified: 2025-02-23
replaces: LGBTQRetirementHomes
comment: Multi-residence facilities that provide assisted living services to elderly people; use in reference to retirement homes that primarily cater to LGBTQ+ people.
alternative label: LGBTQ retirement homes
change note: Version 3.7.0
in scheme: v3
related: https://homosaurus.org/v3/homoit0000393

Schools for LGBTQ+ youth
type: Concept
issued: 2019-05-14
modified: 2025-02-23
replaces: schoolsForLGBTQYouth
comment: Educational institutions providing instruction and resources specifically for LGBTQ+ youth.
alternative label: LGBTQ schools
alternative label: Schools for LGBTQ youth
change note: Version 3.7.0
in scheme: v3
related: https://homosaurus.org/v3/homoit0001521

LGBTQ+ self-repression
type: Concept
issued: 2019-05-14
modified: 2025-02-23
replaces: LGBTQSelfRepression
comment: Restraint or denial of one’s own thoughts, wishes, feelings or identity, as experienced by LGBTQ+ people.
alternative label: LGBTQ self-repression
change note: Version 3.7.0
in scheme: v3
related: https://homosaurus.org/v3/homoit0000345
related: https://homosaurus.org/v3/homoit0000391
related: https://homosaurus.org/v3/homoit0002590

LGBTQ+ social media
type: Concept
issued: 2019-05-14
modified: 2025-02-23
replaces: LGBTQSocialMedia
comment: Web-based and mobile technologies that facilitate interactive dialogue, as used by or designed for LGBTQ+ people.
alternative label: LGBTQ social media
change note: Version 3.7.0
in scheme: v3
narrower: https://homosaurus.org/v3/homoit0000823
narrower: https://homosaurus.org/v3/homoit0000832
narrower: https://homosaurus.org/v3/homoit0000846
narrower: https://homosaurus.org/v3/homoit0000888
related: https://homosaurus.org/v3/homoit0000900
related: https://homosaurus.org/v3/homoit0000962
related: https://homosaurus.org/v3/homoit0001321
related: https://homosaurus.org/v3/homoit0001983

LGBTQ+ spiritual people
type: Concept
issued: 2019-05-14
modified: 2025-02-23
replaces: LGBTQSpirituality
comment: LGBTQ+ people who hold spiritual beliefs or engage in spiritual practices, typically involving an understanding of something greater than human existence, whether divine or cosmic in nature.
alternative label: LGBTQ+ spirituality
change note: Version 3.7.0
in scheme: v3
related: https://homosaurus.org/v3/homoit0000415
related: https://homosaurus.org/v3/homoit0000928
related: https://homosaurus.org/v3/homoit0001218

LGBTQ+ weddings
type: Concept
issued: 2019-05-14
modified: 2025-02-23
replaces: LGBTQWeddings
comment: Marriage ceremonies and the accompanying festivities; use to describe weddings in which both partners are LGBTQ+.
alternative label: LGBTQ weddings
alternative label: Weddings (LGBTQ)
change note: Version 3.7.0
in scheme: v3
related: https://homosaurus.org/v3/homoit0000360
related: https://homosaurus.org/v3/homoit0000990

Libido
type: Concept
issued: 2019-05-14
modified: 2025-02-23
replaces: libido
comment: A person's overall sexual drive or desire for sexual activity.
alternative label: Sex drive
change note: Version 3.7.0
in scheme: v3
related: https://homosaurus.org/v3/homoit0001267
related: https://homosaurus.org/v3/homoit0001284
related: https://homosaurus.org/v3/homoit0001292
related: https://homosaurus.org/v3/homoit0001306

Male bonding
type: Concept
issued: 2019-05-14
modified: 2025-02-23
replaces: maleBonding
comment: Friendship and connection between two or more male-identified people.
change note: Version 3.7.0
in scheme: v3
related: https://homosaurus.org/v3/homoit0000649
related: https://homosaurus.org/v3/homoit0000982

Motherhood
type: Concept
issued: 2019-05-14
modified: 2025-02-23
replaces: motherhood
comment: The state, condition, or fact of being a mother.
alternative label: Maternity
change note: Version 3.7.0
in scheme: v3
related: https://homosaurus.org/v3/homoit0000116
related: https://homosaurus.org/v3/homoit0000811
related: https://homosaurus.org/v3/homoit0000864
related: https://homosaurus.org/v3/homoit0000871
related: https://homosaurus.org/v3/homoit0000905
related: https://homosaurus.org/v3/homoit0000914
related: https://homosaurus.org/v3/homoit0001021

Misandry
type: Concept
issued: 2019-05-14
modified: 2025-02-23
replaces: misandry
comment: Hate or dislike of men or boys.
change note: Version 3.7.0
in scheme: v3
related: https://homosaurus.org/v3/homoit0000112

Misgendering
type: Concept
issued: 2019-05-14
modified: 2025-02-23
replaces: misgendering
comment: The act of referring to a person's gender incorrectly, often by using pronouns they do not identify with.
change note: Version 3.7.0
in scheme: v3
related: https://homosaurus.org/v3/homoit0000336
related: https://homosaurus.org/v3/homoit0000571
related: https://homosaurus.org/v3/homoit0001135
related: https://homosaurus.org/v3/homoit0002259

Nudism
type: Concept
issued: 2019-05-14
modified: 2025-02-23
replaces: nudism
comment: Practice of engaging in social activities while nude, either in private or public. This term also refers to the cultural movement advocating for nudism as an alternative, healthy lifestyle.
alternative label: Naturism
change note: Version 3.7.0
in scheme: v3
related: https://homosaurus.org/v3/homoit0001050

Single parent families
type: Concept
issued: 2019-05-14
modified: 2025-02-23
replaces: singleParentFamilies
comment: Families headed by a single parent. For single parent families headed by or including LGBTQ+ people, use the term "LGBTQ+ single parent families."
alternative label: One-parent families
change note: Version 3.7.0
in scheme: v3
related: https://homosaurus.org/v3/homoit0000943

Partner notification
type: Concept
issued: 2019-05-14
modified: 2025-02-23
replaces: partnerNotification
comment: The practice of notifying the sexual partners of a person who has been newly diagnosed with a sexually transmitted infection to inform them that they have been exposed to the infection.
change note: Version 3.7.0
in scheme: v3
related: https://homosaurus.org/v3/homoit0001302
related: https://homosaurus.org/v3/homoit0001308
related: https://homosaurus.org/v3/homoit0001311
related: https://homosaurus.org/v3/homoit0002365

Passing (Gender)
type: Concept
issued: 2019-05-14
modified: 2025-02-23
replaces: passingGender
comment: An individual's ability to "pass," or be accepted or regarded as a member of the gender they identify with. "Passing" has historically been used to describe an individual's ability to "pass" as a certain race or ethnicity, though the term was later appropriated by the LGBTQ+ community.
change note: Version 3.7.0
in scheme: v3
related: https://homosaurus.org/v3/homoit0000288
related: https://homosaurus.org/v3/homoit0000316
related: https://homosaurus.org/v3/homoit0000560
related: https://homosaurus.org/v3/homoit0001140
related: https://homosaurus.org/v3/homoit0001233
related: https://homosaurus.org/v3/homoit0001378
related: https://homosaurus.org/v3/homoit0001781
related: https://homosaurus.org/v3/homoit0001901

Fatherhood
type: Concept
issued: 2019-05-14
modified: 2025-02-23
replaces: fatherhood
comment: The experience of acting as a father, including the responsibilities involved in fathering and raising children.
alternative label: Paternity
change note: Version 3.7.0
in scheme: v3
related: https://homosaurus.org/v3/homoit0000116
related: https://homosaurus.org/v3/homoit0000423
related: https://homosaurus.org/v3/homoit0000811
related: https://homosaurus.org/v3/homoit0000864
related: https://homosaurus.org/v3/homoit0000871
related: https://homosaurus.org/v3/homoit0000914

Penile plethysmography
type: Concept
issued: 2019-05-14
modified: 2025-02-23
replaces: penilePlethysmography
comment: Assessments of penile tumescence in response to erotic stimuli in order to test an individual's sexual preference or excitement.
alternative label: Penile response measurement
alternative label: Phallometry
change note: Version 3.7.0
in scheme: v3
related: https://homosaurus.org/v3/homoit0001099

Physical affection
type: Concept
issued: 2019-05-14
modified: 2025-02-23
replaces: physicalAffection
comment: Touch between two or more people intended to arouse or convey feelings of closeness; can be used to express sexual or non-sexual intimacy and includes actions such as kissing, cuddling, embracing, and holding hands.
change note: Version 3.7.0
in scheme: v3
narrower: https://homosaurus.org/v3/homoit0000691
related: https://homosaurus.org/v3/homoit0000404
related: https://homosaurus.org/v3/homoit0000998
related: https://homosaurus.org/v3/homoit0001806

Pinkwashing
type: Concept
issued: 2019-05-14
modified: 2025-02-23
replaces: pinkwashing
comment: A variety of marketing and political strategies aimed at promoting products, countries, people, or entities to LGBTQ+ people; using LGBTQ+-related symbols in order to be perceived as progressive, modern, and tolerant; and/or utilizing concern for LGBTQ+ people and rights to justify or deviate attention from settler-colonialism, genocide, invasion, and intervention in other countries.
change note: Version 3.7.0
in scheme: v3
related: https://homosaurus.org/v3/homoit0000643
related: https://homosaurus.org/v3/homoit0000873
related: https://homosaurus.org/v3/homoit0000899

Police
type: Concept
issued: 2019-05-14
modified: 2025-02-23
replaces: police
comment: A civil force empowered by the state to enforce the law and maintain public order.
alternative label: Cops
change note: Version 3.7.0
in scheme: v3
related: https://homosaurus.org/v3/homoit0001120
related: https://homosaurus.org/v3/homoit0001122
related: https://homosaurus.org/v3/homoit0002390
related: https://homosaurus.org/v3/homoit0002391
related: https://homosaurus.org/v3/homoit0002397

Social privilege
type: Concept
issued: 2019-05-14
modified: 2025-02-23
replaces: socialPrivilege
comment: Special rights or immunities granted to specific people or groups that are used to falsely homogenize or discriminate against other people or groups.
change note: Version 3.7.0
in scheme: v3
related: https://homosaurus.org/v3/homoit0000054
related: https://homosaurus.org/v3/homoit0000243
related: https://homosaurus.org/v3/homoit0000302
related: https://homosaurus.org/v3/homoit0000381
related: https://homosaurus.org/v3/homoit0000416
related: https://homosaurus.org/v3/homoit0000417
related: https://homosaurus.org/v3/homoit0000598
related: https://homosaurus.org/v3/homoit0000622
related: https://homosaurus.org/v3/homoit0000667
related: https://homosaurus.org/v3/homoit0000675
related: https://homosaurus.org/v3/homoit0000860
related: https://homosaurus.org/v3/homoit0000999
related: https://homosaurus.org/v3/homoit0001017
related: https://homosaurus.org/v3/homoit0001018
related: https://homosaurus.org/v3/homoit0001230
related: https://homosaurus.org/v3/homoit0001376
related: https://homosaurus.org/v3/homoit0001377
related: https://homosaurus.org/v3/homoit0002271

Queer studies
type: Concept
issued: 2019-05-14
modified: 2025-02-23
replaces: queerStudies
comment: Academic field of research and study about queer people, queer identity, and queer communities.
change note: Version 3.7.0
in scheme: v3
related: https://homosaurus.org/v3/homoit0000187
related: https://homosaurus.org/v3/homoit0000539
related: https://homosaurus.org/v3/homoit0000579
related: https://homosaurus.org/v3/homoit0000781
related: https://homosaurus.org/v3/homoit0001219
related: https://homosaurus.org/v3/homoit0001447
related: https://homosaurus.org/v3/homoit0002039
related: https://homosaurus.org/v3/homoit0002725
related: https://homosaurus.org/v3/homoit0002849
related: https://homosaurus.org/v3/homoit0002934

Queer theology
type: Concept
issued: 2019-05-14
modified: 2025-02-23
replaces: queerTheology
comment: A theological method that developed out of queer theory. Queer theology, which encompasses the previously commonly used terms gay theology and lesbian theology, can variously be understood as (1) theology done by, with, and for LGBTQ+ people according to their needs; (2) theology that purposefully opposes social and cultural norms surrounding gender and sexuality; and (3) theology that broadly challenges and deconstructs harmful historical boundaries.
alternative label: Gay theology
alternative label: LGBTQ+ theology
alternative label: Lesbian theology
change note: Version 3.7.0
in scheme: v3
related: https://homosaurus.org/v3/homoit0000928
related: https://homosaurus.org/v3/homoit0000948
related: https://homosaurus.org/v3/homoit0001219

Reading (Gender)
type: Concept
issued: 2019-05-14
modified: 2025-02-23
replaces: readingTransgender
comment: Slang term for the act of identifying (or reading) someone in public as trans, non-binary, crossdressing, or in drag. Unlike Clocking (Gender), which is typically understood as a threat (of violence or outing) against the person being clocked or read, Reading (Gender) refers to shared identification or recognized kinship between two individuals who are both gender minorities.
alternative label: Reading (Transgender)
change note: Version 3.7.0
in scheme: v3
related: https://homosaurus.org/v3/homoit0000318
related: https://homosaurus.org/v3/homoit0001090
related: https://homosaurus.org/v3/homoit0001378
related: https://homosaurus.org/v3/homoit0001900
related: https://homosaurus.org/v3/homoit0002192

Secrecy
type: Concept
issued: 2019-05-14
modified: 2025-02-23
replaces: secrecy
comment: The state of being intentionally withheld, concealed, or kept secret; use in reference to LGBTQ+ individuals who conceal their (or others’) identities, whether out of preference or for safety reasons.
change note: Version 3.7.0
in scheme: v3
related: https://homosaurus.org/v3/homoit0000285
related: https://homosaurus.org/v3/homoit0000286
related: https://homosaurus.org/v3/homoit0000287
related: https://homosaurus.org/v3/homoit0000288
related: https://homosaurus.org/v3/homoit0000295
related: https://homosaurus.org/v3/homoit0000365
related: https://homosaurus.org/v3/homoit0001065
related: https://homosaurus.org/v3/homoit0001783
related: https://homosaurus.org/v3/homoit0001784
related: https://homosaurus.org/v3/homoit0001785
related: https://homosaurus.org/v3/homoit0001786
related: https://homosaurus.org/v3/homoit0001787
related: https://homosaurus.org/v3/homoit0001788
related: https://homosaurus.org/v3/homoit0002905

Seduction
type: Concept
issued: 2019-05-14
modified: 2025-02-23
replaces: seduction
comment: Enticing or tempting someone into something, typically sexual attraction or activity, through the use of persuasion, flattery, and/or promises.
alternative label: Temptation
change note: Version 3.7.0
in scheme: v3
related: https://homosaurus.org/v3/homoit0001306

Sex scandals
type: Concept
issued: 2019-05-14
modified: 2025-02-23
replaces: sexScandals
comment: Public scandals surrounding sensational cases of sexual indecency or sex crimes.
alternative label: Sexual scandals
change note: Version 3.7.0
in scheme: v3
related: https://homosaurus.org/v3/homoit0000947

Sexism
type: Concept
issued: 2019-05-14
modified: 2025-02-23
replaces: sexism
comment: Discrimination, prejudice, or bias directed against a particular sex or gender based on the assumption that this sex or gender is intrinsically inferior to another.
change note: Version 3.7.0
in scheme: v3
related: https://homosaurus.org/v3/homoit0000565
related: https://homosaurus.org/v3/homoit0000619
related: https://homosaurus.org/v3/homoit0001293
related: https://homosaurus.org/v3/homoit0002183
related: https://homosaurus.org/v3/homoit0002259
related: https://homosaurus.org/v3/homoit0003519

Sexologists
type: Concept
issued: 2019-05-14
modified: 2025-02-23
replaces: sexologists
comment: People who professionally study sexology, or human sexual behavior and sexual relationships.
change note: Version 3.7.0
in scheme: v3
related: https://homosaurus.org/v3/homoit0001280

Sexology
type: Concept
issued: 2019-05-14
modified: 2025-02-23
replaces: sexology
comment: Scientific study of human sexuality including sexual interests, behaviors, and functions that utilizes tools from other academic fields like anthropology, biology, medicine, and psychology.
change note: Version 3.7.0
in scheme: v3
related: https://homosaurus.org/v3/homoit0001279
related: https://homosaurus.org/v3/homoit0001306

Sexual autonomy
type: Concept
issued: 2019-05-14
modified: 2025-02-23
replaces: sexualAutonomy
comment: One’s ability or prerogative to freely choose when, with whom, and under what circumstances they engage in sexual activity or relationships.
change note: Version 3.7.0
in scheme: v3
related: https://homosaurus.org/v3/homoit0001300
related: https://homosaurus.org/v3/homoit0001306

Sexual behavior change
type: Concept
issued: 2019-05-14
modified: 2025-02-23
replaces: sexualBehaviourChange
comment: Term used to describe changes in behavior related to safer sexual practices (e.g., condom use, STI testing).
change note: Version 3.7.0
in scheme: v3
preferred label: Sexual behaviour change
related: https://homosaurus.org/v3/homoit0001239
related: https://homosaurus.org/v3/homoit0001251
related: https://homosaurus.org/v3/homoit0001300

Sexual climax
type: Concept
issued: 2019-05-14
modified: 2025-02-23
replaces: sexualClimax
comment: The most intense or highest point of pleasure in sexual activities; the peak of an orgasm.
change note: Version 3.7.0
in scheme: v3
related: https://homosaurus.org/v3/homoit0000323
related: https://homosaurus.org/v3/homoit0000589
related: https://homosaurus.org/v3/homoit0000610
related: https://homosaurus.org/v3/homoit0000683
related: https://homosaurus.org/v3/homoit0001062
related: https://homosaurus.org/v3/homoit0001284

Sexual health
type: Concept
issued: 2019-05-14
modified: 2025-02-23
replaces: sexualHealth
comment: State of physical, emotional, mental, and social well being in relation to sexuality. This includes one’s ability to have responsible, satisfying, and safer sex free of violence or coercion.
change note: Version 3.7.0
in scheme: v3
related: https://homosaurus.org/v3/homoit0000027
related: https://homosaurus.org/v3/homoit0001291
related: https://homosaurus.org/v3/homoit0001292

Sexual reform
type: Concept
issued: 2019-05-14
modified: 2025-02-23
replaces: sexualReform
comment: Term used to describe the European movements for sexual reform in the 20th century.
change note: Version 3.7.0
in scheme: v3
related: https://homosaurus.org/v3/homoit0000947
related: https://homosaurus.org/v3/homoit0001306

Sexual revolution
type: Concept
issued: 2019-05-14
modified: 2025-02-23
replaces: sexualRevolution
comment: Social perspective from the 1960s into the 1970s that challenged traditional codes of behavior related to sexuality and interpersonal relationships throughout the Western world.
change note: Version 3.7.0
in scheme: v3
related: https://homosaurus.org/v3/homoit0000947

Significant others
type: Concept
issued: 2019-05-14
modified: 2025-02-23
replaces: significantOthers
comment: An individual's partner or partners in an established, ongoing romantic or sexual relationship.
change note: Version 3.7.0
in scheme: v3
related: https://homosaurus.org/v3/homoit0000362
related: https://homosaurus.org/v3/homoit0000675
related: https://homosaurus.org/v3/homoit0000855
related: https://homosaurus.org/v3/homoit0000895
related: https://homosaurus.org/v3/homoit0001080
related: https://homosaurus.org/v3/homoit0001081
related: https://homosaurus.org/v3/homoit0001082
related: https://homosaurus.org/v3/homoit0001237
related: https://homosaurus.org/v3/homoit0001300
related: https://homosaurus.org/v3/homoit0002365

Situational sexual behavior
type: Concept
issued: 2019-05-14
modified: 2025-02-23
replaces: situationalSexualBehaviour
comment: Sexual behaviors that depart from an individual's typical behaviors or preferences as a result of social pressures that permit, encourage, or compel certain behaviors.
alternative label: Situational homosexuality
change note: Version 3.7.0
in scheme: v3
preferred label: Situational sexual behaviour
related: https://homosaurus.org/v3/homoit0001267
related: https://homosaurus.org/v3/homoit0001299
related: https://homosaurus.org/v3/homoit0001300
related: https://homosaurus.org/v3/homoit0001306
related: https://homosaurus.org/v3/homoit0003738

Solo sex
type: Concept
issued: 2019-05-14
modified: 2025-02-23
replaces: soloSex
comment: Sexual acts involving only one person, such as masturbation, as opposed to sex with a partner.
change note: Version 3.7.0
in scheme: v3
related: https://homosaurus.org/v3/homoit0001000

Survivors of anti-LGBTQ+ violence
type: Concept
issued: 2019-05-14
modified: 2025-02-23
replaces: survivorsOfAntiLGBTQViolence
comment: People who have experienced and survived anti-LGBTQ+ violence; follow individuals’ preference for “victims” or “survivors” whenever possible.
alternative label: Survivors of anti-LGBTQ violence
change note: Version 3.7.0
in scheme: v3
related: https://homosaurus.org/v3/homoit0000059

Transsexuality
type: Concept
issued: 2019-05-14
modified: 2025-02-23
replaces: transsexuality
comment: Term used to describe the identity of people who transition from female to male or male to female. Generally refers to individuals who transition their physical bodies to align with their gender identities. Though this term was popular in the 20th century and is still in use today, it has been largely replaced by "transgender identity" and "trans identity." Some but not all people regard this term as outdated and offensive. Only use to describe people who self-identify as transsexual.
alternative label: Transexuality
change note: Version 3.7.0
in scheme: v3
related: https://homosaurus.org/v3/homoit0001381
related: https://homosaurus.org/v3/homoit0001468

Uncut men
type: Concept
issued: 2019-05-14
modified: 2025-02-23
replaces: uncutMen
comment: Men whose penises are uncircumcised (i.e., the foreskin of the penis has not been surgically removed).
alternative label: Uncircumcised men
change note: Version 3.7.0
in scheme: v3
related: https://homosaurus.org/v3/homoit0000269

Vaginal dilation
type: Concept
issued: 2019-05-14
modified: 2025-02-23
replaces: vaginalDilation
comment: The process of gently and incrementally stretching the vagina using vaginal dilators.
change note: Version 3.7.0
in scheme: v3

Voguing
type: Concept
issued: 2019-05-14
modified: 2025-02-23
replaces: voguing
comment: A highly stylized form of dance originating in the Harlem ballroom scene in the 1980s and 1990s.
alternative label: Vogueing
change note: Version 3.7.0
in scheme: v3
related: https://homosaurus.org/v3/homoit0000092
related: https://homosaurus.org/v3/homoit0000367
related: https://homosaurus.org/v3/homoit0000368

Wimmin
type: Concept
issued: 2019-05-14
modified: 2025-02-23
replaces: wimmin
comment: A way of spelling "women" that is used in certain feminist circles. First used by George P. Krapp (1872-1934) and then appeared in 19th century Black American English renderings before being used by feminists in the 20th century.
change note: Version 3.7.0
in scheme: v3
related: https://homosaurus.org/v3/homoit0000437
related: https://homosaurus.org/v3/homoit0001509
related: https://homosaurus.org/v3/homoit0001516

Womyn
type: Concept
issued: 2019-05-14
modified: 2025-02-23
replaces: womyn
comment: A spelling of "woman" or "women" that first appeared in print in 1976 and is used in certain feminist circles to avoid having the suffix of "men." Some contemporary transgender activists have criticized use of the word "womyn" due to its prevalence in trans-exclusionary radical feminist (TERF) circles following the exclusion of trans women from the Michigan Womyn’s Music Festival.
change note: Version 3.7.0
in scheme: v3
related: https://homosaurus.org/v3/homoit0000062
related: https://homosaurus.org/v3/homoit0000437
related: https://homosaurus.org/v3/homoit0001230
related: https://homosaurus.org/v3/homoit0001505
related: https://homosaurus.org/v3/homoit0001509
related: https://homosaurus.org/v3/homoit0001515
related: https://homosaurus.org/v3/homoit0001819

Erotomania
type: Concept
issued: 2020-06-02
modified: 2025-02-23
replaces: erotomania
comment: Condition characterized by an individual's persistent and often mistaken belief that another person is infatuated or in love with them. Can also be used to describe a level or frequency of sexual desire perceived as excessive within a given culture. Medical doctors and psychologists have historically diagnosed LGBTQ+ people with erotomania in order to wrongly treat their identities and desires as medical disorders. Should only be used in a historical context or if an individual self-identifies with the term.
alternative label: Clinical erotomania
alternative label: De Clérambault syndrome
alternative label: De Clérambault's syndrome
alternative label: Obsessional erotomania
alternative label: Primary erotomania
change note: Version 3.7.0
in scheme: v3
related: https://homosaurus.org/v3/homoit0000656
related: https://homosaurus.org/v3/homoit0001283

Slurs
type: Concept
issued: 2020-06-03
modified: 2025-02-23
replaces: slurs
comment: Insulting or discriminating remarks, innuendos, or names intended to demoralize a person, typically by disparaging that person's identity or social group. Generally, for a term to be considered a slur, it must be derogatory towards a particular person or group, it must be used to subordinate them within some structure of power relations, and the derogated person or group must be defined by an intrinsic property such as their race, sexual orientation, gender identity, etc. This category includes terms considered slurs at any point in their usage. Therefore, some of these terms may no longer be considered universally derogatory, may be in common usage, or may be selectively reclaimed by certain groups.
change note: Version 3.7.0
in scheme: v3
narrower: https://homosaurus.org/v3/homoit0000023
narrower: https://homosaurus.org/v3/homoit0000037
narrower: https://homosaurus.org/v3/homoit0000090
narrower: https://homosaurus.org/v3/homoit0000091
narrower: https://homosaurus.org/v3/homoit0000096
narrower: https://homosaurus.org/v3/homoit0000098
narrower: https://homosaurus.org/v3/homoit0000101
narrower: https://homosaurus.org/v3/homoit0000246
narrower: https://homosaurus.org/v3/homoit0000384
narrower: https://homosaurus.org/v3/homoit0000418
narrower: https://homosaurus.org/v3/homoit0000695
narrower: https://homosaurus.org/v3/homoit0002230
related: https://homosaurus.org/v3/homoit0000336
related: https://homosaurus.org/v3/homoit0000356
related: https://homosaurus.org/v3/homoit0000611
related: https://homosaurus.org/v3/homoit0001108
related: https://homosaurus.org/v3/homoit0001317
related: https://homosaurus.org/v3/homoit0001559

Stigma
type: Concept
issued: 2020-06-03
modified: 2025-02-23
replaces: stigma
comment: Widespread disapproval of a group of people or set of behaviors based on preconceived ideas.
change note: Version 3.7.0
in scheme: v3
related: https://homosaurus.org/v3/homoit0000112
related: https://homosaurus.org/v3/homoit0000356
related: https://homosaurus.org/v3/homoit0000534

Trans
type: Concept
issued: 2020-06-03
modified: 2025-02-23
replaces: trans
comment: Umbrella term used to describe individuals who "trans" gender regardless of their identification; sometimes used as a way to historicize non-binary identities.
alternative label: Trans*
change note: Version 3.7.0
in scheme: v3
related: https://homosaurus.org/v3/homoit0000571
related: https://homosaurus.org/v3/homoit0001378
related: https://homosaurus.org/v3/homoit0001415
related: https://homosaurus.org/v3/homoit0001463
related: https://homosaurus.org/v3/homoit0001468
related: https://homosaurus.org/v3/homoit0001469

Breast reduction
type: Concept
issued: 2020-12-11
modified: 2025-02-23
replaces: breastReduction
comment: A surgical procedure to decrease breast size. Often undertaken by transgender men or non-binary people as a gender affirming surgery.
alternative label: Reduction mammaplasty
alternative label: Reduction mammoplasty
change note: Version 3.7.0
in scheme: v3
related: https://homosaurus.org/v3/homoit0000222
related: https://homosaurus.org/v3/homoit0001631

Compersion
type: Concept
issued: 2021-06-30
modified: 2025-02-23
replaces: compersion
comment: The positive emotion an individual may experience in regards to their partner's relationship with another partner. Often defined as the opposite of jealousy.
change note: Version 3.7.0
in scheme: v3
related: https://homosaurus.org/v3/homoit0001123
related: https://homosaurus.org/v3/homoit0001651

Compulsory monogamy
type: Concept
issued: 2021-06-30
modified: 2025-02-23
replaces: compulsoryMonogamy
comment: The assumption that all people share a desire for monogamous relationships and that this is a preferential life goal.
change note: Version 3.7.0
in scheme: v3
related: https://homosaurus.org/v3/homoit0001532
related: https://homosaurus.org/v3/homoit0001535
related: https://homosaurus.org/v3/homoit0001636
related: https://homosaurus.org/v3/homoit0001916

Honeymooning
type: Concept
issued: 2021-06-30
modified: 2025-02-23
replaces: honeymooning
comment: A period of time in a relationship characterized by passionate love as well as intense feelings of attraction and ecstasy, sometimes accompanied by idealization of a partner or the shared relationship.
change note: Version 3.7.0
in scheme: v3
related: https://homosaurus.org/v3/homoit0001661

NRE (New Relationship Energy)
type: Concept
issued: 2021-06-30
modified: 2025-02-23
replaces: nre
comment: A strong, almost giddy feeling of excitement and infatuation common in the beginning of a new romantic relationship. Often used in polyamory contexts.
change note: Version 3.7.0
in scheme: v3
related: https://homosaurus.org/v3/homoit0001123
related: https://homosaurus.org/v3/homoit0001655
related: https://homosaurus.org/v3/homoit0001663

Polyfidelity
type: Concept
issued: 2021-06-30
modified: 2025-02-23
replaces: polyfidelity
comment: In polyamory circles, this term refers to the practice of engaging in multiple-partner relationships that are "closed off" to new participants per the agreement of those involved.
change note: Version 3.7.0
in scheme: v3
related: https://homosaurus.org/v3/homoit0001123
related: https://homosaurus.org/v3/homoit0001629

Xenogender people
type: Concept
issued: 2021-06-30
modified: 2025-02-23
replaces: xenogenderPeople
comment: A person who identifies their gender in relation to non-human understandings of gender and relates to animals, plants, or other things.
change note: Version 3.7.0
in scheme: v3
related: https://homosaurus.org/v3/homoit0000571
related: https://homosaurus.org/v3/homoit0001048
related: https://homosaurus.org/v3/homoit0001670

Neopronouns
type: Concept
issued: 2021-07-01
modified: 2025-02-23
replaces: neopronouns
comment: Personal pronouns that are not officially (i.e., in dictionaries, style guides, etc.) recognized by the language that they are used in. Often intended to be gender neutral.
change note: Version 3.7.0
in scheme: v3
narrower: https://homosaurus.org/v3/homoit0001673
narrower: https://homosaurus.org/v3/homoit0001674
narrower: https://homosaurus.org/v3/homoit0001675
narrower: https://homosaurus.org/v3/homoit0001676
narrower: https://homosaurus.org/v3/homoit0001677
narrower: https://homosaurus.org/v3/homoit0001678
narrower: https://homosaurus.org/v3/homoit0001679
narrower: https://homosaurus.org/v3/homoit0001680
narrower: https://homosaurus.org/v3/homoit0001682
narrower: https://homosaurus.org/v3/homoit0001683
narrower: https://homosaurus.org/v3/homoit0001684
narrower: https://homosaurus.org/v3/homoit0001685
narrower: https://homosaurus.org/v3/homoit0001686
narrower: https://homosaurus.org/v3/homoit0001687
narrower: https://homosaurus.org/v3/homoit0001688
narrower: https://homosaurus.org/v3/homoit0001689
narrower: https://homosaurus.org/v3/homoit0001690
narrower: https://homosaurus.org/v3/homoit0001691
narrower: https://homosaurus.org/v3/homoit0001693
narrower: https://homosaurus.org/v3/homoit0001694
narrower: https://homosaurus.org/v3/homoit0001697
narrower: https://homosaurus.org/v3/homoit0001698
narrower: https://homosaurus.org/v3/homoit0001699
narrower: https://homosaurus.org/v3/homoit0001700
narrower: https://homosaurus.org/v3/homoit0001701
narrower: https://homosaurus.org/v3/homoit0001702
narrower: https://homosaurus.org/v3/homoit0001703
narrower: https://homosaurus.org/v3/homoit0001704
narrower: https://homosaurus.org/v3/homoit0001705
narrower: https://homosaurus.org/v3/homoit0001706
narrower: https://homosaurus.org/v3/homoit0001707
narrower: https://homosaurus.org/v3/homoit0001708
narrower: https://homosaurus.org/v3/homoit0001709
narrower: https://homosaurus.org/v3/homoit0001710
narrower: https://homosaurus.org/v3/homoit0001711
narrower: https://homosaurus.org/v3/homoit0001712
narrower: https://homosaurus.org/v3/homoit0001713
narrower: https://homosaurus.org/v3/homoit0001714
narrower: https://homosaurus.org/v3/homoit0001715
narrower: https://homosaurus.org/v3/homoit0001716
related: https://homosaurus.org/v3/homoit0001135

t4t
type: Concept
issued: 2021-12-07
modified: 2025-02-23
comment: Abbreviated form of the phrase "trans for trans," a label used to describe trans people who prioritize engaging in romantic, sexual, or other relationships with other trans people.
alternative label: T4T (Trans for Trans)
alternative label: TFT
alternative label: Trans4Trans
alternative label: tft
change note: Version 3.7.0
in scheme: v3
related: https://homosaurus.org/v3/homoit0001089
related: https://homosaurus.org/v3/homoit0001378
related: https://homosaurus.org/v3/homoit0001403

Clocking (Gender)
type: Concept
issued: 2021-12-07
modified: 2025-02-23
comment: Slang term for the act of identifying (or clocking) someone in public as trans, crossdressing, or in drag when that person is intending to pass or be read by others as cisgender, typically for their personal safety. Clocking is often understood to be a threat (of violence or public outing) against the person being clocked. Use the term "Reading (Gender)" to refer to shared identification or recognized kinship between two individuals who are both gender minorities.
alternative label: Clocking (Transgender)
alternative label: Clocking
change note: Version 3.7.0
in scheme: v3
related: https://homosaurus.org/v3/homoit0000288
related: https://homosaurus.org/v3/homoit0000316
related: https://homosaurus.org/v3/homoit0001090
related: https://homosaurus.org/v3/homoit0001378
related: https://homosaurus.org/v3/homoit0001381
related: https://homosaurus.org/v3/homoit0001470

Two-Spirit community
type: Concept
issued: 2022-01-19
modified: 2025-02-23
comment: A group of Two-Spirit people united by their shared identity.
alternative label: 2S community
alternative label: Two Spirit community
alternative label: Two Spirited community
alternative label: Two-Spirited community
change note: Version 3.7.0
in scheme: v3
related: https://homosaurus.org/v3/homoit0000297
related: https://homosaurus.org/v3/homoit0001480
related: https://homosaurus.org/v3/homoit0002689

Transmisogyny
type: Concept
issued: 2022-02-24
modified: 2025-02-23
comment: The intersection of transphobia and misogyny as directed toward trans women and transfeminine people.
change note: Version 3.7.0
in scheme: v3
narrower: https://homosaurus.org/v3/homoit0003158
related: https://homosaurus.org/v3/homoit0000062
related: https://homosaurus.org/v3/homoit0000112
related: https://homosaurus.org/v3/homoit0001017
related: https://homosaurus.org/v3/homoit0001467
related: https://homosaurus.org/v3/homoit0001903
related: https://homosaurus.org/v3/homoit0001904
related: https://homosaurus.org/v3/homoit0002273
related: https://homosaurus.org/v3/homoit0002274

Endosex people
type: Concept
issued: 2022-02-28
modified: 2025-02-23
comment: Individuals born with the sexual anatomy, reproductive system, and chromosomes associated with their assigned sex (i.e., people who are not intersex).
alternative label: Dyadic people
alternative label: Non-intersex people
alternative label: Perisex people
change note: Version 3.7.0
in scheme: v3
related: https://homosaurus.org/v3/homoit0001268
related: https://homosaurus.org/v3/homoit0001648
related: https://homosaurus.org/v3/homoit0001896

Reading (LGBTQ+ culture)
type: Concept
issued: 2022-02-28
modified: 2025-02-23
comment: Slang term used in drag and ballroom communities to describe the act of playfully or wittily insulting someone's appearance or behavior; described by drag queen Dorian Corey as "the art form of the insult."
change note: Version 3.7.0
in scheme: v3
related: https://homosaurus.org/v3/homoit0000092
related: https://homosaurus.org/v3/homoit0000370
related: https://homosaurus.org/v3/homoit0001233
related: https://homosaurus.org/v3/homoit0002192

Passing (Sexuality)
type: Concept
issued: 2022-02-28
modified: 2025-02-23
comment: The ability of a person who is not heterosexual to "pass," or be accepted or regarded as heterosexual by others. "Passing" has historically been used to describe an individual's ability to "pass" as a certain race or ethnicity, though the term was later appropriated by the LGBTQ+ community.
alternative label: Passing (Sexual identity)
alternative label: Passing (Sexual orientation)
change note: Version 3.7.0
in scheme: v3
related: https://homosaurus.org/v3/homoit0001090
related: https://homosaurus.org/v3/homoit0001295
related: https://homosaurus.org/v3/homoit0001306

Transmisogynoir
type: Concept
issued: 2022-03-29
modified: 2025-02-23
comment: Term coined by coined by Trudy of the womanist blog Gradient Lair to describe the intersection of transphobia, misogyny, and anti-Black racism as directed toward Black trans women.
change note: Version 3.7.0
in scheme: v3
related: https://homosaurus.org/v3/homoit0000062
related: https://homosaurus.org/v3/homoit0000112
related: https://homosaurus.org/v3/homoit0001017
related: https://homosaurus.org/v3/homoit0001467
related: https://homosaurus.org/v3/homoit0001892
related: https://homosaurus.org/v3/homoit0001902
related: https://homosaurus.org/v3/homoit0001904
related: https://homosaurus.org/v3/homoit0002038
related: https://homosaurus.org/v3/homoit0002257

Misogynoir
type: Concept
issued: 2022-03-29
modified: 2025-02-23
comment: Term coined by scholar Moya Bailey to describe the intersection of misogyny and anti-Black racism as directed toward Black women.
change note: Version 3.7.0
in scheme: v3
related: https://homosaurus.org/v3/homoit0001017
related: https://homosaurus.org/v3/homoit0001892
related: https://homosaurus.org/v3/homoit0001903
related: https://homosaurus.org/v3/homoit0002038
related: https://homosaurus.org/v3/homoit0002257

Drag performers
type: Concept
issued: 2022-03-29
modified: 2025-02-23
comment: Performers who dress and/or use makeup to produce, emphasize, and/or exaggerate traits associated with a certain gender, which may or may not be the gender the performer primarily identifies with.
change note: Version 3.7.0
in scheme: v3
related: https://homosaurus.org/v3/homoit0000367
related: https://homosaurus.org/v3/homoit0000370
related: https://homosaurus.org/v3/homoit0000373
related: https://homosaurus.org/v3/homoit0000375
related: https://homosaurus.org/v3/homoit0003359
related: https://homosaurus.org/v3/homoit0003360

Monosexual people
type: Concept
issued: 2022-03-31
modified: 2025-02-23
comment: Individuals who are attracted to only one gender; includes gay people and straight people.
alternative label: Monosexuals
change note: Version 3.7.0
in scheme: v3
related: https://homosaurus.org/v3/homoit0000627
related: https://homosaurus.org/v3/homoit0000648
related: https://homosaurus.org/v3/homoit0001295
related: https://homosaurus.org/v3/homoit0001298
related: https://homosaurus.org/v3/homoit0001300
related: https://homosaurus.org/v3/homoit0001555
related: https://homosaurus.org/v3/homoit0001556

Monogamous people
type: Concept
issued: 2022-03-31
modified: 2025-02-23
comment: Individuals who engage in sexual or romantic relationships with only one person at a time.
change note: Version 3.7.0
in scheme: v3
related: https://homosaurus.org/v3/homoit0001019
related: https://homosaurus.org/v3/homoit0001081
related: https://homosaurus.org/v3/homoit0001302
related: https://homosaurus.org/v3/homoit0001555
related: https://homosaurus.org/v3/homoit0001650
related: https://homosaurus.org/v3/homoit0001656

Allosexual people
type: Concept
issued: 2022-03-31
modified: 2025-02-23
comment: Individuals who generally experience sexual attraction or the desire for partnered sexual experiences.
change note: Version 3.7.0
in scheme: v3
related: https://homosaurus.org/v3/homoit0001300
related: https://homosaurus.org/v3/homoit0001302
related: https://homosaurus.org/v3/homoit0001531
related: https://homosaurus.org/v3/homoit0001535

Cissexuality
type: Concept
issued: 2022-03-31
modified: 2025-02-23
comment: Term used to describe people who identify with the sex they were assigned at birth.
change note: Version 3.7.0
in scheme: v3
related: https://homosaurus.org/v3/homoit0000273
related: https://homosaurus.org/v3/homoit0001925

BIPOC
type: Concept
issued: 2022-04-18
modified: 2025-02-23
comment: Acronym primarily used in the United States to describe Black, Indigenous, and people of color as a group, while also centering the specific experiences of Black and Indigenous people.
alternative label: Black, Indigenous, and people of color
alternative label: Black, Indigenous, and people of colour
change note: Version 3.7.0
in scheme: v3
related: https://homosaurus.org/v3/homoit0000208
related: https://homosaurus.org/v3/homoit0001101
related: https://homosaurus.org/v3/homoit0002273

Queerbaiting
type: Concept
issued: 2022-07-04
modified: 2025-02-23
comment: Marketing tactic in which creators of a piece of media purposefully hint at but do not explicitly depict or follow through with queer relationships or queer representation. Queerbaiting is distinct from queer coding in that queer coding is not typically used as a marketing tactic.
alternative label: Queer baiting
change note: Version 3.7.0
in scheme: v3
related: https://homosaurus.org/v3/homoit0000899
related: https://homosaurus.org/v3/homoit0002192

Queer coding
type: Concept
issued: 2022-07-04
modified: 2025-02-23
comment: Purposeful subtextual coding of a character or relationship in a piece of media as queer. Queer coding is distinct from the practice of queerbaiting in that the queer codes are intentionally present rather than falsely implied and are not typically used as a marketing tactic.
alternative label: Queercoding
change note: Version 3.7.0
in scheme: v3
related: https://homosaurus.org/v3/homoit0000609
related: https://homosaurus.org/v3/homoit0000972
related: https://homosaurus.org/v3/homoit0001233
related: https://homosaurus.org/v3/homoit0001900
related: https://homosaurus.org/v3/homoit0002191

Gender euphoria
type: Concept
issued: 2022-09-09
modified: 2025-02-23
comment: The powerful feeling of joy and comfort an individual experiences when their assigned gender, gender expression, and/or the way their gender is perceived by themselves and others aligns with their gender identity. Though gender euphoria is often associated with trans people, people of any identity may experience gender euphoria when they feel that their gender has been seen and affirmed, or when they feel "right" in their body and the way their gender is being expressed.
change note: Version 3.7.0
in scheme: v3
related: https://homosaurus.org/v3/homoit0000120
related: https://homosaurus.org/v3/homoit0000567
related: https://homosaurus.org/v3/homoit0000568
related: https://homosaurus.org/v3/homoit0000571
related: https://homosaurus.org/v3/homoit0002699
related: https://homosaurus.org/v3/homoit0002700
related: https://homosaurus.org/v3/homoit0003193
related: https://homosaurus.org/v3/homoit0003708

AIDS death and dying
type: Concept
issued: 2022-11-08
modified: 2025-02-23
comment: Experiences related to people with AIDS approaching or having reached the end of their lives.
change note: Version 3.7.0
in scheme: v3
related: https://homosaurus.org/v3/homoit0000848
related: https://homosaurus.org/v3/homoit0000849
related: https://homosaurus.org/v3/homoit0000911
related: https://homosaurus.org/v3/homoit0001360

Gender-neutral language
type: Concept
issued: 2022-11-08
modified: 2025-02-23
comment: Language that avoids the use of gender-specific words, either to be inclusive of nonbinary, agender, and other gender diverse peoples, or to avoid gender bias.
alternative label: Gender inclusive language
alternative label: Gender neutral language
alternative label: Gender-inclusive language
change note: Version 3.7.0
in scheme: v3
related: https://homosaurus.org/v3/homoit0001016
related: https://homosaurus.org/v3/homoit0001135
related: https://homosaurus.org/v3/homoit0001278

Anti-racism
type: Concept
issued: 2022-11-08
modified: 2025-02-23
comment: Umbrella term used to describe a range of ideas, policies, and political actions that are intended to actively challenge, reject, or oppose racism and racial oppression (whether personal or systemic), as well as advocate for racial equity.
alternative label: Antiracism
change note: Version 3.7.0
in scheme: v3
related: https://homosaurus.org/v3/homoit0001902
related: https://homosaurus.org/v3/homoit0002038

QTPOC
type: Concept
issued: 2022-11-08
modified: 2025-02-23
comment: Acronym used to refer to queer and trans people of color as a group. Typically used to acknowledge the particularities of queer and trans people of color's experiences and the intersections of queerphobia, transphobia, and racism as directed towards queer and trans people of color.
alternative label: Queer and trans people of color
change note: Version 3.7.0
in scheme: v3
related: https://homosaurus.org/v3/homoit0001892
related: https://homosaurus.org/v3/homoit0001928
related: https://homosaurus.org/v3/homoit0001101

LGBTQ+ people of the African diaspora
type: Concept
issued: 2022-11-15
modified: 2025-02-23
comment: LGBTQ+ people of native African ancestry living outside of the continent of Africa. While this term is commonly used to describe descendants of Africans who were enslaved and forcibly transported to the Americas via the transatlantic slave trade between the 16th and 19th centuries, it can also be used to refer to descendants of Africans who voluntarily immigrated to other parts of the world. Do not conflate with Black LGBTQ+ people or African American LGBTQ+ people. Follow the individual's preference whenever possible.
change note: Version 3.7.0
in scheme: v3
related: https://homosaurus.org/v3/homoit0000015

No Police at Pride
type: Concept
issued: 2023-01-13
modified: 2025-02-23
comment: Primarily Canadian and U.S. American movement wherein police officers were banned from LGBTQ+ pride events in some locations, due to historical and contemporary mistreatment of LGBTQ+ persons, especially Black and Indigenous LGBTQ+ persons. In recent years acted as a response to the 2010-2017 Toronto serial homicides and the mishandling of the investigation by the Toronto Police Service.
alternative label: No Cops at Pride movement
alternative label: No Cops at Pride
alternative label: No Police at Pride movement
change note: Version 3.7.0
in scheme: v3
related: https://homosaurus.org/v3/homoit0003651
related: https://homosaurus.org/v3/homoit0003653

White supremacy in policing
type: Concept
issued: 2023-01-13
modified: 2025-02-23
comment: Historical and contemporary linkages between white supremacist ideologies and modern policing institutions, primarily discussed within the context of the countries of Canada and the United States.
alternative label: Far-right presence in police forces
alternative label: Infiltration of police by white supremacists
alternative label: Law enforcement and white supremacy
alternative label: Police and right-wing extremism
alternative label: Police officer ties with white supremacists
alternative label: Police with far-right ties
change note: Version 3.7.0
in scheme: v3
related: https://homosaurus.org/v3/homoit0001119
related: https://homosaurus.org/v3/homoit0002376
related: https://homosaurus.org/v3/homoit0002377

Internalized oppression
type: Concept
issued: 2023-04-14
modified: 2025-02-23
comment: The phenomenon in which someone in a marginalized group internalizes or adopts oppressive beliefs (i.e., negative perceptions of and intolerance toward any marginalized identities they hold) as a result of being raised or socialized within an oppressive environment or culture.
change note: Version 3.7.0
in scheme: v3
narrower: https://homosaurus.org/v3/homoit0000391
narrower: https://homosaurus.org/v3/homoit0002591
narrower: https://homosaurus.org/v3/homoit0002592
narrower: https://homosaurus.org/v3/homoit0002593
narrower: https://homosaurus.org/v3/homoit0002594
narrower: https://homosaurus.org/v3/homoit0002595
related: https://homosaurus.org/v3/homoit0000345
related: https://homosaurus.org/v3/homoit0000920
related: https://homosaurus.org/v3/homoit0000936
related: https://homosaurus.org/v3/homoit0003091

Māhū poetry
type: Concept
issued: 2023-06-23
modified: 2025-02-23
comment: Literary work, typically written in verse, that focuses on Māhū characters, themes, or identity.
alternative label: Mahu poetry
change note: Version 3.7.0
in scheme: v3
related: https://homosaurus.org/v3/homoit0001118

Māhū comics
type: Concept
issued: 2023-06-23
modified: 2025-02-23
comment: Works consisting of sequential images often accompanied by text; use in reference to comics focusing on Māhū characters or themes.
alternative label: Mahu comics
change note: Version 3.7.0
in scheme: v3
related: https://homosaurus.org/v3/homoit0000841

Māhū fiction
type: Concept
issued: 2023-06-23
modified: 2025-02-23
comment: Written works describing imagined events or people; use in reference to fictional works focusing on Māhū characters or themes.
alternative label: Mahu fiction
change note: Version 3.7.0
in scheme: v3
related: https://homosaurus.org/v3/homoit0000443

Māhū short stories
type: Concept
issued: 2023-06-23
modified: 2025-02-23
comment: Written literary works that are short in length and detail a self-contained incident or concept; use in reference to short stories focusing on Māhū characters or themes.
alternative label: Mahu short stories
change note: Version 3.7.0
in scheme: v3
related: https://homosaurus.org/v3/homoit0001608

Māhū porn films
type: Concept
issued: 2023-06-23
modified: 2025-02-23
comment: Erotic or sexually explicit films featuring Māhū people.
alternative label: Mahu porn films
change note: Version 3.7.0
in scheme: v3
related: https://homosaurus.org/v3/homoit0000013

Māhū erotic literature
type: Concept
issued: 2023-06-23
modified: 2025-02-23
comment: Literary works that have erotic or sexual elements; use in reference to erotic literature focusing on Māhū characters or themes.
alternative label: Mahu erotic literature
change note: Version 3.7.0
in scheme: v3
related: https://homosaurus.org/v3/homoit0000859

Māhū fantasy fiction
type: Concept
issued: 2023-06-23
modified: 2025-02-23
comment: Genre that uses magic and other supernatural phenomena as a primary element of plot, theme, and/or setting; use for fantasy fiction focusing on Māhū characters or themes.
alternative label: Mahu fantasy fiction
change note: Version 3.7.0
in scheme: v3
related: https://homosaurus.org/v3/homoit0000443
related: https://homosaurus.org/v3/homoit0000865

Māhū science fiction
type: Concept
issued: 2023-06-23
modified: 2025-02-23
comment: Written literary work about imaginative or futuristic concepts incorporating science, technology, space, time travel, and other speculative elements; use in reference to science fiction focusing on Māhū characters or themes.
alternative label: Mahu science fiction
change note: Version 3.7.0
in scheme: v3
related: https://homosaurus.org/v3/homoit0000443
related: https://homosaurus.org/v3/homoit0000934

Māhū graphic novels
type: Concept
issued: 2023-06-23
modified: 2025-02-23
comment: Works consisting of sequential images often accompanied by text that generally contain stand-alone stories; used in reference to graphic novels focusing on Māhū characters or themes.
alternative label: Mahu graphic novels
change note: Version 3.7.0
in scheme: v3
related: https://homosaurus.org/v3/homoit0000874

Māhū horror fiction
type: Concept
issued: 2023-06-23
modified: 2025-02-23
comment: Written works of fiction intended to frighten, scare, or disgust; use in reference to horror fiction focusing on Māhū characters or themes.
alternative label: Mahu horror fiction
change note: Version 3.7.0
in scheme: v3
related: https://homosaurus.org/v3/homoit0000443
related: https://homosaurus.org/v3/homoit0001580

Māhū mystery and detective fiction
type: Concept
issued: 2023-06-23
modified: 2025-02-23
comment: Written literary works about the investigation of crime or the work of detectives; use in reference to mystery and detective fiction focusing on Māhū characters and themes.
alternative label: Mahu mystery and detective fiction
change note: Version 3.7.0
in scheme: v3
related: https://homosaurus.org/v3/homoit0000443
related: https://homosaurus.org/v3/homoit0000852

Māhū romance fiction
type: Concept
issued: 2023-06-23
modified: 2025-02-23
comment: Works of fiction revolving around romantic and/or sexual relationships between the main characters; use in reference to romance fiction focusing on Māhū characters.
alternative label: Mahu romance fiction
change note: Version 3.7.0
in scheme: v3
related: https://homosaurus.org/v3/homoit0000443
related: https://homosaurus.org/v3/homoit0001586

Two-Spirit poetry
type: Concept
issued: 2023-06-23
modified: 2025-02-23
comment: Literary work, typically written in verse, that focuses on Two-Spirit characters, themes, or identity.
alternative label: 2S poetry
alternative label: Two Spirit poetry
alternative label: Two Spirited poetry
alternative label: Two-Spirited poetry
change note: Version 3.7.0
in scheme: v3
related: https://homosaurus.org/v3/homoit0001118

Two-Spirit comics
type: Concept
issued: 2023-06-23
modified: 2025-02-23
comment: Works consisting of sequential images often accompanied by text; use in reference to comics focusing on Two-Spirit characters or themes.
alternative label: 2S comics
alternative label: Two Spirit comics
alternative label: Two Spirited comics
alternative label: Two-Spirited comics
change note: Version 3.7.0
in scheme: v3
related: https://homosaurus.org/v3/homoit0000841

Two-Spirit erotic literature
type: Concept
issued: 2023-06-25
modified: 2025-02-23
comment: Literary works that have erotic or sexual elements; use in reference to erotic literature focusing on Two-Spirit characters or themes.
alternative label: 2S erotic literature
alternative label: Two Spirit erotic literature
alternative label: Two Spirited erotic literature
alternative label: Two-Spirited erotic literature
change note: Version 3.7.0
in scheme: v3
related: https://homosaurus.org/v3/homoit0000859

Two-Spirit fantasy fiction
type: Concept
issued: 2023-06-26
modified: 2025-02-23
comment: Genre that uses magic and other supernatural phenomena as a primary element of plot, theme, and/or setting; use for fantasy fiction focusing on Two-Spirit characters or themes.
alternative label: 2S fantasy fiction
alternative label: Two Spirit fantasy fiction
alternative label: Two Spirited fantasy fiction
alternative label: Two-Spirited fantasy fiction
change note: Version 3.7.0
in scheme: v3
related: https://homosaurus.org/v3/homoit0000443
related: https://homosaurus.org/v3/homoit0000865

Two-Spirit science fiction
type: Concept
issued: 2023-06-26
modified: 2025-02-23
comment: Written literary work about imaginative or futuristic concepts incorporating science, technology, space, time travel, and other speculative elements; use in reference to science fiction focusing on Two-Spirit characters or themes.
alternative label: 2S science fiction
alternative label: Two Spirit science fiction
alternative label: Two Spirited science fiction
alternative label: Two-Spirited science fiction
change note: Version 3.7.0
in scheme: v3
related: https://homosaurus.org/v3/homoit0000443
related: https://homosaurus.org/v3/homoit0000934

Two-Spirit graphic novels
type: Concept
issued: 2023-06-26
modified: 2025-02-23
comment: Works consisting of sequential images often accompanied by text that generally contain stand-alone stories; used in reference to graphic novels focusing on Two-Spirit characters or themes.
alternative label: 2S graphic novels
alternative label: Two Spirit graphic novels
alternative label: Two Spirited graphic novels
alternative label: Two-Spirited graphic novels
change note: Version 3.7.0
in scheme: v3
related: https://homosaurus.org/v3/homoit0000874

Two-Spirit horror fiction
type: Concept
issued: 2023-06-26
modified: 2025-02-23
comment: Written works of fiction intended to frighten, scare, or disgust; use in reference to horror fiction focusing on Two-Spirit characters or themes.
alternative label: 2S horror fiction
alternative label: Two Spirit horror fiction
alternative label: Two Spirited horror fiction
alternative label: Two-Spirited horror fiction
change note: Version 3.7.0
in scheme: v3
related: https://homosaurus.org/v3/homoit0000443
related: https://homosaurus.org/v3/homoit0001580

Two-Spirit mystery and detective fiction
type: Concept
issued: 2023-06-26
modified: 2025-02-23
comment: Written literary works about the investigation of crime or the work of detectives; use in reference to mystery and detective fiction focusing on Two-Spirit characters and themes.
alternative label: 2S mystery and detective fiction
alternative label: Two Spirit mystery and detective fiction
alternative label: Two Spirited mystery and detective fiction
alternative label: Two-Spirited mystery and detective fiction
change note: Version 3.7.0
in scheme: v3
related: https://homosaurus.org/v3/homoit0000443
related: https://homosaurus.org/v3/homoit0000852

Two-Spirit romance fiction
type: Concept
issued: 2023-06-26
modified: 2025-02-23
comment: Works of fiction revolving around romantic and/or sexual relationships between the main characters; use in reference to romance fiction focusing on Two-Spirit characters.
alternative label: 2S romance fiction
alternative label: Two Spirit romance fiction
alternative label: Two Spirited romance fiction
alternative label: Two-Spirited romance fiction
change note: Version 3.7.0
in scheme: v3
related: https://homosaurus.org/v3/homoit0000443
related: https://homosaurus.org/v3/homoit0001586

Two-Spirit activism
type: Concept
issued: 2023-06-26
modified: 2025-02-23
comment: Direct action and organizing to achieve political or social change and acceptance for Two-Spirit people.
alternative label: 2S activism
alternative label: Two Spirit activism
alternative label: Two Spiritied activism
alternative label: Two-Spirited activism
change note: Version 3.7.0
in scheme: v3
related: https://homosaurus.org/v3/homoit0000006
related: https://homosaurus.org/v3/homoit0002657
related: https://homosaurus.org/v3/homoit0003531

Two-Spirit political activists
type: Concept
issued: 2023-06-26
modified: 2025-02-23
comment: Two-Spirit people working to bring about political or social change through public organizing.
alternative label: 2S political activists
alternative label: Two Spirit political activists
alternative label: Two Spirited political activists
alternative label: Two-Spirited political activists
change note: Version 3.7.0
in scheme: v3
related: https://homosaurus.org/v3/homoit0000007
related: https://homosaurus.org/v3/homoit0002656

Two-Spirit archives
type: Concept
issued: 2023-06-26
modified: 2025-02-23
comment: Collections of records and materials relating to Two-Spirit people or Two-Spirit communities; can include a variety of organizations and institutions from community to government archives.
alternative label: 2S archives
alternative label: Two Spirit archives
alternative label: Two Spirited archives
alternative label: Two-Spirited archives
change note: Version 3.7.0
in scheme: v3
related: https://homosaurus.org/v3/homoit0000066

Two-Spirit autobiographies
type: Concept
issued: 2023-06-26
modified: 2025-02-23
comment: Accounts of Two-Spirit peoples' lives written by those people. For written accounts of Two-Spirit people's lives that were not written by the subject, use "Two-Spirit biographies."
alternative label: 2S autobiographies
alternative label: 2S autobios
alternative label: 2S memoirs
alternative label: Two Spirit autobiographies
alternative label: Two Spirit autobios
alternative label: Two Spirit memoirs
alternative label: Two Spirited autobiographies
alternative label: Two Spirited autobios
alternative label: Two Spirited memoirs
alternative label: Two-Spirited authobiographies
alternative label: Two-Spirited autobios
alternative label: Two-Spirited memoirs
change note: Version 3.7.0
in scheme: v3
related: https://homosaurus.org/v3/homoit0001729
related: https://homosaurus.org/v3/homoit0001750
related: https://homosaurus.org/v3/homoit0002680

Two-Spirit biographies
type: Concept
issued: 2023-06-26
modified: 2025-02-23
comment: Written accounts of the lives of Two-Spirit people. For written accounts of Two-Spirit people's lives written by the subject, use "Two-Spirit autobiographies."
alternative label: 2S biographies
alternative label: Two Spirit biographies
alternative label: Two Spirited biographies
alternative label: Two-Spirited biographies
change note: Version 3.7.0
in scheme: v3
related: https://homosaurus.org/v3/homoit0001614
related: https://homosaurus.org/v3/homoit0002679
related: https://homosaurus.org/v3/homoit0001750

Two-Spirit bookshops
type: Concept
issued: 2023-06-26
modified: 2025-02-23
comment: Bookshops that sell materials intended for use by Two-Spirit people or addressing topics related to Two-Spirit experiences.
alternative label: 2S bookshops
alternative label: Two Spirit bookshops
alternative label: Two Spirited bookshops
alternative label: Two-Spirited bookshops
change note: Version 3.7.0
in scheme: v3
related: https://homosaurus.org/v3/homoit0000216

Two-Spirit short stories
type: Concept
issued: 2023-06-26
modified: 2025-02-23
comment: Written literary works that are short in length and detail a self-contained incident or concept; use in reference to short stories focusing on Two-Spirit characters or themes.
alternative label: 2S short stories
alternative label: Two Spirit short stories
alternative label: Two spirited short stories
change note: Version 3.7.0
in scheme: v3
related: https://homosaurus.org/v3/homoit0001608

Two-Spirit characters
type: Concept
issued: 2023-06-26
modified: 2025-02-23
comment: Characters in creative works who are Two-Spirit
alternative label: 2S characters
alternative label: Two Spirit characters
alternative label: Two Spirited characters
alternative label: Two-Spirited characters
change note: Version 3.7.0
in scheme: v3
related: https://homosaurus.org/v3/homoit0000249

Two-Spirit community centers
type: Concept
issued: 2023-06-26
modified: 2025-02-23
comment: Spaces in which people from Two-Spirit communities meet for social, education, recreational, or organizing activities.
alternative label: 2S community centers
alternative label: Two Spirit community centers
alternative label: Two Spirited community centers
alternative label: Two-Spirit community centres
alternative label: Two-Spirited community centers
change note: Version 3.7.0
in scheme: v3
related: https://homosaurus.org/v3/homoit0000298
related: https://homosaurus.org/v3/homoit0001480
related: https://homosaurus.org/v3/homoit0001811

Two-Spirit couples
type: Concept
issued: 2023-06-26
modified: 2025-02-23
comment: Partnerships in which both people are Two-Spirit
alternative label: 2S couples
alternative label: Two Spirit couples
alternative label: Two Spirited couples
alternative label: Two-Spirited couples
change note: Version 3.7.0
in scheme: v3
related: https://homosaurus.org/v3/homoit0000310

Two-Spirit drama
type: Concept
issued: 2023-06-26
modified: 2025-02-23
comment: Works of fiction written to be performed; use in reference to dramatic works focusing on Two-Spirit characters or themes.
alternative label: 2S drama
alternative label: Two Spirit drama
alternative label: Two Spirited drama
alternative label: Two-Spirited drama
change note: Version 3.7.0
in scheme: v3
related: https://homosaurus.org/v3/homoit0000376

Two-Spirit employment
type: Concept
issued: 2023-06-26
modified: 2025-02-23
comment: Employment of Two-Spirit people
alternative label: 2S employment
alternative label: Two Spirit employment
alternative label: Two Spirited employment
alternative label: Two-Spirited employment
change note: Version 3.7.0
in scheme: v3
related: https://homosaurus.org/v3/homoit0001717

Two-Spirit people with chronic illnesses
type: Concept
issued: 2023-06-26
modified: 2025-02-23
comment: Two-Spirit people who have long-term health conditions that require continued medical attention and/or significantly impact or limit daily life; some but not all people with chronic illnesses consider themselves disabled.
alternative label: 2S people with chronic illnesses
alternative label: Chronically ill 2S people
alternative label: Chronically ill Two Spirit people
alternative label: Chronically ill Two Spirited people
alternative label: Chronically ill Two-Spirited people
alternative label: Two Spirit people with chronic illnesses
alternative label: Two Spirited people with chronic illnesses
alternative label: Two-Spirited people with chronic illnesses
change note: Version 3.7.0
in scheme: v3
related: https://homosaurus.org/v3/homoit0001879
related: https://homosaurus.org/v3/homoit0002682

Two-Spirit information centers
type: Concept
issued: 2023-06-26
modified: 2025-02-23
comment: Institutions providing education, support, and information about Two-Spirit issues and Two-Spirit communities to Two-Spirit people.
alternative label: 2S information centers
alternative label: Two Spirit information centers
alternative label: Two Spirited information centers
alternative label: Two-Spirit information centres
alternative label: Two-Spirited information centers
change note: Version 3.7.0
in scheme: v3
related: https://homosaurus.org/v3/homoit0000660

Two-Spirit libraries
type: Concept
issued: 2023-06-26
modified: 2025-02-23
comment: Libraries that hold materials primarily pertaining to Two-Spirit people or intended for use by Two-Spirit people.
alternative label: 2S libraries
alternative label: Two Spirit libraries
alternative label: Two Spirited libraries
alternative label: Two-Spirited libraries
change note: Version 3.7.0
in scheme: v3
related: https://homosaurus.org/v3/homoit0000968

Two-Spirit literary criticism
type: Concept
issued: 2023-06-26
modified: 2025-02-23
comment: The study, evaluation, and interpretation of literary works focusing on Two-Spirit characters or themes; can also include interpretation of literature through the lens and frameworks of Two-Spirit studies.
alternative label: 2S literary criticism
alternative label: Two Spirit literary criticism
alternative label: Two Spirited literary criticism
alternative label: Two-Spirited literary criticism
change note: Version 3.7.0
in scheme: v3
related: https://homosaurus.org/v3/homoit0001602

Two-Spirit movement
type: Concept
issued: 2023-06-27
modified: 2025-02-23
comment: Umbrella term for activism focused on the rights of Two-Spirit people and issues faced by Two-Spirit communities.
alternative label: 2S movement
alternative label: Two Spirit movement
alternative label: Two Spirited movement
alternative label: Two-Spirited movement
change note: Version 3.7.0
in scheme: v3
related: https://homosaurus.org/v3/homoit0001026

Two-Spirit museums
type: Concept
issued: 2023-06-27
modified: 2025-02-23
comment: Institutions dedicated to the storage, exhibition, conservation, and preservation of materials relating to Two-Spirit people and Two-Spirit history.
alternative label: 2S museums
alternative label: Two Spirit museums
alternative label: Two Spirited museums
alternative label: Two-Spirited museums
change note: Version 3.7.0
in scheme: v3
related: https://homosaurus.org/v3/homoit0001030

Two-Spirit people in the military
type: Concept
issued: 2023-06-27
modified: 2025-02-23
comment: Two-Spirit people serving in state and national armed forces.
alternative label: 2S people in the military
alternative label: Two Spirit people in the military
alternative label: Two Spirited people in the military
alternative label: Two-Spirited people in the military
change note: Version 3.7.0
in scheme: v3
related: https://homosaurus.org/v3/homoit0001100

Two-Spirit publishers
type: Concept
issued: 2023-06-27
modified: 2025-02-23
comment: Companies and organizations that publish materials for Two-Spirit communities or addressing Two-Spirit issues.
alternative label: 2S publishers
alternative label: Two Spirit publishers
alternative label: Two Spirited publishers
alternative label: Two-Spirited publishers
change note: Version 3.7.0
in scheme: v3
related: https://homosaurus.org/v3/homoit0001144

Two-Spirit radio
type: Concept
issued: 2023-06-27
modified: 2025-02-23
comment: Auditory content broadcast on the radio (analog or digital) about Two-Spirit people and Two-Spirit issues.
alternative label: 2S radio
alternative label: Two Spirit radio
alternative label: Two Spirited radio
alternative label: Two-Spirited radio
change note: Version 3.7.0
in scheme: v3
related: https://homosaurus.org/v3/homoit0001231

Two-Spirit relationships
type: Concept
issued: 2023-06-27
modified: 2025-02-23
comment: Ongoing connections (romantic, sexual, or platonic) between two or more Two-Spirit people.
alternative label: 2S relationships
alternative label: Two Spirit relationships
alternative label: Two Spirited relationships
alternative label: Two-Spirited relationships
change note: Version 3.7.0
in scheme: v3
related: https://homosaurus.org/v3/homoit0001237

Two-Spirit rights
type: Concept
issued: 2023-06-27
modified: 2025-02-23
comment: Legal, social, or ethical principles of freedom or entitlement held by Two-Spirit people.
alternative label: 2S rights
alternative label: Two Spirit rights
alternative label: Two Spirited rights
alternative label: Two-Spirited rights
change note: Version 3.7.0
in scheme: v3
related: https://homosaurus.org/v3/homoit0000276

Two-Spirit slang
type: Concept
issued: 2023-06-27
modified: 2025-02-23
comment: Colloquial or informal language related to Two-Spirit identity or used by Two-Spirit people.
alternative label: 2S slang
alternative label: Two Spirit slang
alternative label: Two Spirited slang
alternative label: Two-Spirited slang
change note: Version 3.7.0
in scheme: v3
related: https://homosaurus.org/v3/homoit0001317

Two-Spirit studies
type: Concept
issued: 2023-06-27
modified: 2025-02-23
comment: Academic field of research and study about Two-Spirit people, Two-Spirit identity, and Two-Spirit communities.
alternative label: 2S studies
alternative label: Two Spirit studies
alternative label: Two Spirited studies
alternative label: Two-Spirited studies
change note: Version 3.7.0
in scheme: v3
related: https://homosaurus.org/v3/homoit0000579
related: https://homosaurus.org/v3/homoit0001210

Two-Spirit survivors of hate crimes
type: Concept
issued: 2023-06-27
modified: 2025-02-23
comment: Two-Spirit people who have experienced and survived hate crimes; follow the individual's preference for "victims" or "survivors" whenever possible.
alternative label: 2S survivors of hate crimes
alternative label: Two Spirit survivors of hate crimes
alternative label: Two Spirited survivors of hate crimes
alternative label: Two-Spirited survivors of hate crimes
change note: Version 3.7.0
in scheme: v3
related: https://homosaurus.org/v3/homoit0001349

Two-Spirit survivors of rape
type: Concept
issued: 2023-06-27
modified: 2025-02-23
comment: Two-Spirit people who have experienced and survived rape; follow the individual's preference for "victims" or "survivors" whenever possible.
alternative label: 2S survivors of rape
alternative label: Two Spirit survivors of rape
alternative label: Two Spirited survivors of rape
alternative label: Two-Spirited survivors of rape
change note: Version 3.7.0
in scheme: v3
related: https://homosaurus.org/v3/homoit0001350

Two-Spirit survivors of sexual abuse
type: Concept
issued: 2023-06-27
modified: 2025-02-23
comment: Two-Spirit people who have experienced and survived sexual abuse; follow the individual's preference for "victims" or "survivors" whenever possible.
alternative label: 2S survivors of sexual abuse
alternative label: Two Spirit survivors of sexual abuse
alternative label: Two Spirited survivors of sexual abuse
alternative label: Two-Spirited survivors of sexual abuse
change note: Version 3.7.0
in scheme: v3
related: https://homosaurus.org/v3/homoit0001351

Two-Spirit survivors of war
type: Concept
issued: 2023-06-27
modified: 2025-02-23
comment: Two-Spirit people who have experienced and survived war; follow the individual's preference for "victims" or "survivors" whenever possible.
alternative label: 2S survivors of war
alternative label: Two Spirit survivors of war
alternative label: Two Spirited survivors of war
alternative label: Two-Spirited survivors of war
change note: Version 3.7.0
in scheme: v3
related: https://homosaurus.org/v3/homoit0001352

Two-Spirit television
type: Concept
issued: 2023-06-27
modified: 2025-02-23
comment: Television shows featuring Two-Spirit characters or themes.
alternative label: 2S television
alternative label: Two Spirit television
alternative label: Two Spirited television
alternative label: Two-Spirited television
change note: Version 3.7.0
in scheme: v3
related: https://homosaurus.org/v3/homoit0001359

Two-Spirit theater
type: Concept
issued: 2023-06-27
modified: 2025-02-23
comment: Works in the performance arts that focus on Two-Spirit characters or themes.
alternative label: 2S theater
alternative label: Two Spirit theater
alternative label: Two Spirited theater
alternative label: Two-Spirited theater
change note: Version 3.7.0
in scheme: v3
preferred label: 2S theatre
preferred label: Two Spirited theatre
preferred label: Two-Spirit theatre
preferred label: Two-Spirited theatre
related: https://homosaurus.org/v3/homoit0001363

Two-Spirit victims' rights
type: Concept
issued: 2023-06-27
modified: 2025-02-23
comment: Two-Spirit people’s legal rights to be informed, present, and heard within the criminal justice system after having been harmed or injured as the result of of a crime, accident, or other event.
alternative label: 2S victims' rights
alternative label: Two Spirit victims' rights
alternative label: Two Spirited victims' rights
alternative label: Two-Spirited victims' rights
change note: Version 3.7.0
in scheme: v3
related: https://homosaurus.org/v3/homoit0001492

Two-Spirit-focused businesses
type: Concept
issued: 2023-06-27
modified: 2025-02-23
comment: Businesses focusing on Two-Spirit clientele and products related to Two-Spirit communities.
alternative label: 2S-focused businesses
alternative label: Two Spirit-focused businesses
alternative label: Two Spirited-focused businesses
alternative label: Two-Spirited-focused businesses
change note: Version 3.7.0
in scheme: v3
related: https://homosaurus.org/v3/homoit0001741

Two-Spirit-owned businesses
type: Concept
issued: 2023-06-27
modified: 2025-02-23
comment: Businesses owned by Two-Spirit people.
alternative label: 2S-owned businesses
alternative label: Two Spirit-owned businesses
alternative label: Two Spirited-owned businesses
alternative label: Two-Spirited-owned businesses
change note: Version 3.7.0
in scheme: v3
related: https://homosaurus.org/v3/homoit0001735

Asexual studies
type: Concept
issued: 2023-06-28
modified: 2025-02-23
comment: Academic field of research and study about Asexual people, Asexual identity, and Asexual communities.
change note: Version 3.7.0
in scheme: v3
related: https://homosaurus.org/v3/homoit0001210

Steroidogenic factor 1 protein
type: Concept
issued: 2023-06-28
modified: 2025-02-23
comment: The steroidogenic factor 1 (SF-1) protein is a transcription factor involved in sex determination. The SF-1 protein controls the activity of genes related to the gonads and adrenal glands.
alternative label: SF-1 protein
change note: Version 3.7.0
in scheme: v3
related: https://homosaurus.org/v3/homoit0000651

Intersex studies
type: Concept
issued: 2023-06-30
modified: 2025-02-23
comment: Academic field of research and study about intersex people, intersex identity, and intersex communities.
change note: Version 3.7.0
in scheme: v3
related: https://homosaurus.org/v3/homoit0000579
related: https://homosaurus.org/v3/homoit0001210

Demisexual people with chronic illnesses
type: Concept
issued: 2023-10-27
modified: 2025-02-23
comment: Demisexual people who have long-term health conditions that require continued medical attention and/or significantly impact or limit daily life; some but not all people with chronic illnesses consider themselves disabled.
alternative label: Chronically ill demisexual people
change note: Version 3.7.0
in scheme: v3
related: https://homosaurus.org/v3/homoit0002993

Megasexual people with chronic illnesses
type: Concept
issued: 2023-10-27
modified: 2025-02-23
comment: Megasexual people who have long-term health conditions that require continued medical attention and/or significantly impact or limit daily life; some but not all people with chronic illnesses consider themselves disabled.
alternative label: Chronically ill megasexual people
change note: Version 3.7.0
in scheme: v3
related: https://homosaurus.org/v3/homoit0002994

Aromantic people with chronic illnesses
type: Concept
issued: 2023-10-27
modified: 2025-02-23
comment: Aromantic people who have long-term health conditions that require continued medical attention and/or significantly impact or limit daily life; some but not all people with chronic illnesses consider themselves disabled.
alternative label: Chronically ill aromantic people
change note: Version 3.7.0
in scheme: v3
related: https://homosaurus.org/v3/homoit0002995

Greyromantic people with chronic illnesses
type: Concept
issued: 2023-10-27
modified: 2025-02-23
comment: Greyromantic people who have long-term health conditions that require continued medical attention and/or significantly impact or limit daily life; some but not all people with chronic illnesses consider themselves disabled.
alternative label: Chronically ill greyromantic people
change note: Version 3.7.0
in scheme: v3
related: https://homosaurus.org/v3/homoit0002996

Non-binary people with chronic illnesses
type: Concept
issued: 2023-10-27
modified: 2025-02-23
comment: Non-binary people who have long-term health conditions that require continued medical attention and/or significantly impact or limit daily life; some but not all people with chronic illnesses consider themselves disabled.
alternative label: Chronically ill non-binary people
change note: Version 3.7.0
in scheme: v3
related: https://homosaurus.org/v3/homoit0002652

LGBTQ+ fashion
type: Concept
issued: 2023-12-18
modified: 2025-02-23
comment: Fashion, clothing, and accessories associated with LGBTQ+ subcultures and expression.
change note: Version 3.7.0
in scheme: v3
narrower: https://homosaurus.org/v3/homoit0000307
narrower: https://homosaurus.org/v3/homoit0001246
narrower: https://homosaurus.org/v3/homoit0003100
narrower: https://homosaurus.org/v3/homoit0003111
narrower: https://homosaurus.org/v3/homoit0003112
narrower: https://homosaurus.org/v3/homoit0003117
narrower: https://homosaurus.org/v3/homoit0003146
narrower: https://homosaurus.org/v3/homoit0003178
narrower: https://homosaurus.org/v3/homoit0003849
related: https://homosaurus.org/v3/homoit0000289
related: https://homosaurus.org/v3/homoit0000568
related: https://homosaurus.org/v3/homoit0001816
related: https://homosaurus.org/v3/homoit0003059
related: https://homosaurus.org/v3/homoit0003063

Body modification
type: Concept
issued: 2023-12-18
modified: 2025-02-23
comment: Modification of the body, such as tattooing, piercing, branding, or cutting.
change note: Version 3.7.0
in scheme: v3
narrower: https://homosaurus.org/v3/homoit0001114
narrower: https://homosaurus.org/v3/homoit0001356
related: https://homosaurus.org/v3/homoit0000214
related: https://homosaurus.org/v3/homoit0000307

Lateral oppression
type: Concept
issued: 2023-12-18
modified: 2025-02-23
comment: The phenomenon in which someone in a marginalized group displaces violence or oppression onto other members of their own group, often by acting on internalized oppressive beliefs (i.e., negative perceptions of and intolerance toward any marginalized identities they hold) adopted as a result of being raised or socialized within an oppressive environment or culture.
alternative label: Lateral violence
change note: Version 3.7.0
in scheme: v3
narrower: https://homosaurus.org/v3/homoit0003092
narrower: https://homosaurus.org/v3/homoit0003093
narrower: https://homosaurus.org/v3/homoit0003094
narrower: https://homosaurus.org/v3/homoit0003095
narrower: https://homosaurus.org/v3/homoit0003096
narrower: https://homosaurus.org/v3/homoit0003097
related: https://homosaurus.org/v3/homoit0002590

Dollification
type: Concept
issued: 2023-12-20
modified: 2025-02-23
comment: A practice of dressing and acting like a living doll (through makeup, dressing, etc.) for aesthetic or sexual gratification.
alternative label: Rubber dolling
change note: Version 3.7.0
in scheme: v3
related: https://homosaurus.org/v3/homoit0000318
related: https://homosaurus.org/v3/homoit0000568
related: https://homosaurus.org/v3/homoit0001246
related: https://homosaurus.org/v3/homoit0003070
related: https://homosaurus.org/v3/homoit0003851

Trans-exclusionary radical feminists
type: Concept
issued: 2024-01-02
modified: 2025-02-23
comment: A person who subscribes to a transphobic and transantagonistic ideology that rejects trans and gender diverse identities and rights, and believes that recognition of these identities and rights constitutes discrimination and oppression towards cisgender women. Though originally considered a fringe offshoot of feminism, trans-exclusionary radical feminist groups have formed alliances with right-wing, far-right extremists, and anti-feminist organizations in order to spread misinformation and further anti-trans sentiment and legislation. Use when resources are about trans-exclusionary radical feminists or when an individual identifies as such.
alternative label: Gender critical feminists
alternative label: TERFs
alternative label: Trans-exclusionary feminist
change note: Version 3.7.0
in scheme: v3
related: https://homosaurus.org/v3/homoit0000437
related: https://homosaurus.org/v3/homoit0003158

Two-Spirit operas
type: Concept
issued: 2024-01-09
modified: 2025-02-23
comment: Operas created by Two-Spirit directors, depicting Two-Spirit individuals, or that are regarded as important within Two-Spirit culture.
alternative label: 2S operas
alternative label: Two Spirit operas
alternative label: Two Spirited operas
alternative label: Two-Spirited operas
change note: Version 3.7.0
in scheme: v3
related: https://homosaurus.org/v3/homoit0002886
related: https://homosaurus.org/v3/homoit0002889
related: https://homosaurus.org/v3/homoit0002891
related: https://homosaurus.org/v3/homoit0003167

Womanists
type: Concept
issued: 2024-01-11
modified: 2025-02-23
comment: A person who subscribes to womanism, an ideology that grew out of the perceived indifference of the feminist movement towards the needs of Black women, who are often excluded from the categories of "female" and "femininity" as understood by white feminists. At the core of womanism is the idea that mainstream feminism is a movement led by white women to serve white women's goals, which can be indifferent or even oppositional to the needs of Black women. Use for resources about womanists or when an individual identifies as such.
change note: Version 3.7.0
in scheme: v3
related: https://homosaurus.org/v3/homoit0002272
related: https://homosaurus.org/v3/homoit0003170

Two-Spirit urban fantasy fiction
type: Concept
issued: 2024-01-18
modified: 2025-02-23
comment: A subgenre of fantasy fiction featuring magic and supernatural creatures in contemporary urban settings; use for urban fantasy focusing on Two-Spirit characters or themes.
change note: Version 3.7.0
in scheme: v3
preferred label: 2S urban fantasy fiction
preferred label: Two Spirit urban fantasy fiction
preferred label: Two Spirited urban fantasy fiction
preferred label: Two-Spirited urban fantasy fiction
related: https://homosaurus.org/v3/homoit0003179

Queer joy
type: Concept
issued: 2024-01-18
modified: 2025-02-23
comment: A positive feeling connected to queer community, activism, and/or culture that counters the impact of living in a discriminatory society. Note that queer is used as an umbrella term for the LGBTQ+ community within this phrase.
change note: Version 3.7.0
in scheme: v3
related: https://homosaurus.org/v3/homoit0001170
related: https://homosaurus.org/v3/homoit0002256
related: https://homosaurus.org/v3/homoit0003708

Two-Spirit solidarity
type: Concept
issued: 2024-04-16
modified: 2025-02-23
comment: A sense of fellowship and overall unity of purpose, political interest, and/or community sympathies based on shared experiences as Two-Spirit people.
alternative label: 2S solidarity
alternative label: Two Spirit solidarity
alternative label: Two Spirited solidarity
alternative label: Two-Spirited solidarity
change note: Version 3.7.0
in scheme: v3
related: https://homosaurus.org/v3/homoit0003195

Two-Spirit websites
type: Concept
issued: 2024-04-25
modified: 2025-02-23
comment: Public web pages that primarily address Two-Spirit communities and issues, as well as web pages intended for use by Two-Spirit people.
alternative label: 2S websites
alternative label: Two Spirit websites
alternative label: Two Spirited websites
alternative label: Two-Spirited websites
change note: Version 3.7.0
in scheme: v3
related: https://homosaurus.org/v3/homoit0000962

Polycules
type: Concept
issued: 2024-05-24
modified: 2025-02-23
comment: Networks of polyamorous people who are connected by their or their partners' romantic and/or sexual relationships. Polycule members are not necessarily romantically and/or sexually involved with every member of the group. For example, Member A might be connected to Member B in that Member B is in a relationship with Member A's partner.
change note: Version 3.7.0
in scheme: v3
related: https://homosaurus.org/v3/homoit0001636
related: https://homosaurus.org/v3/homoit0001660
related: https://homosaurus.org/v3/homoit0001663

Two-Spirit daughters
type: Concept
issued: 2024-05-24
modified: 2025-02-23
comment: Two-Spirit people who are daughters. Only use to describe individuals who identify as daughters.
alternative label: Two Spirit daughters
alternative label: Two Spirited daughters
alternative label: Two-Spirited daughters
change note: Version 3.7.0
in scheme: v3
related: https://homosaurus.org/v3/homoit0000330

Pregnant people
type: Concept
issued: 2024-06-19
modified: 2025-02-23
comment: People who are pregnant, meaning that a fertilized egg is developing in their uterus.
change note: Version 3.7.0
in scheme: v3
narrower: https://homosaurus.org/v3/homoit0003223
narrower: https://homosaurus.org/v3/homoit0003224
narrower: https://homosaurus.org/v3/homoit0003225
narrower: https://homosaurus.org/v3/homoit0003226
narrower: https://homosaurus.org/v3/homoit0003227
narrower: https://homosaurus.org/v3/homoit0003230
narrower: https://homosaurus.org/v3/homoit0003231

Bodily autonomy
type: Concept
issued: 2024-06-19
modified: 2025-02-23
comment: An individual's right to make informed decisions about their own body without external influence or coercion.
alternative label: Right to bodily autonomy
change note: Version 3.7.0
in scheme: v3
related: https://homosaurus.org/v3/homoit0003366
related: https://homosaurus.org/v3/homoit0003369
related: https://homosaurus.org/v3/homoit0003593

Reproductive health care for Two-Spirit people
type: Concept
issued: 2024-06-19
modified: 2025-02-23
comment: Access to and experiences with reproductive health care for Two-Spirit people. Reproductive health care includes birth control, abortion, assisted reproduction, and prenatal and obstetric care.
alternative label: 2S reproductive health care
alternative label: Reproductive health care for 2S people
alternative label: Reproductive health care for Two Spirit people
alternative label: Reproductive health care for Two Spirited people
alternative label: Reproductive health care for Two-Spirited people
alternative label: Two Spirit reproductive health care
alternative label: Two Spirited reproductive health care
alternative label: Two-Spirited reproductive health care
change note: Version 3.7.0
in scheme: v3
related: https://homosaurus.org/v3/homoit0003361
related: https://homosaurus.org/v3/homoit0003366

Reproductive rights
type: Concept
issued: 2024-07-11
modified: 2025-02-23
comment: Legal, social, or ethical principles of freedom around reproductive healthcare and decision-making. Often used to refer to an individual's right to bodily autonomy and access to legal and safe birth control, abortion, assisted reproduction, and prenatal and obstetric care.
change note: Version 3.7.0
in scheme: v3
related: https://homosaurus.org/v3/homoit0003361
related: https://homosaurus.org/v3/homoit0003365
related: https://homosaurus.org/v3/homoit0003367
related: https://homosaurus.org/v3/homoit0003593

Questioning
type: Concept
issued: 2024-07-31
modified: 2025-02-23
comment: A term used to describe individuals who are in the process of determining their sexual orientation and/or gender identity.
change note: Version 3.7.0
in scheme: v3
related: https://homosaurus.org/v3/homoit0000295
related: https://homosaurus.org/v3/homoit0003445

Patriarchy
type: Concept
issued: 2024-07-31
modified: 2025-02-23
comment: A cultural system in which positions of dominance and privilege are held by men, while women and other gender minorities are largely excluded from access to power.
alternative label: Androcracy
change note: Version 3.7.0
in scheme: v3
related: https://homosaurus.org/v3/homoit0000115
related: https://homosaurus.org/v3/homoit0000565
related: https://homosaurus.org/v3/homoit0001278

Two-Spirit political groups
type: Concept
issued: 2024-09-19
modified: 2025-02-23
comment: Organized groups centered on political change and action for Two-Spirit people's rights.
alternative label: Two-Spirited political groups
alternative label: 2S political groups
alternative label: Two Spirit political groups
alternative label: Two Spirited political groups
change note: Version 3.7.0
in scheme: v3
related: https://homosaurus.org/v3/homoit0002656
related: https://homosaurus.org/v3/homoit0003521

Reproductive justice
type: Concept
issued: 2024-10-22
modified: 2025-02-23
comment: Organized efforts to secure reproductive rights, including the legal, social, and ethical principles of freedom around reproductive healthcare and decision-making.
change note: Version 3.7.0
in scheme: v3
related: https://homosaurus.org/v3/homoit0003369
related: https://homosaurus.org/v3/homoit0003361
related: https://homosaurus.org/v3/homoit0003367

Two-Spirit events
type: Concept
issued: 2024-10-22
modified: 2025-02-23
comment: Organized public or social occasions for Two-Spirit people and communities.
alternative label: Two Spirit events
alternative label: Two-Spirited events
alternative label: Two Spirited events
alternative label: 2S events
change note: Version 3.7.0
in scheme: v3
related: https://homosaurus.org/v3/homoit0000861

LGBTQ+-affirming religious services
type: Concept
issued: 2024-10-22
modified: 2025-02-23
comment: Religious services, or gatherings of people belonging to the same religious group or belief system, that are accepting and supportive of LGBTQ+ people and their identities. Includes services specifically intended for LGBTQ+ people within a denomination or sect that is otherwise not LGBTQ+-affirming.
alternative label: LGBTQ+ affirming religious services
alternative label: LGBTQ+ religious services
alternative label: Religious services (LGBTQ)
change note: Version 3.7.0
in scheme: v3
related: https://homosaurus.org/v3/homoit0000530
related: https://homosaurus.org/v3/homoit0000928

Gentrification
type: Concept
issued: 2024-10-22
modified: 2025-02-23
comment: A process of economic and demographic change within a historically disinvested neighborhood by means of real estate investment and an influx of new, higher-income residents, typically resulting in the displacement of long-time, lower-income residents.
change note: Version 3.7.0
in scheme: v3
related: https://homosaurus.org/v3/homoit0000356
related: https://homosaurus.org/v3/homoit0002257
related: https://homosaurus.org/v3/homoit0003140
related: https://homosaurus.org/v3/homoit0002038
related: https://homosaurus.org/v3/homoit0003692

Redlining
type: Concept
issued: 2024-10-22
modified: 2025-02-23
comment: A discriminatory practice in which financial services are withheld from neighborhoods that have significant numbers of racial and ethnic minorities. Redlining includes but is not limited to denial of credit, insurance, and healthcare; inflated mortgage and interest rates; and the development of food deserts. The term has its roots in the New Deal when color-coded maps were made of metropolitan areas in the United States to indicate where it was considered safe to insure mortgages. Black neighborhoods and surrounding areas were colored red to indicate mortgages should not be insured there.
alternative label: Red lining
alternative label: Credit card redlining
change note: Version 3.7.0
in scheme: v3
related: https://homosaurus.org/v3/homoit0002257
related: https://homosaurus.org/v3/homoit0002038
related: https://homosaurus.org/v3/homoit0003691

Impact of COVID-19 pandemic on LGBTQ+ people
type: Concept
issued: 2024-10-23
modified: 2025-02-23
comment: The particular impact of the COVID-19 pandemic on LGBTQ+ people and communities, including changes in access to health care, intimate relationship dynamics and safer sex practices, financial stability, social connectedness, and mental health.
alternative label: COVID-19 pandemic impact on LGBTQ+ people
alternative label: Impact of pandemic on LGBTQ+ people
alternative label: Pandemic impact on LGBTQ+ people
alternative label: COVID-19 pandemic and LGBTQ+ people
alternative label: COVID-19 and LGBTQ+ people
change note: Version 3.7.0
in scheme: v3
related: https://homosaurus.org/v3/homoit0000614
related: https://homosaurus.org/v3/homoit0000947

LGBTQ+ philanthropy
type: Concept
issued: 2024-10-23
modified: 2025-02-23
comment: Efforts to improve the welfare of LGBTQ+ people and communities, especially by the donation of money or resources to charitable causes.
alternative label: Philanthropy (LGBTQ)
alternative label: LGBTQ+ charity
alternative label: Charity (LGBTQ)
change note: Version 3.7.0
in scheme: v3
related: https://homosaurus.org/v3/homoit0001026
related: https://homosaurus.org/v3/homoit0000006
related: https://homosaurus.org/v3/homoit0003696

Trans joy
type: Concept
issued: 2024-10-23
modified: 2025-02-23
comment: A positive feeling connected to trans identity, being, community, activism, and/or culture that counters the impact of living in a discriminatory society.
alternative label: Transgender joy
change note: Version 3.7.0
in scheme: v3
related: https://homosaurus.org/v3/homoit0003193
related: https://homosaurus.org/v3/homoit0002256
related: https://homosaurus.org/v3/homoit0001403

Megasexual documentaries
type: Concept
issued: 2024-10-23
modified: 2025-02-23
comment: Non-fictional films that center megasexual people or topics, created for the purposes of education, advocacy, or personal expression.
alternative label: Megasexual documentary films
change note: Version 3.7.0
in scheme: v3

Sexual fluidity
type: Concept
issued: 2024-10-23
modified: 2025-02-23
comment: The idea that a person's sexual orientation can change over time or in different situations.
change note: Version 3.7.0
in scheme: v3
related: https://homosaurus.org/v3/homoit0001306
related: https://homosaurus.org/v3/homoit0001300
related: https://homosaurus.org/v3/homoit0001315

Sex work abolition
type: Concept
issued: 2024-10-30
modified: 2025-02-23
comment: A movement to abolish sex work through a variety of different means, including supporting "end demand" laws, the Nordic model, or the broader criminalization of sex work; organizing and speaking vocally against sex work as inherently exploitative; and rejecting efforts to recognize sex work as labor.
alternative label: Abolition movement (Sex work)
alternative label: Sex work abolitionism
alternative label: Sex work abolition movement
change note: Version 3.7.0
in scheme: v3
narrower: https://homosaurus.org/v3/homoit0003776
related: https://homosaurus.org/v3/homoit0003773
related: https://homosaurus.org/v3/homoit0003774
related: https://homosaurus.org/v3/homoit0003765
related: https://homosaurus.org/v3/homoit0003775

Anti-sex worker discrimination
type: Concept
issued: 2024-10-30
modified: 2025-02-23
comment: The unjust or prejudicial treatment of sex workers due to their work or identity as a sex worker; may include the denial of legal rights, employment, and housing.
alternative label: Discrimination against sex workers
alternative label: Anti sex worker discrimination
alternative label: Anti-prostitute discrimination
alternative label: Anti prostitute discrimination
alternative label: Discrimination against prostitutes
change note: Version 3.7.0
in scheme: v3
related: https://homosaurus.org/v3/homoit0003787
related: https://homosaurus.org/v3/homoit0003788

Harm reduction (Sex work)
type: Concept
issued: 2024-10-30
modified: 2025-02-23
comment: A set of practical strategies and ideas aimed at reducing the negative impacts of sex work on sex workers, as well as a social justice movement advocating for the rights of sex workers.
change note: Version 3.7.0
in scheme: v3
related: https://homosaurus.org/v3/homoit0003790
related: https://homosaurus.org/v3/homoit0003791

Sex worker rights
type: Concept
issued: 2024-10-30
modified: 2025-02-23
comment: Legal, social, or ethical principles of freedom or entitlement held by or pursued by sex workers. This includes, but is not limited to, human rights, health rights, freedom from discrimination and prejudice, and labor rights.
alternative label: Sex workers' rights
alternative label: Rights of sex workers
alternative label: Prostitute rights
alternative label: Prostitutes' rights
alternative label: Rights of prostitutes
change note: Version 3.7.0
in scheme: v3
related: https://homosaurus.org/v3/homoit0003789
related: https://homosaurus.org/v3/homoit0003791

Sex work activism
type: Concept
issued: 2024-10-30
modified: 2025-02-23
comment: Direct action and organizing to achieve political or social change and acceptance for sex workers.
alternative label: Prostitution activism
change note: Version 3.7.0
in scheme: v3
related: https://homosaurus.org/v3/homoit0003790
related: https://homosaurus.org/v3/homoit0003789

Two-Spirit pornography
type: Concept
issued: 2024-10-30
modified: 2025-02-23
comment: Printed or visual materials that explicitly depict sexual acts. Use in reference to pornography featuring Two-Spirit performers and/or made for Two-Spirit people.
alternative label: 2S pornography
alternative label: Two-Spirited pornography
alternative label: Two Spirited pornography
alternative label: Two Spirit pornography
change note: Version 3.7.0
in scheme: v3
related: https://homosaurus.org/v3/homoit0003802

LGBTQ+ deaf people
type: Concept
is replaced by: homoit0001866
issued: 2019-05-14
modified: 2023-06-30
replaces: LGBTQDeafPeople
alternative label: Deaf people (LGBTQ)
alternative label: LGBTQ auditive disabled people
alternative label: LGBTQ deaf
alternative label: LGBTQ deaf-mutes
alternative label: LGBTQ deaf people
change note: Version 3.7.0
in scheme: v3
narrower: https://homosaurus.org/v3/homoit0002930

Bullying
type: Concept
issued: 2019-05-14
modified: 2025-02-23
replaces: bullying
comment: A form of aggressive behavior that can include verbal harassment, physical assault, or coercion. Bullying is typically directed repeatedly towards particular victims, often on the grounds of race, gender, sexuality, or ability.
change note: Version 3.7.0
in scheme: v3
narrower: https://homosaurus.org/v3/homoit0000324
related: https://homosaurus.org/v3/homoit0000611
related: https://homosaurus.org/v3/homoit0000920
related: https://homosaurus.org/v3/homoit0001989
related: https://homosaurus.org/v3/homoit0001998

Female genital mutilation
type: Concept
issued: 2019-05-14
modified: 2025-02-23
replaces: femaleGenitalMutilation
comment: The practice of cutting or removing the female genitals, sometimes to control sexual drive or punish lesbianism.
change note: Version 3.7.0
in scheme: v3
narrower: https://homosaurus.org/v3/homoit0000281
related: https://homosaurus.org/v3/homoit0000653

LGBTQ+-affirming religious groups
type: Concept
issued: 2019-05-14
modified: 2025-02-23
replaces: gayReligiousGroups
comment: Groups of people united by a religion or religious practices that are accepting and supportive of LGBTQ+ people and their identities. Includes large-scale organized groups, such as denominations or sects, as well as small-scale groups, such as specific churches, mosques, temples, or congregations.
alternative label: Gay religious groups
alternative label: Lesbian religious groups
alternative label: LGBTQ+ affirming religious groups
alternative label: LGBTQ+ inclusive religious groups
alternative label: LGBTQ+-inclusive religious groups
change note: Version 3.7.0
in scheme: v3
related: https://homosaurus.org/v3/homoit0003609

HIV-positive people
type: Concept
issued: 2019-05-14
modified: 2025-02-23
replaces: HIV-positivePeople
comment: People who have contracted HIV.
alternative label: HIV-seropositive people
change note: Version 3.7.0
in scheme: v3
narrower: https://homosaurus.org/v3/homoit0000640
related: https://homosaurus.org/v3/homoit0000005
related: https://homosaurus.org/v3/homoit0000226
related: https://homosaurus.org/v3/homoit0000635
related: https://homosaurus.org/v3/homoit0000638
related: https://homosaurus.org/v3/homoit0000639

Intersex genital mutilation
type: Concept
issued: 2019-05-14
modified: 2025-02-23
replaces: intersexGenitalMutilation
comment: Surgeries or other medical treatments performed, typically on newborn babies or children, to "normalize" the patient's reproductive or sexual anatomy and force their body to conform to medical or social expectations for what is male or female. IGM practices can be performed for cultural, social, or religious reasons. Though they are typically justified through a medical lens, IGM practices are medically unnecessary and non-consensual.
alternative label: IGM
change note: Version 3.7.0
in scheme: v3
narrower: https://homosaurus.org/v3/homoit0000281
narrower: https://homosaurus.org/v3/homoit0002847
related: https://homosaurus.org/v3/homoit0000352
related: https://homosaurus.org/v3/homoit0000618
related: https://homosaurus.org/v3/homoit0000666
related: https://homosaurus.org/v3/homoit0000673
related: https://homosaurus.org/v3/homoit0001268

LGBTQ+ books
type: Concept
issued: 2019-05-14
modified: 2025-02-23
replaces: LGBTQBooks
comment: Written works featuring LGBTQ+ characters or themes, or works intended to be read by LGBTQ+ people.
alternative label: LGBTQ books
change note: Version 3.7.0
in scheme: v3
narrower: https://homosaurus.org/v3/homoit0000831
related: https://homosaurus.org/v3/homoit0000216
related: https://homosaurus.org/v3/homoit0000825
related: https://homosaurus.org/v3/homoit0000826
related: https://homosaurus.org/v3/homoit0000968
related: https://homosaurus.org/v3/homoit0000972
related: https://homosaurus.org/v3/homoit0001132
related: https://homosaurus.org/v3/homoit0001723
related: https://homosaurus.org/v3/homoit0001752
related: https://homosaurus.org/v3/homoit0001753
related: https://homosaurus.org/v3/homoit0001754

LGBTQ+ choruses
type: Concept
issued: 2019-05-14
modified: 2025-02-23
replaces: LGBTQChoruses
comment: Organized groups of LGBTQ+ people who sing together.
alternative label: LGBTQ choirs
alternative label: LGBTQ choruses
change note: Version 3.7.0
in scheme: v3
narrower: https://homosaurus.org/v3/homoit0000482
narrower: https://homosaurus.org/v3/homoit0000730
related: https://homosaurus.org/v3/homoit0000816
related: https://homosaurus.org/v3/homoit0000836
related: https://homosaurus.org/v3/homoit0000908

LGBTQ+ death and dying
type: Concept
issued: 2019-05-14
modified: 2025-02-23
replaces: LGBTQDeathAndDying
comment: Experiences related to LGBTQ+ people approaching or having reached the end of their lives.
alternative label: LGBTQ death and dying
change note: Version 3.7.0
in scheme: v3
narrower: https://homosaurus.org/v3/homoit0000952
related: https://homosaurus.org/v3/homoit0000849
related: https://homosaurus.org/v3/homoit0000911
related: https://homosaurus.org/v3/homoit0001360
related: https://homosaurus.org/v3/homoit0002258

LGBTQ+ hotels
type: Concept
issued: 2019-05-14
modified: 2025-02-23
replaces: LGBTQHotels
comment: Establishments providing accommodations, meals, and other services for travelers; use in reference to hotels catering to LGBTQ+ people or commonly used by LGBTQ+ people.
alternative label: LGBTQ hotels
change note: Version 3.7.0
in scheme: v3
narrower: https://homosaurus.org/v3/homoit0000929
related: https://homosaurus.org/v3/homoit0000956

LGBTQ+ memorials
type: Concept
issued: 2019-05-14
modified: 2025-02-23
replaces: LGBTQMemorials
comment: Projects, events, monuments, and sculptures created to memorialize or celebrate LGBTQ+ people, communities, or events.
alternative label: LGBTQ memorials
change note: Version 3.7.0
in scheme: v3
narrower: https://homosaurus.org/v3/homoit0001408
related: https://homosaurus.org/v3/homoit0000028
related: https://homosaurus.org/v3/homoit0000029
related: https://homosaurus.org/v3/homoit0002260

LGBTQ+ night life
type: Concept
issued: 2019-05-14
modified: 2025-02-23
replaces: LGBTQNightLife
comment: Nighttime social activities and entertainment catering to LGBTQ+ people, often located at bars and clubs.
alternative label: LGBTQ night life
change note: Version 3.7.0
in scheme: v3
narrower: https://homosaurus.org/v3/homoit0000475
narrower: https://homosaurus.org/v3/homoit0000488
related: https://homosaurus.org/v3/homoit0000100
related: https://homosaurus.org/v3/homoit0000892
related: https://homosaurus.org/v3/homoit0000900
related: https://homosaurus.org/v3/homoit0000930
related: https://homosaurus.org/v3/homoit0002385

LGBTQ+ riots
type: Concept
issued: 2019-05-14
modified: 2025-02-23
replaces: LGBTQRiots
comment: Civil disorder directed against authorities, property, and other individuals, typically in response to grievances, conflicts, or injustice; use in reference to riots involving LGBTQ+ people or in response to LGBTQ+ issues.
alternative label: LGBTQ riots
change note: Version 3.7.0
in scheme: v3
narrower: https://homosaurus.org/v3/homoit0001341
related: https://homosaurus.org/v3/homoit0000851

Massage
type: Concept
issued: 2019-05-14
modified: 2025-02-23
replaces: massage
comment: Manipulation of the body through techniques like rubbing and kneading muscles and joints with the hands, typically to relieve tension and pain or to provide erotic stimulation.
change note: Version 3.7.0
in scheme: v3
narrower: https://homosaurus.org/v3/homoit0000402
related: https://homosaurus.org/v3/homoit0001112

Mental disorders
type: Concept
issued: 2019-05-14
modified: 2025-02-23
replaces: mentalDisorders
comment: Medical conditions defined by changes or disturbances in an individual's thinking, feeling, mood, and behavior.
alternative label: Mental illnesses
alternative label: Psychiatric disorders
change note: Version 3.7.0
in scheme: v3
narrower: https://homosaurus.org/v3/homoit0000392

Misogyny
type: Concept
issued: 2019-05-14
modified: 2025-02-23
replaces: misogyny
comment: Hate or dislike of women or girls.
change note: Version 3.7.0
in scheme: v3
narrower: https://homosaurus.org/v3/homoit0002183
related: https://homosaurus.org/v3/homoit0000112
related: https://homosaurus.org/v3/homoit0001133
related: https://homosaurus.org/v3/homoit0001892
related: https://homosaurus.org/v3/homoit0001903
related: https://homosaurus.org/v3/homoit0001904

Nude art
type: Concept
issued: 2019-05-14
modified: 2025-02-23
replaces: nudes
comment: Works of art depicting naked individuals, either for aesthetic or erotic purposes; includes paintings, photographs, sculptures, etc.
change note: Version 3.7.0
in scheme: v3
narrower: https://homosaurus.org/v3/homoit0001051
related: https://homosaurus.org/v3/homoit0000816
related: https://homosaurus.org/v3/homoit0002579

Queer (Verb)
type: Concept
issued: 2019-05-14
modified: 2025-02-23
replaces: queerVerb
comment: A term commonly used in academic disciplines to describe actions that address sexual and gender normativity, expose systems of oppression, and attempt to undermine those systems.
change note: Version 3.7.0
in scheme: v3
narrower: https://homosaurus.org/v3/homoit0002180
related: https://homosaurus.org/v3/homoit0000579
related: https://homosaurus.org/v3/homoit0000972
related: https://homosaurus.org/v3/homoit0001156
related: https://homosaurus.org/v3/homoit0001219
related: https://homosaurus.org/v3/homoit0001891
related: https://homosaurus.org/v3/homoit0002042
related: https://homosaurus.org/v3/homoit0002577

Risk behaviors
type: Concept
issued: 2019-05-14
modified: 2025-02-23
replaces: riskBehaviours
comment: Behaviors that may put someone at increased risk of contracting HIV or STIs.
change note: Version 3.7.0
in scheme: v3
narrower: https://homosaurus.org/v3/homoit0000099
narrower: https://homosaurus.org/v3/homoit0003129
preferred label: Risk behaviours
related: https://homosaurus.org/v3/homoit0001251
related: https://homosaurus.org/v3/homoit0001287

LGBTQ+ periodicals
type: Concept
issued: 2022-02-14
modified: 2025-02-23
comment: Publications or serials by or about LGBTQ+ people; use a more specific term if possible.
alternative label: LGBTQ+ serials
alternative label: Periodicals (LGBTQ)
alternative label: Serials (LGBTQ)
change note: Version 3.7.0
in scheme: v3
narrower: https://homosaurus.org/v3/homoit0000031
narrower: https://homosaurus.org/v3/homoit0000896
narrower: https://homosaurus.org/v3/homoit0001041
narrower: https://homosaurus.org/v3/homoit0001042
related: https://homosaurus.org/v3/homoit0000923
related: https://homosaurus.org/v3/homoit0000965
related: https://homosaurus.org/v3/homoit0001144

Inclusivity
type: Concept
issued: 2022-11-10
modified: 2025-02-23
comment: The practice or policy of providing equal access and support to groups of people who might otherwise be excluded or marginalized, such as LGBTQ+ people, people of color, disabled people, etc.
alternative label: Inclusion
alternative label: Inclusive
change note: Version 3.7.0
in scheme: v3
narrower: https://homosaurus.org/v3/homoit0001818
narrower: https://homosaurus.org/v3/homoit0001819

Two-Spirit art
type: Concept
issued: 2023-04-14
modified: 2025-02-23
comment: Term for different forms of creative activity, including visual, material, and performing arts, by Two-Sprit artists or about Two-Spirit topics and communities.
alternative label: 2S art
alternative label: Two Spirit art
alternative label: Two Spirited art
alternative label: Two-Spirited art
change note: Version 3.7.0
in scheme: v3
narrower: https://homosaurus.org/v3/homoit0002606
related: https://homosaurus.org/v3/homoit0000816

Anti-kink discrimination
type: Concept
issued: 2023-12-20
modified: 2025-02-23
comment: The unjust or prejudicial treatment of individuals or communities due to their kinks and/or kinky sexual practices; may include adverse legal judgment and/or the denial of legal rights, employment, and housing.
change note: Version 3.7.0
in scheme: v3
narrower: https://homosaurus.org/v3/homoit0003141
related: https://homosaurus.org/v3/homoit0000442
related: https://homosaurus.org/v3/homoit0000705
related: https://homosaurus.org/v3/homoit0003084
related: https://homosaurus.org/v3/homoit0003691

Women's events
type: Concept
issued: 2024-10-22
modified: 2025-02-23
comment: Organized public or social occasions for women.
change note: Version 3.7.0
in scheme: v3
narrower: https://homosaurus.org/v3/homoit0001515
related: https://homosaurus.org/v3/homoit0000861

Solicitation of sex work
type: Concept
issued: 2024-10-30
modified: 2025-02-23
comment: The act of offering or attempting to exchange money or goods for sexual services or performances.
alternative label: Soliciting
change note: Version 3.7.0
in scheme: v3
narrower: https://homosaurus.org/v3/homoit0003778
related: https://homosaurus.org/v3/homoit0000278

Anti-sex worker violence
type: Concept
issued: 2024-10-30
modified: 2025-02-23
comment: Behavior involving physical force intended to harm or kill sex workers on the basis of their work or identity as a sex worker.
alternative label: Violence against sex workers
alternative label: Anti sex worker violence
alternative label: Anti-prostitute violence
alternative label: Anti prostitute violence
alternative label: Violence against prostitutes
change note: Version 3.7.0
in scheme: v3
narrower: https://homosaurus.org/v3/homoit0003788
related: https://homosaurus.org/v3/homoit0000109
related: https://homosaurus.org/v3/homoit0003786

Substance abuse
type: Concept
is replaced by: homoit0002226
issued: 2019-05-14
modified: 2022-12-16
replaces: substanceAbuse
comment: Abuse of or dependence on addictive substances such as drugs or alcohol.
alternative label: Chemical dependency
change note: Version 3.7.0
in scheme: v3

Body adornment
type: Concept
issued: 2019-05-14
modified: 2025-02-23
replaces: bodyAdornments
comment: Decoration or alteration of the human body for aesthetic or cultural purposes; includes body paint, tattooing, piercing, and scarification.
alternative label: Body decoration
alternative label: Body alteration
alternative label: Body modification
change note: Version 3.7.0
in scheme: v3
narrower: https://homosaurus.org/v3/homoit0001114
narrower: https://homosaurus.org/v3/homoit0001356
related: https://homosaurus.org/v3/homoit0000294
related: https://homosaurus.org/v3/homoit0003076

Castration
type: Concept
issued: 2019-05-14
modified: 2025-02-23
replaces: castration
comment: Removal of the testes or use of the testes, typically through surgical or chemical means. Includes castration voluntarily undertaken as a gender-affirming surgical procedure or as part of a religious rite. For involuntary castration enacted by legal authorities or as a hate crime, use the term "Forced castration."
change note: Version 3.7.0
in scheme: v3
narrower: https://homosaurus.org/v3/homoit0000449
narrower: https://homosaurus.org/v3/homoit0001060
narrower: https://homosaurus.org/v3/homoit0001097
related: https://homosaurus.org/v3/homoit0000240
related: https://homosaurus.org/v3/homoit0000302

Sex workers' clients
type: Concept
issued: 2019-05-14
modified: 2025-02-23
replaces: prostitutesClients
comment: People who provide money or goods to sex workers in exchange for sexual services, performances, or companionship.
alternative label: Johns
alternative label: Tricks
alternative label: Prostitutes' clients
alternative label: Prostitutes' customers
alternative label: Sex workers' customers
alternative label: Sex-buyers
alternative label: Janes
alternative label: Curb crawlers
alternative label: Punters
change note: Version 3.7.0
in scheme: v3
narrower: https://homosaurus.org/v3/homoit0003794
narrower: https://homosaurus.org/v3/homoit0003795
related: https://homosaurus.org/v3/homoit0003778
related: https://homosaurus.org/v3/homoit0003779

Consent
type: Concept
issued: 2019-05-14
modified: 2025-02-23
replaces: consent
comment: Permission or agreement for a set of actions to occur, particularly in a sexual encounter and/or within a relational dynamic.
change note: Version 3.7.0
in scheme: v3
narrower: https://homosaurus.org/v3/homoit0000020
narrower: https://homosaurus.org/v3/homoit0002844
related: https://homosaurus.org/v3/homoit0000241
related: https://homosaurus.org/v3/homoit0000442
related: https://homosaurus.org/v3/homoit0000855
related: https://homosaurus.org/v3/homoit0000938
related: https://homosaurus.org/v3/homoit0000958
related: https://homosaurus.org/v3/homoit0000959
related: https://homosaurus.org/v3/homoit0001123
related: https://homosaurus.org/v3/homoit0001124
related: https://homosaurus.org/v3/homoit0001133
related: https://homosaurus.org/v3/homoit0001267
related: https://homosaurus.org/v3/homoit0001299
related: https://homosaurus.org/v3/homoit0002195
related: https://homosaurus.org/v3/homoit0002215

Gender dysphoria
type: Concept
issued: 2019-05-14
modified: 2025-02-23
replaces: genderDysphoria
comment: A psychological diagnosis (replacing the outdated and offensive "gender identity disorder") used to describe the sense of unease or dissatisfaction an individual feels as a result of incongruence between their gender identity and their assigned gender, gender expression, and/or the way their gender is perceived by others. This term is also used colloquially by individuals to describe the discomfort and distress they experience as a result of this incongruence. Though gender dysphoria is often associated with trans people, people of any identity may experience gender dysphoria when they do not feel "right" in their body or the way their gender is being expressed.
change note: Version 3.7.0
in scheme: v3
narrower: https://homosaurus.org/v3/homoit0002699
narrower: https://homosaurus.org/v3/homoit0002700
related: https://homosaurus.org/v3/homoit0000120
related: https://homosaurus.org/v3/homoit0000567
related: https://homosaurus.org/v3/homoit0000568
related: https://homosaurus.org/v3/homoit0000571
related: https://homosaurus.org/v3/homoit0000572
related: https://homosaurus.org/v3/homoit0001006
related: https://homosaurus.org/v3/homoit0002256

Hypersexuality
type: Concept
issued: 2019-05-14
modified: 2025-02-23
replaces: hypersexuality
comment: Term used to describe a level or frequency of sexual desire that is perceived as excessive within a given culture. Though the medical community has not reached a consensus as to whether hypersexuality should be included as a clinical diagnosis, doctors and psychologists have historically diagnosed LGBTQ+ people with hypersexuality (or other related labels) in order to wrongly treat their identities and desires as medical disorders. Should only be used in a historical context or if an individual self-identifies with the term.
alternative label: Nymphomania
alternative label: Satyriasis
alternative label: Andromania
alternative label: Clitoromania
alternative label: Don Juan syndrome
alternative label: Don Juanism
alternative label: Estromania
alternative label: Excessive sex drive
alternative label: Furor amatorius
alternative label: Furor uterinus
alternative label: Hyper-sexuality
alternative label: Hyperactive sexual desire disorder
alternative label: Hyperaesthesia
alternative label: Hypereroticism
alternative label: Hyperlibido
alternative label: Hyperphilia
alternative label: Hypersensuality
alternative label: Hypersexual disorder
alternative label: Messalina syndrome
alternative label: Œstromania
alternative label: Oversexuality
alternative label: Satyrism
alternative label: Satyromania
alternative label: Sexual hyperesthesia
alternative label: Sexual hyperversion
change note: Version 3.7.0
in scheme: v3
narrower: https://homosaurus.org/v3/homoit0001284
related: https://homosaurus.org/v3/homoit0001283
related: https://homosaurus.org/v3/homoit0001306
related: https://homosaurus.org/v3/homoit0001538

Lesbian separatism
type: Concept
issued: 2019-05-14
modified: 2025-02-23
replaces: lesbianSeparatism
comment: Ideological, social, cultural, and physical separation between men and women or between lesbians and heterosexual women.
change note: Version 3.7.0
in scheme: v3
narrower: https://homosaurus.org/v3/homoit0000746
narrower: https://homosaurus.org/v3/homoit0000757
related: https://homosaurus.org/v3/homoit0000575

LGBTQ+ awards
type: Concept
issued: 2019-05-14
modified: 2025-02-23
replaces: LGBTQAwards
comment: Prizes or forms of recognition given in honor of achievements by LBGTQ+ individuals or in support of LGBTQ+ issues or communities.
alternative label: LGBTQ awards
change note: Version 3.7.0
in scheme: v3
narrower: https://homosaurus.org/v3/homoit0000891
narrower: https://homosaurus.org/v3/homoit0003106

Sexual dysfunction
type: Concept
issued: 2019-05-14
modified: 2025-02-23
replaces: sexualDysfunction
comment: Recurring problems or difficulties with sexual response, desire, or pleasure. Includes dysfunction occurring at any time in the sexual response cycle that causes distress or prevents one’s typical sexual function.
alternative label: Sexual malfunction
change note: Version 3.7.0
in scheme: v3
narrower: https://homosaurus.org/v3/homoit0000398
narrower: https://homosaurus.org/v3/homoit0001489
related: https://homosaurus.org/v3/homoit0001274
related: https://homosaurus.org/v3/homoit0001284
related: https://homosaurus.org/v3/homoit0001292
related: https://homosaurus.org/v3/homoit0001294
related: https://homosaurus.org/v3/homoit0001306

Breast size
type: Concept
issued: 2020-12-11
modified: 2025-02-23
replaces: breastSize
comment: The dimensions of an individual's breast tissue; can be used as an approximation (e.g., large breasts, small breasts) or to reference to standards of measurement for bras and other support garments.
change note: Version 3.7.0
in scheme: v3
narrower: https://homosaurus.org/v3/homoit0001630
narrower: https://homosaurus.org/v3/homoit0001639
related: https://homosaurus.org/v3/homoit0000222

2SLGBTQ+
type: Concept
issued: 2021-12-14
modified: 2025-02-23
comment: Abbreviation used to describe Two-Spirit people, lesbians, gay men, bisexual people, transgender people, queer people, and other gender and sexual minorities as a group; commonly used in Canada to emphasize the particularities of Indigenous people's experiences.
alternative label: LGBTQ2S+
change note: Version 3.7.0
in scheme: v3
narrower: https://homosaurus.org/v3/homoit0000807
related: https://homosaurus.org/v3/homoit0000143
related: https://homosaurus.org/v3/homoit0000485
related: https://homosaurus.org/v3/homoit0000733
related: https://homosaurus.org/v3/homoit0001170
related: https://homosaurus.org/v3/homoit0001403

Gender minorities
type: Concept
issued: 2022-02-14
modified: 2025-02-23
comment: Individuals whose gender identities and practices differ from those of the dominant culture. Use the term "Sexual minorities" for individuals whose sexual identities, orientations, and practices differ from those of the dominant culture.
alternative label: Gender variance
alternative label: Gender variant people
alternative label: Non-normative genders
change note: Version 3.7.0
in scheme: v3
narrower: https://homosaurus.org/v3/homoit0000021
narrower: https://homosaurus.org/v3/homoit0000045
narrower: https://homosaurus.org/v3/homoit0000316
narrower: https://homosaurus.org/v3/homoit0000342
narrower: https://homosaurus.org/v3/homoit0000570
narrower: https://homosaurus.org/v3/homoit0000574
narrower: https://homosaurus.org/v3/homoit0000582
narrower: https://homosaurus.org/v3/homoit0001072
narrower: https://homosaurus.org/v3/homoit0001378
narrower: https://homosaurus.org/v3/homoit0001470
narrower: https://homosaurus.org/v3/homoit0001474
narrower: https://homosaurus.org/v3/homoit0001668
related: https://homosaurus.org/v3/homoit0000560
related: https://homosaurus.org/v3/homoit0000566
related: https://homosaurus.org/v3/homoit0000571
related: https://homosaurus.org/v3/homoit0000577
related: https://homosaurus.org/v3/homoit0000581
related: https://homosaurus.org/v3/homoit0001297
related: https://homosaurus.org/v3/homoit0001816
related: https://homosaurus.org/v3/homoit0001829

Racism
type: Concept
issued: 2022-06-15
modified: 2025-02-23
comment: The belief that groups of human beings possess different inherent behavioral traits that correspond to inherited attributes and can be divided based on the superiority of one race over another. This term also encompasses prejudice, discrimination, and antagonism (whether personal or systematic) directed against other people because of their race and its perceived inferiority.
change note: Version 3.7.0
in scheme: v3
narrower: https://homosaurus.org/v3/homoit0002194
narrower: https://homosaurus.org/v3/homoit0002257
related: https://homosaurus.org/v3/homoit0001902
related: https://homosaurus.org/v3/homoit0001903
related: https://homosaurus.org/v3/homoit0001904
related: https://homosaurus.org/v3/homoit0002269
related: https://homosaurus.org/v3/homoit0002270
related: https://homosaurus.org/v3/homoit0002271
related: https://homosaurus.org/v3/homoit0002272
related: https://homosaurus.org/v3/homoit0003691
related: https://homosaurus.org/v3/homoit0003692

Two-Spirit films
type: Concept
issued: 2023-04-12
modified: 2025-02-23
comment: Motion pictures, or movies, created by Two-Spirit directors, depicting Two-Spirit people, or that are regarded as important within Two-Spirit culture.
alternative label: 2S films
alternative label: Two Spirit films
alternative label: Two Spirited films
alternative label: Two-Spirited films
change note: Version 3.7.0
in scheme: v3
narrower: https://homosaurus.org/v3/homoit0002545
related: https://homosaurus.org/v3/homoit0000869

Appropriation of marginalized identities
type: Concept
issued: 2023-04-14
modified: 2025-02-23
comment: Falsely claiming belonging to a marginalized group (including, but not limited to: disability, ethnicity, race, and sexuality).
change note: Version 3.7.0
in scheme: v3
narrower: https://homosaurus.org/v3/homoit0002580

Human trafficking
type: Concept
issued: 2024-10-30
modified: 2025-02-23
comment: The trade and exploitation of human beings through force, fraud, and/or coercion, often with the intention of compelling the individual to provide sexual services or other forms of labor against their will.
alternative label: People trafficking
change note: Version 3.7.0
in scheme: v3
narrower: https://homosaurus.org/v3/homoit0003743
narrower: https://homosaurus.org/v3/homoit0003744

Cisgender people
type: Concept
issued: 2019-05-14
modified: 2025-02-23
replaces: cisgenderPeople
comment: Individuals whose gender identity matches the gender or sex they were assigned at birth.
alternative label: Cis people
change note: Version 3.7.0
in scheme: v3
narrower: https://homosaurus.org/v3/homoit0000270
narrower: https://homosaurus.org/v3/homoit0000272
narrower: https://homosaurus.org/v3/homoit0002281
narrower: https://homosaurus.org/v3/homoit0002282
related: https://homosaurus.org/v3/homoit0000120
related: https://homosaurus.org/v3/homoit0000273
related: https://homosaurus.org/v3/homoit0000322
related: https://homosaurus.org/v3/homoit0000571
related: https://homosaurus.org/v3/homoit0001008
related: https://homosaurus.org/v3/homoit0001378
related: https://homosaurus.org/v3/homoit0001509
related: https://homosaurus.org/v3/homoit0001652
related: https://homosaurus.org/v3/homoit0001653
related: https://homosaurus.org/v3/homoit0001925

Detention of LGBTQ+ people
type: Concept
issued: 2019-05-14
modified: 2025-02-23
replaces: detentionOfLGBTQPeople
comment: Temporary physical and legal confinement of LGBTQ+ people by an institution or authority, typically pending criminal charges or deportation. Can also be used to describe individuals held in custody for political purposes or within the context of war.
alternative label: Detention of LGBTQ people
change note: Version 3.7.0
in scheme: v3
narrower: https://homosaurus.org/v3/homoit0000068
narrower: https://homosaurus.org/v3/homoit0000349
narrower: https://homosaurus.org/v3/homoit0000884
related: https://homosaurus.org/v3/homoit0000712
related: https://homosaurus.org/v3/homoit0000883
related: https://homosaurus.org/v3/homoit0000887

Diversity
type: Concept
issued: 2019-05-14
modified: 2025-02-23
replaces: diversity
comment: Diversity in characteristics of people in age, gender, religion, ethnicity, sexual orientation, lifestyle, etc.
change note: Version 3.7.0
in scheme: v3
narrower: https://homosaurus.org/v3/homoit0000566
narrower: https://homosaurus.org/v3/homoit0001290
related: https://homosaurus.org/v3/homoit0000667

Information provision
type: Concept
issued: 2019-05-14
modified: 2025-02-23
replaces: informationProvision
comment: Process by which information is provided to individuals or communities.
change note: Version 3.7.0
in scheme: v3
narrower: https://homosaurus.org/v3/homoit0000027
narrower: https://homosaurus.org/v3/homoit0000877
narrower: https://homosaurus.org/v3/homoit0001271
related: https://homosaurus.org/v3/homoit0000660
related: https://homosaurus.org/v3/homoit0003617

LGBTI
type: Concept
issued: 2019-05-14
modified: 2025-02-23
replaces: LGBTI
comment: Acronym used to describe lesbians, gay men, bisexual people, transgender people, and intersex people as a group.
change note: Version 3.7.0
in scheme: v3
narrower: https://homosaurus.org/v3/homoit0000594
narrower: https://homosaurus.org/v3/homoit0000804
related: https://homosaurus.org/v3/homoit0000143
related: https://homosaurus.org/v3/homoit0000485
related: https://homosaurus.org/v3/homoit0000672
related: https://homosaurus.org/v3/homoit0000733
related: https://homosaurus.org/v3/homoit0001297
related: https://homosaurus.org/v3/homoit0001403
related: https://homosaurus.org/v3/homoit0001463

LGBTQ+ tourism
type: Concept
issued: 2019-05-14
modified: 2025-02-23
replaces: LGBTQTourism
comment: Industry centered around LGBTQ+ people traveling to and staying in various locations for recreation or leisure.
alternative label: LGBTQ tourism
change note: Version 3.7.0
in scheme: v3
narrower: https://homosaurus.org/v3/homoit0000845
narrower: https://homosaurus.org/v3/homoit0003262
narrower: https://homosaurus.org/v3/homoit0003279
related: https://homosaurus.org/v3/homoit0000881
related: https://homosaurus.org/v3/homoit0000930

Sexual preference
type: Concept
issued: 2019-05-14
modified: 2025-02-23
replaces: sexualPreference
comment: An enduring pattern of sexual attraction towards a certain sex or multiple sexes, as well as characterizations, objects, situational fantasies, or behaviors; generally understood to be either or both biologically determined and culturally and/or sociologically dictated.
change note: Version 3.7.0
in scheme: v3
narrower: https://homosaurus.org/v3/homoit0000036
narrower: https://homosaurus.org/v3/homoit0000344
narrower: https://homosaurus.org/v3/homoit0000442
narrower: https://homosaurus.org/v3/homoit0000997
narrower: https://homosaurus.org/v3/homoit0001081
narrower: https://homosaurus.org/v3/homoit0001094
narrower: https://homosaurus.org/v3/homoit0001250
narrower: https://homosaurus.org/v3/homoit0001304
narrower: https://homosaurus.org/v3/homoit0001558
narrower: https://homosaurus.org/v3/homoit0001814
related: https://homosaurus.org/v3/homoit0000242
related: https://homosaurus.org/v3/homoit0000303
related: https://homosaurus.org/v3/homoit0001095
related: https://homosaurus.org/v3/homoit0001286
related: https://homosaurus.org/v3/homoit0001287
related: https://homosaurus.org/v3/homoit0001290
related: https://homosaurus.org/v3/homoit0001295
related: https://homosaurus.org/v3/homoit0001296
related: https://homosaurus.org/v3/homoit0001297
related: https://homosaurus.org/v3/homoit0001298
related: https://homosaurus.org/v3/homoit0001302
related: https://homosaurus.org/v3/homoit0001311
related: https://homosaurus.org/v3/homoit0001315
related: https://homosaurus.org/v3/homoit0001493
related: https://homosaurus.org/v3/homoit0001556
related: https://homosaurus.org/v3/homoit0001915
related: https://homosaurus.org/v3/homoit0001917
related: https://homosaurus.org/v3/homoit0003738

Sexuality
type: Concept
issued: 2019-05-14
modified: 2025-02-23
replaces: sexuality
comment: Term used to describe the ways in which individuals experience and express themselves sexually, including the types of people and practices they are sexually interested in.
change note: Version 3.7.0
in scheme: v3
narrower: https://homosaurus.org/v3/homoit0000263
narrower: https://homosaurus.org/v3/homoit0001061
narrower: https://homosaurus.org/v3/homoit0003613
related: https://homosaurus.org/v3/homoit0000050
related: https://homosaurus.org/v3/homoit0000242
related: https://homosaurus.org/v3/homoit0000325
related: https://homosaurus.org/v3/homoit0000404
related: https://homosaurus.org/v3/homoit0000579
related: https://homosaurus.org/v3/homoit0000603
related: https://homosaurus.org/v3/homoit0000656
related: https://homosaurus.org/v3/homoit0000967
related: https://homosaurus.org/v3/homoit0000974
related: https://homosaurus.org/v3/homoit0001062
related: https://homosaurus.org/v3/homoit0001142
related: https://homosaurus.org/v3/homoit0001262
related: https://homosaurus.org/v3/homoit0001266
related: https://homosaurus.org/v3/homoit0001267
related: https://homosaurus.org/v3/homoit0001272
related: https://homosaurus.org/v3/homoit0001280
related: https://homosaurus.org/v3/homoit0001281
related: https://homosaurus.org/v3/homoit0001282
related: https://homosaurus.org/v3/homoit0001284
related: https://homosaurus.org/v3/homoit0001286
related: https://homosaurus.org/v3/homoit0001291
related: https://homosaurus.org/v3/homoit0001292
related: https://homosaurus.org/v3/homoit0001297
related: https://homosaurus.org/v3/homoit0001299
related: https://homosaurus.org/v3/homoit0001301
related: https://homosaurus.org/v3/homoit0001304
related: https://homosaurus.org/v3/homoit0001315
related: https://homosaurus.org/v3/homoit0001806
related: https://homosaurus.org/v3/homoit0001901
related: https://homosaurus.org/v3/homoit0003738

STDs
type: Concept
issued: 2019-05-14
modified: 2025-02-23
replaces: STDs
comment: Diseases or infections that are transmitted via sexual contact or activity.
alternative label: Sexually transmitted diseases
alternative label: VD
alternative label: Venereal diseases
alternative label: STIs
alternative label: Sexually transmitted infections
change note: Version 3.7.0
in scheme: v3
narrower: https://homosaurus.org/v3/homoit0000005
related: https://homosaurus.org/v3/homoit0001080

Assisted reproductive technology
type: Concept
issued: 2023-04-14
modified: 2025-02-23
comment: An umbrella term used to describe all methods of conception beyond sexual intercourse, including but not limited to donor insemination, artificial insemination, surrogacy, egg donation, and IVF.
alternative label: ART
alternative label: Assisted reproductive technologies
change note: Version 3.7.0
in scheme: v3
narrower: https://homosaurus.org/v3/homoit0002618

Two-Spirit literature
type: Concept
issued: 2023-06-27
modified: 2025-02-23
comment: Written literary works about Two-Spirit characters or themes.
alternative label: 2S literature
alternative label: Two Spirit literature
alternative label: Two Spirited literature
alternative label: Two-Spirited literature
change note: Version 3.7.0
in scheme: v3
narrower: https://homosaurus.org/v3/homoit0001751
narrower: https://homosaurus.org/v3/homoit0002712
narrower: https://homosaurus.org/v3/homoit0003498
related: https://homosaurus.org/v3/homoit0000972
related: https://homosaurus.org/v3/homoit0001750

Two-Spirit press
type: Concept
issued: 2023-06-27
modified: 2025-02-23
comment: Newspapers, magazines, or other publishing outlets aimed at Two-Spirit audiences and/or operated by Two-Spirit people.
alternative label: 2S press
alternative label: Two Spirit press
alternative label: Two Spirited press
alternative label: Two-Spirited press
change note: Version 3.7.0
in scheme: v3
narrower: https://homosaurus.org/v3/homoit0002714
narrower: https://homosaurus.org/v3/homoit0002715
narrower: https://homosaurus.org/v3/homoit0003153
related: https://homosaurus.org/v3/homoit0001132

Third parties (Sex work)
type: Concept
issued: 2024-10-30
modified: 2025-02-23
comment: A legal term for individuals who supervise, coordinate, assist, or facilitate sex work, either on behalf of sex workers or their clients. Third parties include managers, brothel-keepers, concierges, drivers etc.
change note: Version 3.7.0
in scheme: v3
narrower: https://homosaurus.org/v3/homoit0003783
narrower: https://homosaurus.org/v3/homoit0003784
narrower: https://homosaurus.org/v3/homoit0003785

LGBTQ+ theology
type: Concept
is replaced by: homoit0001218
issued: 2019-05-14
modified: 2022-11-17
replaces: theologyLGBTQ
alternative label: Theology (LGBTQ)
change note: Version 3.7.0
in scheme: v3
narrower: https://homosaurus.org/v3/homoit0001218
related: https://homosaurus.org/v3/homoit0000928

Censorship
type: Concept
issued: 2019-05-14
modified: 2025-02-23
replaces: censorship
comment: Suppression of speech, public communication, images, ideas, or other information by institutions, authorities, or other controlling bodies, typically because the material has been deemed objectionable, harmful, or sensitive.
change note: Version 3.7.0
in scheme: v3
narrower: https://homosaurus.org/v3/homoit0000829

Substance use in LGBTQ+ communities
type: Concept
issued: 2019-05-14
modified: 2025-02-23
replaces: drugs
comment: The use of substances (that are typically deemed harmful or are subject to legal restriction, such as drugs or alcohol) and discussions surrounding the particular impact of substance use within LGBTQ+ communities.
alternative label: Alcohol use (LGBTQ)
alternative label: Alcohol use in LGBTQ+ communities
alternative label: Drug use (LGBTQ)
alternative label: Drug use in LGBTQ+ communities
alternative label: LGBTQ+ substance use
alternative label: Substance use (LGBTQ)
change note: Version 3.7.0
in scheme: v3
narrower: https://homosaurus.org/v3/homoit0001550
related: https://homosaurus.org/v3/homoit0001007
related: https://homosaurus.org/v3/homoit0001125
related: https://homosaurus.org/v3/homoit0001235
related: https://homosaurus.org/v3/homoit0001549
related: https://homosaurus.org/v3/homoit0002226
related: https://homosaurus.org/v3/homoit0002229

LGBTQ+ parenthood
type: Concept
issued: 2019-05-14
modified: 2025-02-23
replaces: LGBTQParenthood
comment: The experiences of being an LGBTQ+ parent and the responsibilities involved.
alternative label: Parenting
alternative label: LGBTQ parenthood
change note: Version 3.7.0
in scheme: v3
narrower: https://homosaurus.org/v3/homoit0000009
narrower: https://homosaurus.org/v3/homoit0000116
narrower: https://homosaurus.org/v3/homoit0000811
narrower: https://homosaurus.org/v3/homoit0000812
narrower: https://homosaurus.org/v3/homoit0000839
narrower: https://homosaurus.org/v3/homoit0000866
narrower: https://homosaurus.org/v3/homoit0000871
narrower: https://homosaurus.org/v3/homoit0000905
narrower: https://homosaurus.org/v3/homoit0000945
related: https://homosaurus.org/v3/homoit0000347
related: https://homosaurus.org/v3/homoit0000420
related: https://homosaurus.org/v3/homoit0000583
related: https://homosaurus.org/v3/homoit0000809
related: https://homosaurus.org/v3/homoit0000819
related: https://homosaurus.org/v3/homoit0000870
related: https://homosaurus.org/v3/homoit0001001
related: https://homosaurus.org/v3/homoit0001074
related: https://homosaurus.org/v3/homoit0001075
related: https://homosaurus.org/v3/homoit0001093
related: https://homosaurus.org/v3/homoit0001176

Public facilities
type: Concept
issued: 2019-05-14
modified: 2025-02-23
replaces: publicFacilities
comment: Buildings, recreational areas, and other types of properties that are owned and maintained by state or local government and are thus available for use by the public.
change note: Version 3.7.0
in scheme: v3
narrower: https://homosaurus.org/v3/homoit0000248
narrower: https://homosaurus.org/v3/homoit0000975
narrower: https://homosaurus.org/v3/homoit0001140
narrower: https://homosaurus.org/v3/homoit0001143
related: https://homosaurus.org/v3/homoit0000053
related: https://homosaurus.org/v3/homoit0000062
related: https://homosaurus.org/v3/homoit0001139

Sexual violence
type: Concept
issued: 2019-05-14
modified: 2025-02-23
replaces: sexualViolence
comment: Sexual acts or attempts to coerce sexual acts that involve the use of non-consensual violence. This term encompasses sexual assault, rape, and sexual abuse.
change note: Version 3.7.0
in scheme: v3
narrower: https://homosaurus.org/v3/homoit0000306
narrower: https://homosaurus.org/v3/homoit0000855
narrower: https://homosaurus.org/v3/homoit0000938
narrower: https://homosaurus.org/v3/homoit0000958
narrower: https://homosaurus.org/v3/homoit0001285
narrower: https://homosaurus.org/v3/homoit0003433
related: https://homosaurus.org/v3/homoit0000059
related: https://homosaurus.org/v3/homoit0002195
related: https://homosaurus.org/v3/homoit0003444

Alloromantic people
type: Concept
issued: 2022-02-14
modified: 2025-02-23
comment: Individuals who experience romantic attraction or desire in a frequent and consistent manner, often alongside sexual attraction.
change note: Version 3.7.0
in scheme: v3
narrower: https://homosaurus.org/v3/homoit0001824
narrower: https://homosaurus.org/v3/homoit0001825
narrower: https://homosaurus.org/v3/homoit0001826
narrower: https://homosaurus.org/v3/homoit0001827
related: https://homosaurus.org/v3/homoit0000067
related: https://homosaurus.org/v3/homoit0001791

Romantic minorities
type: Concept
issued: 2022-02-14
modified: 2025-02-23
comment: Individuals whose romantic orientations and/or practices differ from those of the dominant culture.
change note: Version 3.7.0
in scheme: v3
narrower: https://homosaurus.org/v3/homoit0000067
narrower: https://homosaurus.org/v3/homoit0001824
narrower: https://homosaurus.org/v3/homoit0001825
narrower: https://homosaurus.org/v3/homoit0001827
narrower: https://homosaurus.org/v3/homoit0001985
narrower: https://homosaurus.org/v3/homoit0001987
related: https://homosaurus.org/v3/homoit0001297
related: https://homosaurus.org/v3/homoit0001637
related: https://homosaurus.org/v3/homoit0001817
related: https://homosaurus.org/v3/homoit0001828

Police interactions with LGBTQ+ people
type: Concept
issued: 2023-01-13
modified: 2025-02-23
comment: Umbrella term including any of various forms of interactions between police and LGBTQ+ individuals or communities.
alternative label: Police treatment of LGBTQ+ people
alternative label: Policing and the LGBTQ+ community
change note: Version 3.7.0
in scheme: v3
narrower: https://homosaurus.org/v3/homoit0000068
narrower: https://homosaurus.org/v3/homoit0002374
narrower: https://homosaurus.org/v3/homoit0002375
narrower: https://homosaurus.org/v3/homoit0002378
narrower: https://homosaurus.org/v3/homoit0002392
narrower: https://homosaurus.org/v3/homoit0002394
narrower: https://homosaurus.org/v3/homoit0002396
related: https://homosaurus.org/v3/homoit0001289
related: https://homosaurus.org/v3/homoit0001326
related: https://homosaurus.org/v3/homoit0001349

Body fluids
type: Concept
issued: 2023-12-18
modified: 2025-02-23
comment: Naturally occurring fluids produced by the human body.
alternative label: Feces
alternative label: Milk
alternative label: Snot
alternative label: Sweat
alternative label: Urine
alternative label: Vomit
change note: Version 3.7.0
in scheme: v3
narrower: https://homosaurus.org/v3/homoit0000323
narrower: https://homosaurus.org/v3/homoit0000683
narrower: https://homosaurus.org/v3/homoit0003108
narrower: https://homosaurus.org/v3/homoit0003114
related: https://homosaurus.org/v3/homoit0000597

Recovery groups
type: Concept
is replaced by: homoit0001551
issued: 2020-06-02
modified: 2022-08-15
replaces: recoveryGroups
alternative label: 12-step groups
change note: Version 3.7.0
in scheme: v3
narrower: https://homosaurus.org/v3/homoit0001551
related: https://homosaurus.org/v3/homoit0002228

Gender studies
type: Concept
issued: 2019-05-14
modified: 2025-02-23
replaces: genderStudies
comment: Interdisciplinary academic field devoted to the study and analysis of gender in a given culture, as well as representations of gender in media and popular culture.
change note: Version 3.7.0
in scheme: v3
narrower: https://homosaurus.org/v3/homoit0000187
narrower: https://homosaurus.org/v3/homoit0000539
narrower: https://homosaurus.org/v3/homoit0000781
narrower: https://homosaurus.org/v3/homoit0001447
narrower: https://homosaurus.org/v3/homoit0003706
related: https://homosaurus.org/v3/homoit0000560
related: https://homosaurus.org/v3/homoit0001149
related: https://homosaurus.org/v3/homoit0001210
related: https://homosaurus.org/v3/homoit0001219
related: https://homosaurus.org/v3/homoit0001306
related: https://homosaurus.org/v3/homoit0002039
related: https://homosaurus.org/v3/homoit0002725
related: https://homosaurus.org/v3/homoit0002934

Social norms
type: Concept
issued: 2019-05-14
modified: 2025-02-23
replaces: socialNorms
comment: Group-held beliefs about how members of that group should behave in a given context.
change note: Version 3.7.0
in scheme: v3
narrower: https://homosaurus.org/v3/homoit0000620
narrower: https://homosaurus.org/v3/homoit0000644
narrower: https://homosaurus.org/v3/homoit0001532
narrower: https://homosaurus.org/v3/homoit0001535
narrower: https://homosaurus.org/v3/homoit0001555
related: https://homosaurus.org/v3/homoit0000080
related: https://homosaurus.org/v3/homoit0000643
related: https://homosaurus.org/v3/homoit0001241

Donors
type: Concept
issued: 2019-05-14
modified: 2025-02-23
replaces: donors
comment: Individuals who donate their own biological materials, typically gametes (e.g., sperm or eggs), organs, or blood.
change note: Version 3.7.0
in scheme: v3
narrower: https://homosaurus.org/v3/homoit0000390
narrower: https://homosaurus.org/v3/homoit0000824
narrower: https://homosaurus.org/v3/homoit0001336
narrower: https://homosaurus.org/v3/homoit0002616
narrower: https://homosaurus.org/v3/homoit0002624
narrower: https://homosaurus.org/v3/homoit0002625
related: https://homosaurus.org/v3/homoit0000116
related: https://homosaurus.org/v3/homoit0000583
related: https://homosaurus.org/v3/homoit0000843
related: https://homosaurus.org/v3/homoit0000918
related: https://homosaurus.org/v3/homoit0001004
related: https://homosaurus.org/v3/homoit0002621

LGBTQ+ social processes
type: Concept
issued: 2019-05-14
modified: 2025-02-23
replaces: LGBTQSocialProcesses
comment: Forms of social interaction that occur repeatedly; use to describe the ways in which LGBTQ+ people interact and establish social relationships.
alternative label: LGBTQ social processes
change note: Version 3.7.0
in scheme: v3
narrower: https://homosaurus.org/v3/homoit0000500
narrower: https://homosaurus.org/v3/homoit0000538
narrower: https://homosaurus.org/v3/homoit0000575
narrower: https://homosaurus.org/v3/homoit0000748
narrower: https://homosaurus.org/v3/homoit0000857
narrower: https://homosaurus.org/v3/homoit0000960
related: https://homosaurus.org/v3/homoit0000080
related: https://homosaurus.org/v3/homoit0001273
related: https://homosaurus.org/v3/homoit0001301
related: https://homosaurus.org/v3/homoit0001303
related: https://homosaurus.org/v3/homoit0003694

Sex locations
type: Concept
issued: 2019-05-14
modified: 2025-02-23
replaces: sexLocations
comment: Places where people engage in sexual activities, including private and public spaces.
alternative label: Locations for sex
change note: Version 3.7.0
in scheme: v3
narrower: https://homosaurus.org/v3/homoit0000087
narrower: https://homosaurus.org/v3/homoit0000308
narrower: https://homosaurus.org/v3/homoit0000475
narrower: https://homosaurus.org/v3/homoit0001272
narrower: https://homosaurus.org/v3/homoit0001358
narrower: https://homosaurus.org/v3/homoit0003079
related: https://homosaurus.org/v3/homoit0000050
related: https://homosaurus.org/v3/homoit0000900
related: https://homosaurus.org/v3/homoit0001142
related: https://homosaurus.org/v3/homoit0001267
related: https://homosaurus.org/v3/homoit0001306

LGBTQ+ publishers
type: Concept
issued: 2019-05-14
modified: 2025-02-23
replaces: publishersLGBTQ
comment: Publishers that publish materials for LGBTQ+ communities or materials addressing LGBTQ+ issues.
alternative label: Publishers (LGBTQ)
change note: Version 3.7.0
in scheme: v3
narrower: https://homosaurus.org/v3/homoit0000180
narrower: https://homosaurus.org/v3/homoit0000527
narrower: https://homosaurus.org/v3/homoit0000771
narrower: https://homosaurus.org/v3/homoit0001203
narrower: https://homosaurus.org/v3/homoit0001440
narrower: https://homosaurus.org/v3/homoit0002805
narrower: https://homosaurus.org/v3/homoit0002937
related: https://homosaurus.org/v3/homoit0001830
related: https://homosaurus.org/v3/homoit0002720

LGBTQ+ radio
type: Concept
issued: 2019-05-14
modified: 2025-02-23
replaces: radioLGBTQ
comment: Auditory content broadcast on the radio (analog or digital) about LGBTQ+ people and/or LGBTQ+ issues.
alternative label: Radio (LGBTQ)
change note: Version 3.7.0
in scheme: v3
narrower: https://homosaurus.org/v3/homoit0000181
narrower: https://homosaurus.org/v3/homoit0000528
narrower: https://homosaurus.org/v3/homoit0000772
narrower: https://homosaurus.org/v3/homoit0001204
narrower: https://homosaurus.org/v3/homoit0001441
narrower: https://homosaurus.org/v3/homoit0002806
narrower: https://homosaurus.org/v3/homoit0002938
related: https://homosaurus.org/v3/homoit0002721

LGBTQ+ television
type: Concept
issued: 2019-05-14
modified: 2025-02-23
replaces: televisionLGBTQ
comment: Television shows featuring LGBTQ+ characters or themes.
alternative label: Television (LGBTQ)
change note: Version 3.7.0
in scheme: v3
narrower: https://homosaurus.org/v3/homoit0000193
narrower: https://homosaurus.org/v3/homoit0000545
narrower: https://homosaurus.org/v3/homoit0000787
narrower: https://homosaurus.org/v3/homoit0001216
narrower: https://homosaurus.org/v3/homoit0001453
narrower: https://homosaurus.org/v3/homoit0002854
narrower: https://homosaurus.org/v3/homoit0002946
related: https://homosaurus.org/v3/homoit0000249
related: https://homosaurus.org/v3/homoit0002730
related: https://homosaurus.org/v3/homoit0003245

LGBTQ+-owned businesses
type: Concept
issued: 2021-11-02
modified: 2025-02-23
comment: Businesses owned by LGBTQ+ people.
alternative label: LGBTQ-owned businesses
change note: Version 3.7.0
in scheme: v3
narrower: https://homosaurus.org/v3/homoit0001736
narrower: https://homosaurus.org/v3/homoit0001737
narrower: https://homosaurus.org/v3/homoit0001738
narrower: https://homosaurus.org/v3/homoit0001739
narrower: https://homosaurus.org/v3/homoit0001740
narrower: https://homosaurus.org/v3/homoit0002860
narrower: https://homosaurus.org/v3/homoit0002955
related: https://homosaurus.org/v3/homoit0001717
related: https://homosaurus.org/v3/homoit0001741
related: https://homosaurus.org/v3/homoit0001742
related: https://homosaurus.org/v3/homoit0001743
related: https://homosaurus.org/v3/homoit0001744
related: https://homosaurus.org/v3/homoit0001745
related: https://homosaurus.org/v3/homoit0001746
related: https://homosaurus.org/v3/homoit0002029
related: https://homosaurus.org/v3/homoit0002381
related: https://homosaurus.org/v3/homoit0002738

LGBTQ+-focused businesses
type: Concept
issued: 2021-11-02
modified: 2025-02-23
comment: Businesses focusing on LGBTQ+ clientele and products related to LGBTQ+ communities.
change note: Version 3.7.0
in scheme: v3
narrower: https://homosaurus.org/v3/homoit0001742
narrower: https://homosaurus.org/v3/homoit0001743
narrower: https://homosaurus.org/v3/homoit0001744
narrower: https://homosaurus.org/v3/homoit0001745
narrower: https://homosaurus.org/v3/homoit0001746
narrower: https://homosaurus.org/v3/homoit0002859
narrower: https://homosaurus.org/v3/homoit0002954
related: https://homosaurus.org/v3/homoit0001717
related: https://homosaurus.org/v3/homoit0001735
related: https://homosaurus.org/v3/homoit0002029
related: https://homosaurus.org/v3/homoit0002381
related: https://homosaurus.org/v3/homoit0002737

LGBTQ+ comedians
type: Concept
issued: 2023-06-27
modified: 2025-02-23
comment: LGBTQ+ people who seek to entertain an audience by making them laugh, through jokes, slapstick, employing prop comedy, or other amusing means.
alternative label: LGBTQ+ comics (Persons)
change note: Version 3.7.0
in scheme: v3
narrower: https://homosaurus.org/v3/homoit0002702
narrower: https://homosaurus.org/v3/homoit0002703
narrower: https://homosaurus.org/v3/homoit0002704
narrower: https://homosaurus.org/v3/homoit0002705
narrower: https://homosaurus.org/v3/homoit0002706
narrower: https://homosaurus.org/v3/homoit0002707
narrower: https://homosaurus.org/v3/homoit0002708
related: https://homosaurus.org/v3/homoit0002709

LGBTQ+ politicians
type: Concept
issued: 2023-06-28
modified: 2025-02-23
comment: LGBTQ+ people who are candidates for public office, are currently holding public office, or have held political positions. Politicians can be elected by public election or otherwise appointed.
alternative label: LGBTQ+ public officials
change note: Version 3.7.0
in scheme: v3
narrower: https://homosaurus.org/v3/homoit0002810
narrower: https://homosaurus.org/v3/homoit0002811
narrower: https://homosaurus.org/v3/homoit0002812
narrower: https://homosaurus.org/v3/homoit0002813
narrower: https://homosaurus.org/v3/homoit0002814
narrower: https://homosaurus.org/v3/homoit0002815
narrower: https://homosaurus.org/v3/homoit0002816
related: https://homosaurus.org/v3/homoit0002817

LGBTQ+ pride
type: Concept
issued: 2024-10-22
modified: 2025-02-23
comment: The recognition and celebration of LGBTQ+ people and culture, thereby affirming the visibility, dignity, and diversity of LGBTQ+ communities.
alternative label: Pride (LGBTQ)
change note: Version 3.7.0
in scheme: v3
narrower: https://homosaurus.org/v3/homoit0000522
narrower: https://homosaurus.org/v3/homoit0000767
narrower: https://homosaurus.org/v3/homoit0003654
narrower: https://homosaurus.org/v3/homoit0003655
related: https://homosaurus.org/v3/homoit0003246
related: https://homosaurus.org/v3/homoit0002386

LGBTQ+ bookshops
type: Concept
issued: 2019-05-14
modified: 2025-02-23
replaces: bookshopsLGBTQ
comment: Bookshops that sell materials intended for use by LGBTQ+ people or addressing LGBTQ+ topics.
alternative label: Bookstores (LGBTQ)
alternative label: Bookshops (LGBTQ)
change note: Version 3.7.0
in scheme: v3
narrower: https://homosaurus.org/v3/homoit0000136
narrower: https://homosaurus.org/v3/homoit0000478
narrower: https://homosaurus.org/v3/homoit0000727
narrower: https://homosaurus.org/v3/homoit0001164
narrower: https://homosaurus.org/v3/homoit0001397
narrower: https://homosaurus.org/v3/homoit0001511
narrower: https://homosaurus.org/v3/homoit0002763
narrower: https://homosaurus.org/v3/homoit0002966
related: https://homosaurus.org/v3/homoit0000827
related: https://homosaurus.org/v3/homoit0001132
related: https://homosaurus.org/v3/homoit0002681

White LGBTQ+ people
type: Concept
issued: 2019-05-14
modified: 2025-02-23
replaces: whitePeopleLGBTQ
comment: LGBTQ+ people who are white.
alternative label: Caucasians (LGBTQ)
alternative label: White people (LGBTQ)
alternative label: Caucasian LGBTQ+ people
alternative label: LGBTQ+ Caucasian people
alternative label: LGBTQ+ white people
change note: Version 3.7.0
in scheme: v3
narrower: https://homosaurus.org/v3/homoit0000201
narrower: https://homosaurus.org/v3/homoit0000555
narrower: https://homosaurus.org/v3/homoit0000797
narrower: https://homosaurus.org/v3/homoit0001226
narrower: https://homosaurus.org/v3/homoit0001461
narrower: https://homosaurus.org/v3/homoit0002746
narrower: https://homosaurus.org/v3/homoit0002915
narrower: https://homosaurus.org/v3/homoit0003381
related: https://homosaurus.org/v3/homoit0001133

Heterosexuals
type: Concept
issued: 2019-05-14
modified: 2025-02-23
replaces: heterosexuals
comment: Individuals who are romantically and sexually attracted to members of the opposite sex or gender.
alternative label: Heterosexual people
alternative label: Straight people
change note: Version 3.7.0
in scheme: v3
narrower: https://homosaurus.org/v3/homoit0000038
narrower: https://homosaurus.org/v3/homoit0000626
narrower: https://homosaurus.org/v3/homoit0000629
narrower: https://homosaurus.org/v3/homoit0000630
narrower: https://homosaurus.org/v3/homoit0002285
related: https://homosaurus.org/v3/homoit0000624
related: https://homosaurus.org/v3/homoit0000631
related: https://homosaurus.org/v3/homoit0001531
related: https://homosaurus.org/v3/homoit0001915

LGBTQ+ film festivals
type: Concept
issued: 2019-05-14
modified: 2025-02-23
replaces: LGBTQFilmFestivals
comment: Organized presentations of films in a single location, often with prizes awarded in various categories; use in reference to film festivals focusing on films created by LGBTQ+ people or featuring LGBTQ+ characters and themes.
alternative label: LGBTQ film festivals
change note: Version 3.7.0
in scheme: v3
narrower: https://homosaurus.org/v3/homoit0003710
narrower: https://homosaurus.org/v3/homoit0003711
narrower: https://homosaurus.org/v3/homoit0003712
narrower: https://homosaurus.org/v3/homoit0003713
narrower: https://homosaurus.org/v3/homoit0003714
narrower: https://homosaurus.org/v3/homoit0003715
narrower: https://homosaurus.org/v3/homoit0003716
narrower: https://homosaurus.org/v3/homoit0003717
related: https://homosaurus.org/v3/homoit0000869
related: https://homosaurus.org/v3/homoit0002327

LGBTQ+ symbols
type: Concept
issued: 2019-05-14
modified: 2025-02-23
replaces: LGBTQSymbols
comment: Characters, signs, or objects used to represent LGBTQ+ people, identities, communities, and/or specific historical events.
alternative label: LGBTQ symbols
change note: Version 3.7.0
in scheme: v3
narrower: https://homosaurus.org/v3/homoit0000034
narrower: https://homosaurus.org/v3/homoit0000453
narrower: https://homosaurus.org/v3/homoit0000609
narrower: https://homosaurus.org/v3/homoit0000696
narrower: https://homosaurus.org/v3/homoit0000698
narrower: https://homosaurus.org/v3/homoit0001116
narrower: https://homosaurus.org/v3/homoit0003246

LGBTQ+ persecutions
type: Concept
issued: 2019-05-14
modified: 2025-02-23
replaces: persecutionsLGBTQ
comment: Systematic mistreatment of LGBTQ+ people on the basis of their gender or sexual identities.
alternative label: Persecutions (LGBTQ)
change note: Version 3.7.0
in scheme: v3
narrower: https://homosaurus.org/v3/homoit0000850
narrower: https://homosaurus.org/v3/homoit0001103
narrower: https://homosaurus.org/v3/homoit0001104
narrower: https://homosaurus.org/v3/homoit0001105
narrower: https://homosaurus.org/v3/homoit0001106
narrower: https://homosaurus.org/v3/homoit0001107
narrower: https://homosaurus.org/v3/homoit0002744
narrower: https://homosaurus.org/v3/homoit0002912
related: https://homosaurus.org/v3/homoit0000059
related: https://homosaurus.org/v3/homoit0000068
related: https://homosaurus.org/v3/homoit0000356
related: https://homosaurus.org/v3/homoit0000580
related: https://homosaurus.org/v3/homoit0000701
related: https://homosaurus.org/v3/homoit0000927
related: https://homosaurus.org/v3/homoit0001482
related: https://homosaurus.org/v3/homoit0001560

Transitioning (Gender)
type: Concept
issued: 2019-05-14
modified: 2025-02-23
replaces: transitioningTransgender
comment: The process of changing one's gender presentation to affirm one's internal sense of gender; can include social or medical transition.
alternative label: Transitioning (Transgender)
change note: Version 3.7.0
in scheme: v3
narrower: https://homosaurus.org/v3/homoit0001464
narrower: https://homosaurus.org/v3/homoit0001834
narrower: https://homosaurus.org/v3/homoit0001835
narrower: https://homosaurus.org/v3/homoit0001836
related: https://homosaurus.org/v3/homoit0000078
related: https://homosaurus.org/v3/homoit0000119
related: https://homosaurus.org/v3/homoit0000377
related: https://homosaurus.org/v3/homoit0000561
related: https://homosaurus.org/v3/homoit0000571
related: https://homosaurus.org/v3/homoit0000573
related: https://homosaurus.org/v3/homoit0000584
related: https://homosaurus.org/v3/homoit0000606
related: https://homosaurus.org/v3/homoit0001005
related: https://homosaurus.org/v3/homoit0001092
related: https://homosaurus.org/v3/homoit0001324
related: https://homosaurus.org/v3/homoit0001378
related: https://homosaurus.org/v3/homoit0001381
related: https://homosaurus.org/v3/homoit0001468
related: https://homosaurus.org/v3/homoit0001496
related: https://homosaurus.org/v3/homoit0001837
related: https://homosaurus.org/v3/homoit0001838
related: https://homosaurus.org/v3/homoit0001839
related: https://homosaurus.org/v3/homoit0001840
related: https://homosaurus.org/v3/homoit0001841
related: https://homosaurus.org/v3/homoit0001842
related: https://homosaurus.org/v3/homoit0001843
related: https://homosaurus.org/v3/homoit0001844
related: https://homosaurus.org/v3/homoit0001845
related: https://homosaurus.org/v3/homoit0001846
related: https://homosaurus.org/v3/homoit0001847
related: https://homosaurus.org/v3/homoit0001848
related: https://homosaurus.org/v3/homoit0001849
related: https://homosaurus.org/v3/homoit0001850
related: https://homosaurus.org/v3/homoit0001851
related: https://homosaurus.org/v3/homoit0001894

LGBTQ+ clergy
type: Concept
issued: 2020-12-11
modified: 2025-02-23
replaces: clergyLGBTQ
comment: LGBTQ+ people who are ordained for religious duties, particularly in the Christian Church.
alternative label: Clergy (LGBTQ)
change note: Version 3.7.0
in scheme: v3
narrower: https://homosaurus.org/v3/homoit0000142
narrower: https://homosaurus.org/v3/homoit0000484
narrower: https://homosaurus.org/v3/homoit0000732
narrower: https://homosaurus.org/v3/homoit0001169
narrower: https://homosaurus.org/v3/homoit0001402
narrower: https://homosaurus.org/v3/homoit0002975
narrower: https://homosaurus.org/v3/homoit0002981

Romantic orientation
type: Concept
issued: 2022-02-14
modified: 2025-02-23
comment: The direction or nature of an individual's romantic attraction toward others.
change note: Version 3.7.0
in scheme: v3
narrower: https://homosaurus.org/v3/homoit0001644
narrower: https://homosaurus.org/v3/homoit0001791
narrower: https://homosaurus.org/v3/homoit0001792
narrower: https://homosaurus.org/v3/homoit0001793
narrower: https://homosaurus.org/v3/homoit0001794
narrower: https://homosaurus.org/v3/homoit0001795
narrower: https://homosaurus.org/v3/homoit0001986
narrower: https://homosaurus.org/v3/homoit0001988
related: https://homosaurus.org/v3/homoit0001298
related: https://homosaurus.org/v3/homoit0001636
related: https://homosaurus.org/v3/homoit0001829

LGBTQ+ characters
type: Concept
issued: 2019-05-14
modified: 2025-02-23
replaces: charactersLGBTQ
comment: Characters in creative works who are LGBTQ+.
alternative label: Characters (LGBTQ)
change note: Version 3.7.0
in scheme: v3
narrower: https://homosaurus.org/v3/homoit0000139
narrower: https://homosaurus.org/v3/homoit0000481
narrower: https://homosaurus.org/v3/homoit0000729
narrower: https://homosaurus.org/v3/homoit0001166
narrower: https://homosaurus.org/v3/homoit0001399
narrower: https://homosaurus.org/v3/homoit0002770
narrower: https://homosaurus.org/v3/homoit0002967
narrower: https://homosaurus.org/v3/homoit0003660
narrower: https://homosaurus.org/v3/homoit0003661
related: https://homosaurus.org/v3/homoit0000443
related: https://homosaurus.org/v3/homoit0000869
related: https://homosaurus.org/v3/homoit0001359
related: https://homosaurus.org/v3/homoit0002687
related: https://homosaurus.org/v3/homoit0003160

Human rights
type: Concept
issued: 2019-05-14
modified: 2025-02-23
replaces: humanRights
comment: Moral, social, and legal standards or principles for human behavior, commonly understood as fundamental to all human beings and subject to legal protection.
change note: Version 3.7.0
in scheme: v3
narrower: https://homosaurus.org/v3/homoit0000276
narrower: https://homosaurus.org/v3/homoit0000673
narrower: https://homosaurus.org/v3/homoit0002290

Sexual minorities
type: Concept
issued: 2019-05-14
modified: 2025-02-23
replaces: sexualMinorities
comment: People whose sexual practices differ from those of the dominant culture.
change note: Version 3.7.0
in scheme: v3
narrower: https://homosaurus.org/v3/homoit0000071
narrower: https://homosaurus.org/v3/homoit0000170
narrower: https://homosaurus.org/v3/homoit0000344
narrower: https://homosaurus.org/v3/homoit0000506
narrower: https://homosaurus.org/v3/homoit0000556
narrower: https://homosaurus.org/v3/homoit0000687
narrower: https://homosaurus.org/v3/homoit0000898
narrower: https://homosaurus.org/v3/homoit0001375
narrower: https://homosaurus.org/v3/homoit0001480
narrower: https://homosaurus.org/v3/homoit0001627
narrower: https://homosaurus.org/v3/homoit0001633
narrower: https://homosaurus.org/v3/homoit0002277
narrower: https://homosaurus.org/v3/homoit0002278
narrower: https://homosaurus.org/v3/homoit0002279
narrower: https://homosaurus.org/v3/homoit0003084
related: https://homosaurus.org/v3/homoit0000108
related: https://homosaurus.org/v3/homoit0000227
related: https://homosaurus.org/v3/homoit0000442
related: https://homosaurus.org/v3/homoit0000645
related: https://homosaurus.org/v3/homoit0000648
related: https://homosaurus.org/v3/homoit0000677
related: https://homosaurus.org/v3/homoit0000805
related: https://homosaurus.org/v3/homoit0000915
related: https://homosaurus.org/v3/homoit0001009
related: https://homosaurus.org/v3/homoit0001298
related: https://homosaurus.org/v3/homoit0001300
related: https://homosaurus.org/v3/homoit0001306
related: https://homosaurus.org/v3/homoit0001484
related: https://homosaurus.org/v3/homoit0001510
related: https://homosaurus.org/v3/homoit0001637
related: https://homosaurus.org/v3/homoit0001817
related: https://homosaurus.org/v3/homoit0001829

LGBTQ+ discrimination
type: Concept
issued: 2019-05-14
modified: 2025-02-23
replaces: discriminationLGBTQ
comment: The unjust or prejudicial treatment of LGBTQ+ people or communities due to their sexual or gender identities; may include the denial of legal rights, employment, and housing.
alternative label: Discrimination (LGBTQ)
change note: Version 3.7.0
in scheme: v3
narrower: https://homosaurus.org/v3/homoit0000051
narrower: https://homosaurus.org/v3/homoit0000055
narrower: https://homosaurus.org/v3/homoit0000057
narrower: https://homosaurus.org/v3/homoit0000060
narrower: https://homosaurus.org/v3/homoit0000062
narrower: https://homosaurus.org/v3/homoit0001885
narrower: https://homosaurus.org/v3/homoit0001893
narrower: https://homosaurus.org/v3/homoit0002899
related: https://homosaurus.org/v3/homoit0000053
related: https://homosaurus.org/v3/homoit0000112
related: https://homosaurus.org/v3/homoit0000611
related: https://homosaurus.org/v3/homoit0000701
related: https://homosaurus.org/v3/homoit0001108
related: https://homosaurus.org/v3/homoit0001532
related: https://homosaurus.org/v3/homoit0001535
related: https://homosaurus.org/v3/homoit0001555
related: https://homosaurus.org/v3/homoit0001560
related: https://homosaurus.org/v3/homoit0001561
related: https://homosaurus.org/v3/homoit0002379
related: https://homosaurus.org/v3/homoit0003691

Erogenous body parts
type: Concept
issued: 2019-05-14
modified: 2025-02-23
replaces: erogenousBodyParts
comment: Areas of the body that are sensitive to sexual stimulation.
change note: Version 3.7.0
in scheme: v3
narrower: https://homosaurus.org/v3/homoit0000222
narrower: https://homosaurus.org/v3/homoit0000232
narrower: https://homosaurus.org/v3/homoit0000282
narrower: https://homosaurus.org/v3/homoit0001099
narrower: https://homosaurus.org/v3/homoit0001361
narrower: https://homosaurus.org/v3/homoit0001488
narrower: https://homosaurus.org/v3/homoit0001984
narrower: https://homosaurus.org/v3/homoit0003118
narrower: https://homosaurus.org/v3/homoit0003137
related: https://homosaurus.org/v3/homoit0000585
related: https://homosaurus.org/v3/homoit0001634

Feminists
type: Concept
issued: 2019-05-14
modified: 2025-02-23
replaces: feminists
comment: People who support and advocate for defining, establishing, and defending equal political, economic, and social rights and opportunities for women.
change note: Version 3.7.0
in scheme: v3
narrower: https://homosaurus.org/v3/homoit0001346
narrower: https://homosaurus.org/v3/homoit0003169
narrower: https://homosaurus.org/v3/homoit0003170
narrower: https://homosaurus.org/v3/homoit0003171
narrower: https://homosaurus.org/v3/homoit0003172
narrower: https://homosaurus.org/v3/homoit0003173
narrower: https://homosaurus.org/v3/homoit0003174
narrower: https://homosaurus.org/v3/homoit0003175
narrower: https://homosaurus.org/v3/homoit0003177

LGBTQ+ family planning
type: Concept
issued: 2019-05-14
modified: 2025-02-23
replaces: LGBTQFamilyPlanning
comment: The practice of determining the shape of a family by LGBTQ+ people.
alternative label: LGBTQ family planning
change note: Version 3.7.0
in scheme: v3
narrower: https://homosaurus.org/v3/homoit0000809
narrower: https://homosaurus.org/v3/homoit0000843
related: https://homosaurus.org/v3/homoit0000347
related: https://homosaurus.org/v3/homoit0000390
related: https://homosaurus.org/v3/homoit0000420
related: https://homosaurus.org/v3/homoit0000811
related: https://homosaurus.org/v3/homoit0000819
related: https://homosaurus.org/v3/homoit0000871
related: https://homosaurus.org/v3/homoit0000945
related: https://homosaurus.org/v3/homoit0001001
related: https://homosaurus.org/v3/homoit0001075
related: https://homosaurus.org/v3/homoit0001093
related: https://homosaurus.org/v3/homoit0001336

LGBTQ+ slang
type: Concept
issued: 2019-05-14
modified: 2025-02-23
replaces: slangLGBTQ
comment: Colloquial or informal language related to LGBTQ+ people or used by LGBTQ+ people.
alternative label: Slang (LGBTQ)
change note: Version 3.7.0
in scheme: v3
narrower: https://homosaurus.org/v3/homoit0000185
narrower: https://homosaurus.org/v3/homoit0000535
narrower: https://homosaurus.org/v3/homoit0000779
narrower: https://homosaurus.org/v3/homoit0001125
narrower: https://homosaurus.org/v3/homoit0001208
narrower: https://homosaurus.org/v3/homoit0001445
narrower: https://homosaurus.org/v3/homoit0001559
narrower: https://homosaurus.org/v3/homoit0002583
narrower: https://homosaurus.org/v3/homoit0002584
narrower: https://homosaurus.org/v3/homoit0002789
narrower: https://homosaurus.org/v3/homoit0002940
narrower: https://homosaurus.org/v3/homoit0003505
related: https://homosaurus.org/v3/homoit0001560
related: https://homosaurus.org/v3/homoit0002158
related: https://homosaurus.org/v3/homoit0002208
related: https://homosaurus.org/v3/homoit0002724
related: https://homosaurus.org/v3/homoit0003515
related: https://homosaurus.org/v3/homoit0003520

Social media
type: Concept
issued: 2019-05-14
modified: 2025-02-23
replaces: socialMedia
comment: Web-based and mobile technologies used to turn communication into interactive dialogues.
change note: Version 3.7.0
in scheme: v3
narrower: https://homosaurus.org/v3/homoit0000210
narrower: https://homosaurus.org/v3/homoit0000250
narrower: https://homosaurus.org/v3/homoit0000328
narrower: https://homosaurus.org/v3/homoit0000329
narrower: https://homosaurus.org/v3/homoit0000665
related: https://homosaurus.org/v3/homoit0000324
related: https://homosaurus.org/v3/homoit0000946

LGBTQ+ literary criticism
type: Concept
issued: 2020-06-03
modified: 2025-02-23
replaces: literaryCriticismLGBTQ
comment: The study, evaluation, and interpretation of literary works focusing on LGBTQ+ characters or themes; can also include interpretation of literature through the lens and frameworks associated with LGBTQ+ studies.
alternative label: Literary criticism (LGBTQ)
change note: Version 3.7.0
in scheme: v3
narrower: https://homosaurus.org/v3/homoit0001603
narrower: https://homosaurus.org/v3/homoit0001604
narrower: https://homosaurus.org/v3/homoit0001605
narrower: https://homosaurus.org/v3/homoit0001606
narrower: https://homosaurus.org/v3/homoit0001607
narrower: https://homosaurus.org/v3/homoit0002466
narrower: https://homosaurus.org/v3/homoit0002483
narrower: https://homosaurus.org/v3/homoit0002493
narrower: https://homosaurus.org/v3/homoit0002513
narrower: https://homosaurus.org/v3/homoit0002542
narrower: https://homosaurus.org/v3/homoit0002749
related: https://homosaurus.org/v3/homoit0000972
related: https://homosaurus.org/v3/homoit0001723
related: https://homosaurus.org/v3/homoit0002698
related: https://homosaurus.org/v3/homoit0003700
related: https://homosaurus.org/v3/homoit0003706

LGBTQ+ biographies
type: Concept
issued: 2020-06-03
modified: 2025-02-23
replaces: biographiesLGBTQ
comment: Written accounts of the lives of LGBTQ+ people. For written accounts of LGBTQ+ people's lives written by the subject, use "LGBTQ+ autobiographies."
alternative label: Biographies of authors
alternative label: Biographies (LGBTQ)
change note: Version 3.7.0
in scheme: v3
narrower: https://homosaurus.org/v3/homoit0001615
narrower: https://homosaurus.org/v3/homoit0001616
narrower: https://homosaurus.org/v3/homoit0001617
narrower: https://homosaurus.org/v3/homoit0001618
narrower: https://homosaurus.org/v3/homoit0001619
narrower: https://homosaurus.org/v3/homoit0002464
narrower: https://homosaurus.org/v3/homoit0002481
narrower: https://homosaurus.org/v3/homoit0002492
narrower: https://homosaurus.org/v3/homoit0002512
narrower: https://homosaurus.org/v3/homoit0002541
narrower: https://homosaurus.org/v3/homoit0002779
related: https://homosaurus.org/v3/homoit0001729
related: https://homosaurus.org/v3/homoit0002260
related: https://homosaurus.org/v3/homoit0002680

LGBTQ+ autobiographies
type: Concept
issued: 2021-11-02
modified: 2025-02-23
comment: Accounts of LGBTQ+ peoples' lives written by those people. For written accounts of LGBTQ+ people's lives that were not written by the subject, use "LGBTQ+ biographies."
alternative label: Autobiographies (LGBTQ)
alternative label: LGBTQ+ autobios
alternative label: LGBTQ+ memoirs
change note: Version 3.7.0
in scheme: v3
narrower: https://homosaurus.org/v3/homoit0001730
narrower: https://homosaurus.org/v3/homoit0001731
narrower: https://homosaurus.org/v3/homoit0001732
narrower: https://homosaurus.org/v3/homoit0001733
narrower: https://homosaurus.org/v3/homoit0001734
narrower: https://homosaurus.org/v3/homoit0002463
narrower: https://homosaurus.org/v3/homoit0002480
narrower: https://homosaurus.org/v3/homoit0002491
narrower: https://homosaurus.org/v3/homoit0002511
narrower: https://homosaurus.org/v3/homoit0002540
narrower: https://homosaurus.org/v3/homoit0002778
related: https://homosaurus.org/v3/homoit0001614
related: https://homosaurus.org/v3/homoit0001723
related: https://homosaurus.org/v3/homoit0002260
related: https://homosaurus.org/v3/homoit0002679

Partners
type: Concept
issued: 2022-12-13
modified: 2025-02-23
comment: People who share a romantic, sexual, or play partnership with another person or people.
change note: Version 3.7.0
in scheme: v3
narrower: https://homosaurus.org/v3/homoit0001083
narrower: https://homosaurus.org/v3/homoit0001085
narrower: https://homosaurus.org/v3/homoit0001635
narrower: https://homosaurus.org/v3/homoit0001638
narrower: https://homosaurus.org/v3/homoit0001645
narrower: https://homosaurus.org/v3/homoit0001657
narrower: https://homosaurus.org/v3/homoit0002366
narrower: https://homosaurus.org/v3/homoit0002717
related: https://homosaurus.org/v3/homoit0001080
related: https://homosaurus.org/v3/homoit0001081
related: https://homosaurus.org/v3/homoit0001082
related: https://homosaurus.org/v3/homoit0001311

LGBTQ+ websites
type: Concept
issued: 2019-05-14
modified: 2025-02-23
replaces: LGBTQWebsites
comment: Public web pages that primarily address LGBTQ+ communities and issues, as well as web pages intended for use by LGBTQ+ people.
alternative label: LGBTQ websites
change note: Version 3.7.0
in scheme: v3
narrower: https://homosaurus.org/v3/homoit0000847
narrower: https://homosaurus.org/v3/homoit0003210
narrower: https://homosaurus.org/v3/homoit0003211
narrower: https://homosaurus.org/v3/homoit0003212
narrower: https://homosaurus.org/v3/homoit0003213
narrower: https://homosaurus.org/v3/homoit0003214
narrower: https://homosaurus.org/v3/homoit0003215
narrower: https://homosaurus.org/v3/homoit0003216
narrower: https://homosaurus.org/v3/homoit0003217
narrower: https://homosaurus.org/v3/homoit0003218
narrower: https://homosaurus.org/v3/homoit0003219
narrower: https://homosaurus.org/v3/homoit0003220
narrower: https://homosaurus.org/v3/homoit0003221
related: https://homosaurus.org/v3/homoit0000888
related: https://homosaurus.org/v3/homoit0000946
related: https://homosaurus.org/v3/homoit0003222

Role behavior
type: Concept
issued: 2019-05-14
modified: 2025-02-23
replaces: roleBehaviour
comment: Behavior determining one's response to a social situation, as influenced by social norms; internal and external expectations; and social sanctions and rewards.
change note: Version 3.7.0
in scheme: v3
narrower: https://homosaurus.org/v3/homoit0000577
narrower: https://homosaurus.org/v3/homoit0001304
preferred label: Role behaviour
related: https://homosaurus.org/v3/homoit0000230
related: https://homosaurus.org/v3/homoit0001242
related: https://homosaurus.org/v3/homoit0001295
related: https://homosaurus.org/v3/homoit0001323
related: https://homosaurus.org/v3/homoit0002165
related: https://homosaurus.org/v3/homoit0002168
related: https://homosaurus.org/v3/homoit0002169
related: https://homosaurus.org/v3/homoit0002207

Sexual orientation
type: Concept
issued: 2019-05-14
modified: 2025-02-23
replaces: sexualOrientation
comment: The direction of an individual's sexual attraction towards other individuals of the same, opposite, or multiple sexes; commonly understood to be biologically and physiologically dictated, rather than sociologically determined.
change note: Version 3.7.0
in scheme: v3
narrower: https://homosaurus.org/v3/homoit0000004
narrower: https://homosaurus.org/v3/homoit0000204
narrower: https://homosaurus.org/v3/homoit0000343
narrower: https://homosaurus.org/v3/homoit0000631
narrower: https://homosaurus.org/v3/homoit0000647
narrower: https://homosaurus.org/v3/homoit0000799
narrower: https://homosaurus.org/v3/homoit0001292
narrower: https://homosaurus.org/v3/homoit0001531
narrower: https://homosaurus.org/v3/homoit0001556
narrower: https://homosaurus.org/v3/homoit0001558
narrower: https://homosaurus.org/v3/homoit0001626
narrower: https://homosaurus.org/v3/homoit0001632
narrower: https://homosaurus.org/v3/homoit0001926
related: https://homosaurus.org/v3/homoit0000303
related: https://homosaurus.org/v3/homoit0000345
related: https://homosaurus.org/v3/homoit0000559
related: https://homosaurus.org/v3/homoit0001290
related: https://homosaurus.org/v3/homoit0001295
related: https://homosaurus.org/v3/homoit0001297
related: https://homosaurus.org/v3/homoit0001300
related: https://homosaurus.org/v3/homoit0001636
related: https://homosaurus.org/v3/homoit0001828
related: https://homosaurus.org/v3/homoit0001915

Relationship orientation
type: Concept
issued: 2020-12-11
modified: 2025-02-23
replaces: relationshipOrientation
comment: An individual's preference toward or away from a particular relationship model.
change note: Version 3.7.0
in scheme: v3
narrower: https://homosaurus.org/v3/homoit0001019
narrower: https://homosaurus.org/v3/homoit0001659
related: https://homosaurus.org/v3/homoit0000315
related: https://homosaurus.org/v3/homoit0000663
related: https://homosaurus.org/v3/homoit0001237
related: https://homosaurus.org/v3/homoit0001298
related: https://homosaurus.org/v3/homoit0001302
related: https://homosaurus.org/v3/homoit0001650
related: https://homosaurus.org/v3/homoit0001828
related: https://homosaurus.org/v3/homoit0003229

Relationship minorities
type: Concept
issued: 2020-12-11
modified: 2025-02-23
replaces: relationshipMinorities
comment: People whose relationship practices differ from those of the dominant culture.
change note: Version 3.7.0
in scheme: v3
narrower: https://homosaurus.org/v3/homoit0000363
narrower: https://homosaurus.org/v3/homoit0000999
narrower: https://homosaurus.org/v3/homoit0001318
narrower: https://homosaurus.org/v3/homoit0001660
narrower: https://homosaurus.org/v3/homoit0001663
narrower: https://homosaurus.org/v3/homoit0001665
narrower: https://homosaurus.org/v3/homoit0002255
related: https://homosaurus.org/v3/homoit0001297
related: https://homosaurus.org/v3/homoit0001829
related: https://homosaurus.org/v3/homoit0003052

LGBTQ+ political groups
type: Concept
issued: 2024-09-19
modified: 2025-02-23
comment: Organized groups centered on political change and action for LGBTQ+ rights that may or may not be aligned with major political parties.
alternative label: Political groups (LGBTQ)
change note: Version 3.7.0
in scheme: v3
narrower: https://homosaurus.org/v3/homoit0003522
narrower: https://homosaurus.org/v3/homoit0003523
narrower: https://homosaurus.org/v3/homoit0003524
narrower: https://homosaurus.org/v3/homoit0003525
narrower: https://homosaurus.org/v3/homoit0003526
narrower: https://homosaurus.org/v3/homoit0003527
narrower: https://homosaurus.org/v3/homoit0003528
narrower: https://homosaurus.org/v3/homoit0003529
narrower: https://homosaurus.org/v3/homoit0003530
narrower: https://homosaurus.org/v3/homoit0003532
narrower: https://homosaurus.org/v3/homoit0000764
related: https://homosaurus.org/v3/homoit0003531

Erotica
type: Concept
issued: 2019-05-14
modified: 2025-02-23
replaces: erotica
comment: The portrayal of sexuality with high-art aspirations, typically also focusing on feelings and emotions.
change note: Version 3.7.0
in scheme: v3
narrower: https://homosaurus.org/v3/homoit0000859
related: https://homosaurus.org/v3/homoit0000816
related: https://homosaurus.org/v3/homoit0001128

Harassment
type: Concept
issued: 2019-05-14
modified: 2025-02-23
replaces: harassment
comment: Covers a wide range of behaviors that are intended to disturb or upset. Harassment is often repetitive or occurs across an extended period of time.
change note: Version 3.7.0
in scheme: v3
narrower: https://homosaurus.org/v3/homoit0001121
narrower: https://homosaurus.org/v3/homoit0001293
related: https://homosaurus.org/v3/homoit0000228
related: https://homosaurus.org/v3/homoit0000356
related: https://homosaurus.org/v3/homoit0001560

LGBTQ+ solidarity
type: Concept
issued: 2024-04-16
modified: 2025-02-23
comment: A sense of fellowship and overall unity of purpose, political interest, and/or community sympathies based on shared experiences as LGBTQ+ people.
alternative label: Solidarity (LGBTQ+)
change note: Version 3.7.0
in scheme: v3
narrower: https://homosaurus.org/v3/homoit0003196
narrower: https://homosaurus.org/v3/homoit0003197
narrower: https://homosaurus.org/v3/homoit0003198
narrower: https://homosaurus.org/v3/homoit0003199
narrower: https://homosaurus.org/v3/homoit0003200
narrower: https://homosaurus.org/v3/homoit0003201
narrower: https://homosaurus.org/v3/homoit0003202
narrower: https://homosaurus.org/v3/homoit0003203
narrower: https://homosaurus.org/v3/homoit0003204
narrower: https://homosaurus.org/v3/homoit0003205
narrower: https://homosaurus.org/v3/homoit0003206
narrower: https://homosaurus.org/v3/homoit0003207
narrower: https://homosaurus.org/v3/homoit0003208
related: https://homosaurus.org/v3/homoit0000006
related: https://homosaurus.org/v3/homoit0000038
related: https://homosaurus.org/v3/homoit0003209

Anti-LGBTQ+ violence
type: Concept
issued: 2019-05-14
modified: 2025-02-23
replaces: antiLGBTQViolence
comment: Behavior involving physical force intended to harm or kill LGBTQ+ people on the basis of their identity.
alternative label: Anti-LGBTQ violence
change note: Version 3.7.0
in scheme: v3
narrower: https://homosaurus.org/v3/homoit0000052
narrower: https://homosaurus.org/v3/homoit0000056
narrower: https://homosaurus.org/v3/homoit0000058
narrower: https://homosaurus.org/v3/homoit0000061
narrower: https://homosaurus.org/v3/homoit0000063
narrower: https://homosaurus.org/v3/homoit0000641
narrower: https://homosaurus.org/v3/homoit0000855
narrower: https://homosaurus.org/v3/homoit0001769
narrower: https://homosaurus.org/v3/homoit0001770
narrower: https://homosaurus.org/v3/homoit0002378
narrower: https://homosaurus.org/v3/homoit0002900
related: https://homosaurus.org/v3/homoit0000613
related: https://homosaurus.org/v3/homoit0000958
related: https://homosaurus.org/v3/homoit0000959
related: https://homosaurus.org/v3/homoit0001108
related: https://homosaurus.org/v3/homoit0001293
related: https://homosaurus.org/v3/homoit0001305
related: https://homosaurus.org/v3/homoit0001348

Feminism
type: Concept
issued: 2019-05-14
modified: 2025-02-23
replaces: feminism
comment: Collection of movements aimed at defining, establishing, and defending equal political, economic, and social rights and equal opportunities for women.
change note: Version 3.7.0
in scheme: v3
narrower: https://homosaurus.org/v3/homoit0000387
narrower: https://homosaurus.org/v3/homoit0000444
narrower: https://homosaurus.org/v3/homoit0000622
narrower: https://homosaurus.org/v3/homoit0000741
narrower: https://homosaurus.org/v3/homoit0001230
narrower: https://homosaurus.org/v3/homoit0001260
narrower: https://homosaurus.org/v3/homoit0002270
narrower: https://homosaurus.org/v3/homoit0002271
narrower: https://homosaurus.org/v3/homoit0002274
narrower: https://homosaurus.org/v3/homoit0002275
narrower: https://homosaurus.org/v3/homoit0003101
narrower: https://homosaurus.org/v3/homoit0003121
narrower: https://homosaurus.org/v3/homoit0003765
narrower: https://homosaurus.org/v3/homoit0003767
related: https://homosaurus.org/v3/homoit0000054
related: https://homosaurus.org/v3/homoit0000438
related: https://homosaurus.org/v3/homoit0001505
related: https://homosaurus.org/v3/homoit0001509
related: https://homosaurus.org/v3/homoit0001516
related: https://homosaurus.org/v3/homoit0002039
related: https://homosaurus.org/v3/homoit0002290
related: https://homosaurus.org/v3/homoit0003157
related: https://homosaurus.org/v3/homoit0003158

Sexual practices
type: Concept
issued: 2019-05-14
modified: 2025-02-23
replaces: sexualPractices
comment: Activities associated with physical and/or mental sexual stimuli, including but not limited to intercourse and sexual pleasure.
change note: Version 3.7.0
in scheme: v3
narrower: https://homosaurus.org/v3/homoit0000043
narrower: https://homosaurus.org/v3/homoit0000049
narrower: https://homosaurus.org/v3/homoit0000050
narrower: https://homosaurus.org/v3/homoit0000075
narrower: https://homosaurus.org/v3/homoit0000081
narrower: https://homosaurus.org/v3/homoit0000206
narrower: https://homosaurus.org/v3/homoit0000211
narrower: https://homosaurus.org/v3/homoit0000212
narrower: https://homosaurus.org/v3/homoit0000239
narrower: https://homosaurus.org/v3/homoit0000242
narrower: https://homosaurus.org/v3/homoit0000280
narrower: https://homosaurus.org/v3/homoit0000293
narrower: https://homosaurus.org/v3/homoit0000309
narrower: https://homosaurus.org/v3/homoit0000319
narrower: https://homosaurus.org/v3/homoit0000402
narrower: https://homosaurus.org/v3/homoit0000412
narrower: https://homosaurus.org/v3/homoit0000445
narrower: https://homosaurus.org/v3/homoit0000456
narrower: https://homosaurus.org/v3/homoit0000588
narrower: https://homosaurus.org/v3/homoit0000593
narrower: https://homosaurus.org/v3/homoit0000597
narrower: https://homosaurus.org/v3/homoit0000603
narrower: https://homosaurus.org/v3/homoit0000662
narrower: https://homosaurus.org/v3/homoit0000691
narrower: https://homosaurus.org/v3/homoit0000988
narrower: https://homosaurus.org/v3/homoit0001000
narrower: https://homosaurus.org/v3/homoit0001028
narrower: https://homosaurus.org/v3/homoit0001033
narrower: https://homosaurus.org/v3/homoit0001039
narrower: https://homosaurus.org/v3/homoit0001046
narrower: https://homosaurus.org/v3/homoit0001109
narrower: https://homosaurus.org/v3/homoit0001110
narrower: https://homosaurus.org/v3/homoit0001115
narrower: https://homosaurus.org/v3/homoit0001142
narrower: https://homosaurus.org/v3/homoit0001240
narrower: https://homosaurus.org/v3/homoit0001246
narrower: https://homosaurus.org/v3/homoit0001251
narrower: https://homosaurus.org/v3/homoit0001344
narrower: https://homosaurus.org/v3/homoit0001357
narrower: https://homosaurus.org/v3/homoit0001487
narrower: https://homosaurus.org/v3/homoit0001628
narrower: https://homosaurus.org/v3/homoit0001640
narrower: https://homosaurus.org/v3/homoit0003072
narrower: https://homosaurus.org/v3/homoit0003113
narrower: https://homosaurus.org/v3/homoit0003124
narrower: https://homosaurus.org/v3/homoit0003127
narrower: https://homosaurus.org/v3/homoit0003132
narrower: https://homosaurus.org/v3/homoit0003133
narrower: https://homosaurus.org/v3/homoit0003147
narrower: https://homosaurus.org/v3/homoit0003709
related: https://homosaurus.org/v3/homoit0000302
related: https://homosaurus.org/v3/homoit0000442
related: https://homosaurus.org/v3/homoit0000595
related: https://homosaurus.org/v3/homoit0000609
related: https://homosaurus.org/v3/homoit0001266
related: https://homosaurus.org/v3/homoit0001306
related: https://homosaurus.org/v3/homoit0001315
related: https://homosaurus.org/v3/homoit0001325
related: https://homosaurus.org/v3/homoit0001641

LGBTQ+ history
type: Concept
issued: 2022-11-08
modified: 2025-02-23
comment: Past events or accounts of the past concerning LGBTQ+ people, or people who might be perceived as LGBTQ+ if they were alive today.
alternative label: History (LGBTQ)
alternative label: LGBTQ history
change note: Version 3.7.0
in scheme: v3
narrower: https://homosaurus.org/v3/homoit0002261
narrower: https://homosaurus.org/v3/homoit0002262
narrower: https://homosaurus.org/v3/homoit0002263
narrower: https://homosaurus.org/v3/homoit0002264
narrower: https://homosaurus.org/v3/homoit0002265
narrower: https://homosaurus.org/v3/homoit0002266
narrower: https://homosaurus.org/v3/homoit0002267
narrower: https://homosaurus.org/v3/homoit0002268
narrower: https://homosaurus.org/v3/homoit0002332
narrower: https://homosaurus.org/v3/homoit0002462
narrower: https://homosaurus.org/v3/homoit0002488
narrower: https://homosaurus.org/v3/homoit0002504
narrower: https://homosaurus.org/v3/homoit0002525
related: https://homosaurus.org/v3/homoit0000878
related: https://homosaurus.org/v3/homoit0000901
related: https://homosaurus.org/v3/homoit0001614
related: https://homosaurus.org/v3/homoit0001729
related: https://homosaurus.org/v3/homoit0001755
related: https://homosaurus.org/v3/homoit0003656

LGBTQ+ theater
type: Concept
issued: 2019-05-14
modified: 2025-02-23
replaces: theatreLGBTQ
comment: Works in the performance arts that focus on LGBTQ+ characters, communities, or issues.
change note: Version 3.7.0
in scheme: v3
narrower: https://homosaurus.org/v3/homoit0000194
narrower: https://homosaurus.org/v3/homoit0000431
narrower: https://homosaurus.org/v3/homoit0000546
narrower: https://homosaurus.org/v3/homoit0000685
narrower: https://homosaurus.org/v3/homoit0000788
narrower: https://homosaurus.org/v3/homoit0000983
narrower: https://homosaurus.org/v3/homoit0001102
narrower: https://homosaurus.org/v3/homoit0001217
narrower: https://homosaurus.org/v3/homoit0001344
narrower: https://homosaurus.org/v3/homoit0001454
narrower: https://homosaurus.org/v3/homoit0002453
narrower: https://homosaurus.org/v3/homoit0002469
narrower: https://homosaurus.org/v3/homoit0002486
narrower: https://homosaurus.org/v3/homoit0002502
narrower: https://homosaurus.org/v3/homoit0002523
narrower: https://homosaurus.org/v3/homoit0002947
preferred label: LGBTQ+ theatre
related: https://homosaurus.org/v3/homoit0000376
related: https://homosaurus.org/v3/homoit0000816
related: https://homosaurus.org/v3/homoit0001031
related: https://homosaurus.org/v3/homoit0001755
related: https://homosaurus.org/v3/homoit0001813
related: https://homosaurus.org/v3/homoit0002731

LGBTQ+ employment
type: Concept
issued: 2021-11-02
modified: 2025-02-23
comment: Employment of LGBTQ+ individuals.
alternative label: Employment (LGBTQ)
change note: Version 3.7.0
in scheme: v3
narrower: https://homosaurus.org/v3/homoit0001718
narrower: https://homosaurus.org/v3/homoit0001719
narrower: https://homosaurus.org/v3/homoit0001720
narrower: https://homosaurus.org/v3/homoit0001721
narrower: https://homosaurus.org/v3/homoit0001722
narrower: https://homosaurus.org/v3/homoit0002029
narrower: https://homosaurus.org/v3/homoit0002740
narrower: https://homosaurus.org/v3/homoit0002791
related: https://homosaurus.org/v3/homoit0001735
related: https://homosaurus.org/v3/homoit0001736
related: https://homosaurus.org/v3/homoit0001737
related: https://homosaurus.org/v3/homoit0001738
related: https://homosaurus.org/v3/homoit0001739
related: https://homosaurus.org/v3/homoit0001740
related: https://homosaurus.org/v3/homoit0001741
related: https://homosaurus.org/v3/homoit0001742
related: https://homosaurus.org/v3/homoit0001743
related: https://homosaurus.org/v3/homoit0001744
related: https://homosaurus.org/v3/homoit0001745
related: https://homosaurus.org/v3/homoit0001746
related: https://homosaurus.org/v3/homoit0001771
related: https://homosaurus.org/v3/homoit0002692

LGBTQ+ clubs and organizations
type: Concept
issued: 2019-05-14
modified: 2025-02-23
replaces: LGBTQClubs
comment: Organized clubs and groups composed primarily of LGBTQ+ people.
alternative label: LGBTQ+ clubs
alternative label: Clubs (LGBTQ)
alternative label: LGBTQ+ organizations
alternative label: Organizations (LGBTQ)
alternative label: Clubs and organizations (LGBTQ)
change note: Version 3.7.0
in scheme: v3
narrower: https://homosaurus.org/v3/homoit0000826
narrower: https://homosaurus.org/v3/homoit0000906
narrower: https://homosaurus.org/v3/homoit0000950
narrower: https://homosaurus.org/v3/homoit0000951
narrower: https://homosaurus.org/v3/homoit0003104
narrower: https://homosaurus.org/v3/homoit0000856
narrower: https://homosaurus.org/v3/homoit0003836
narrower: https://homosaurus.org/v3/homoit0003837
narrower: https://homosaurus.org/v3/homoit0003838
narrower: https://homosaurus.org/v3/homoit0003839
narrower: https://homosaurus.org/v3/homoit0003840
narrower: https://homosaurus.org/v3/homoit0003841
narrower: https://homosaurus.org/v3/homoit0003842
narrower: https://homosaurus.org/v3/homoit0003843
related: https://homosaurus.org/v3/homoit0000833
related: https://homosaurus.org/v3/homoit0000030
related: https://homosaurus.org/v3/homoit0001061

Health care for LGBTQ+ people
type: Concept
issued: 2019-05-14
modified: 2025-02-23
replaces: healthCareForLGBTQPeople
comment: Organized measures taken for the maintenance or improvement of health via the prevention, diagnosis, treatment, and/or cure of disease, illness, injury, or other conditions; use in reference to health care addressing the particular needs of LGBTQ+ individuals or communities.
alternative label: Medical care for LGBTQ people
alternative label: Health care for LGBTQ people
change note: Version 3.7.0
in scheme: v3
narrower: https://homosaurus.org/v3/homoit0000226
narrower: https://homosaurus.org/v3/homoit0001012
narrower: https://homosaurus.org/v3/homoit0001113
narrower: https://homosaurus.org/v3/homoit0001360
narrower: https://homosaurus.org/v3/homoit0003361
narrower: https://homosaurus.org/v3/homoit0003514
narrower: https://homosaurus.org/v3/homoit0003657
related: https://homosaurus.org/v3/homoit0000030
related: https://homosaurus.org/v3/homoit0000876
related: https://homosaurus.org/v3/homoit0003504
related: https://homosaurus.org/v3/homoit0003694

LGBTQ+ activism
type: Concept
issued: 2019-05-14
modified: 2025-02-23
replaces: activismLGBTQ
comment: Direct action and organizing to achieve political or social change and acceptance for LGBTQ+ people.
alternative label: Activism (LGBTQ)
change note: Version 3.7.0
in scheme: v3
narrower: https://homosaurus.org/v3/homoit0000122
narrower: https://homosaurus.org/v3/homoit0000462
narrower: https://homosaurus.org/v3/homoit0000713
narrower: https://homosaurus.org/v3/homoit0000853
narrower: https://homosaurus.org/v3/homoit0001150
narrower: https://homosaurus.org/v3/homoit0001383
narrower: https://homosaurus.org/v3/homoit0002751
narrower: https://homosaurus.org/v3/homoit0002758
related: https://homosaurus.org/v3/homoit0000007
related: https://homosaurus.org/v3/homoit0000038
related: https://homosaurus.org/v3/homoit0000534
related: https://homosaurus.org/v3/homoit0001319
related: https://homosaurus.org/v3/homoit0002396
related: https://homosaurus.org/v3/homoit0002656
related: https://homosaurus.org/v3/homoit0003195
related: https://homosaurus.org/v3/homoit0003695

LGBTQ+ meeting places
type: Concept
issued: 2019-05-14
modified: 2025-02-23
replaces: LGBTQMeetingPlaces
comment: Physical or online spaces in which LGBTQ+ people meet.
alternative label: LGBTQ meeting places
change note: Version 3.7.0
in scheme: v3
narrower: https://homosaurus.org/v3/homoit0000100
narrower: https://homosaurus.org/v3/homoit0000104
narrower: https://homosaurus.org/v3/homoit0000298
narrower: https://homosaurus.org/v3/homoit0003699
related: https://homosaurus.org/v3/homoit0000319
related: https://homosaurus.org/v3/homoit0000846
related: https://homosaurus.org/v3/homoit0000847
related: https://homosaurus.org/v3/homoit0000861
related: https://homosaurus.org/v3/homoit0000909
related: https://homosaurus.org/v3/homoit0000946
related: https://homosaurus.org/v3/homoit0000974
related: https://homosaurus.org/v3/homoit0001142
related: https://homosaurus.org/v3/homoit0002157
related: https://homosaurus.org/v3/homoit0002166
related: https://homosaurus.org/v3/homoit0002202

LGBTQ+ centers
type: Concept
issued: 2019-05-14
modified: 2025-02-23
replaces: LGBTQCentres
comment: Spaces dedicated for use by members of LGBTQ+ communities engaging in various activities, including education, health and wellness services, community support and outreach, etc. Use a more specific term if possible.
change note: Version 3.7.0
in scheme: v3
narrower: https://homosaurus.org/v3/homoit0000298
narrower: https://homosaurus.org/v3/homoit0000660
narrower: https://homosaurus.org/v3/homoit0000876
narrower: https://homosaurus.org/v3/homoit0000964
preferred label: LGBTQ+ centres

Social movements
type: Concept
issued: 2019-05-14
modified: 2025-02-23
replaces: socialMovements
comment: Organized efforts by groups of people to achieve certain political, social, economic, or cultural goals. Social movements are often intended to carry out, resist, or undo social changes.
change note: Version 3.7.0
in scheme: v3
narrower: https://homosaurus.org/v3/homoit0000411
narrower: https://homosaurus.org/v3/homoit0000438
narrower: https://homosaurus.org/v3/homoit0001010
narrower: https://homosaurus.org/v3/homoit0001026
narrower: https://homosaurus.org/v3/homoit0001319
narrower: https://homosaurus.org/v3/homoit0002390
narrower: https://homosaurus.org/v3/homoit0002391
narrower: https://homosaurus.org/v3/homoit0002398
narrower: https://homosaurus.org/v3/homoit0003737
related: https://homosaurus.org/v3/homoit0000672

Legal status
type: Concept
issued: 2019-05-14
modified: 2025-02-23
replaces: legalStatus
comment: The status or standing of an individual or thing within a certain legal jurisdiction, including the individual's or thing's legal rights and privileges; typically used in reference to citizenship or marriage.
change note: Version 3.7.0
in scheme: v3
narrower: https://homosaurus.org/v3/homoit0000883
narrower: https://homosaurus.org/v3/homoit0001053
narrower: https://homosaurus.org/v3/homoit0001074
narrower: https://homosaurus.org/v3/homoit0001082
narrower: https://homosaurus.org/v3/homoit0001100
related: https://homosaurus.org/v3/homoit0000274
related: https://homosaurus.org/v3/homoit0000348
related: https://homosaurus.org/v3/homoit0000702
related: https://homosaurus.org/v3/homoit0000927
related: https://homosaurus.org/v3/homoit0000989
related: https://homosaurus.org/v3/homoit0001482

LGBTQ+ phobia
type: Concept
issued: 2019-05-14
modified: 2025-02-23
replaces: LGBTQPhobia
comment: Antagonism or disgust directed towards LGBTQ+ identities or people due to their sexuality or gender, perceived or actual. LGBTQ+ phobia can include denial of the existence of certain LGBTQ+ identities, stereotypes, verbal harassment, and physical violence.
alternative label: LGBTQ phobia
change note: Version 3.7.0
in scheme: v3
narrower: https://homosaurus.org/v3/homoit0000117
narrower: https://homosaurus.org/v3/homoit0000565
narrower: https://homosaurus.org/v3/homoit0000646
narrower: https://homosaurus.org/v3/homoit0000666
narrower: https://homosaurus.org/v3/homoit0000803
narrower: https://homosaurus.org/v3/homoit0001229
narrower: https://homosaurus.org/v3/homoit0001467
related: https://homosaurus.org/v3/homoit0000032
related: https://homosaurus.org/v3/homoit0000228
related: https://homosaurus.org/v3/homoit0001885
related: https://homosaurus.org/v3/homoit0002590

Living arrangements
type: Concept
issued: 2019-05-14
modified: 2025-02-23
replaces: livingArrangements
comment: Structure or composition of an individual's household or living environment, including the number of household members and their relationships to each other.
change note: Version 3.7.0
in scheme: v3
narrower: https://homosaurus.org/v3/homoit0000274
narrower: https://homosaurus.org/v3/homoit0000362
narrower: https://homosaurus.org/v3/homoit0000990
related: https://homosaurus.org/v3/homoit0000360

Sex workers
type: Concept
issued: 2024-10-30
modified: 2025-02-23
comment: People who receive money or goods in exchange for sexual services or performances. Use to describe people working across the broad spectrum of sex work, and use more specific terms if possible.
alternative label: Prostitutes
alternative label: Hookers
alternative label: Hustlers
alternative label: Pros
change note: Version 3.7.0
in scheme: v3
narrower: https://homosaurus.org/v3/homoit0001277
narrower: https://homosaurus.org/v3/homoit0001111
narrower: https://homosaurus.org/v3/homoit0001343
narrower: https://homosaurus.org/v3/homoit0000433
narrower: https://homosaurus.org/v3/homoit0000236
narrower: https://homosaurus.org/v3/homoit0000406
narrower: https://homosaurus.org/v3/homoit0003761
narrower: https://homosaurus.org/v3/homoit0003762
narrower: https://homosaurus.org/v3/homoit0003769
narrower: https://homosaurus.org/v3/homoit0003793
narrower: https://homosaurus.org/v3/homoit0003801
related: https://homosaurus.org/v3/homoit0000494
related: https://homosaurus.org/v3/homoit0001276

Theories
type: Concept
issued: 2019-05-14
modified: 2025-02-23
replaces: theories
comment: Systems of ideas intended to explain a particular phenomenon.
change note: Version 3.7.0
in scheme: v3
narrower: https://homosaurus.org/v3/homoit0000115
narrower: https://homosaurus.org/v3/homoit0000408
narrower: https://homosaurus.org/v3/homoit0001219
narrower: https://homosaurus.org/v3/homoit0001320
narrower: https://homosaurus.org/v3/homoit0001902
narrower: https://homosaurus.org/v3/homoit0002039
narrower: https://homosaurus.org/v3/homoit0002272
narrower: https://homosaurus.org/v3/homoit0003515
narrower: https://homosaurus.org/v3/homoit0003520
narrower: https://homosaurus.org/v3/homoit0003616

LGBTQ+ historical terms
type: Concept
issued: 2019-05-14
modified: 2025-02-23
replaces: LGBTQHistoricalTerms
comment: Historical terms for LGBTQ+ people, identities, and practices that are now considered outdated and/or offensive.
alternative label: LGBTQ historical terms
change note: Version 3.7.0
in scheme: v3
narrower: https://homosaurus.org/v3/homoit0000095
narrower: https://homosaurus.org/v3/homoit0000098
narrower: https://homosaurus.org/v3/homoit0000218
narrower: https://homosaurus.org/v3/homoit0000227
narrower: https://homosaurus.org/v3/homoit0000284
narrower: https://homosaurus.org/v3/homoit0000326
narrower: https://homosaurus.org/v3/homoit0000395
narrower: https://homosaurus.org/v3/homoit0000396
narrower: https://homosaurus.org/v3/homoit0000418
narrower: https://homosaurus.org/v3/homoit0000436
narrower: https://homosaurus.org/v3/homoit0000454
narrower: https://homosaurus.org/v3/homoit0000645
narrower: https://homosaurus.org/v3/homoit0000648
narrower: https://homosaurus.org/v3/homoit0000677
narrower: https://homosaurus.org/v3/homoit0000986
narrower: https://homosaurus.org/v3/homoit0001094
narrower: https://homosaurus.org/v3/homoit0001095
narrower: https://homosaurus.org/v3/homoit0001258
narrower: https://homosaurus.org/v3/homoit0001296
narrower: https://homosaurus.org/v3/homoit0001325
narrower: https://homosaurus.org/v3/homoit0001470
narrower: https://homosaurus.org/v3/homoit0001472
narrower: https://homosaurus.org/v3/homoit0001484
narrower: https://homosaurus.org/v3/homoit0001564
narrower: https://homosaurus.org/v3/homoit0001669
narrower: https://homosaurus.org/v3/homoit0001822
narrower: https://homosaurus.org/v3/homoit0001895
narrower: https://homosaurus.org/v3/homoit0001980
narrower: https://homosaurus.org/v3/homoit0002230
narrower: https://homosaurus.org/v3/homoit0003816
narrower: https://homosaurus.org/v3/homoit0003817
related: https://homosaurus.org/v3/homoit0002260

LGBTQ+ information professionals
type: Concept
issued: 2024-10-22
modified: 2025-02-23
comment: LGBTQ+ people whose profession involves managing information by collecting, organizing, storing and disseminating it. This can include but is not limited to librarians, archivists, metadata and IT workers, web developers, and chief information officers. Use more specific terms when possible.
alternative label: Information professionals (LGBTQ+)
change note: Version 3.7.0
in scheme: v3
narrower: https://homosaurus.org/v3/homoit0003547
narrower: https://homosaurus.org/v3/homoit0003618
related: https://homosaurus.org/v3/homoit0000661
related: https://homosaurus.org/v3/homoit0000825
related: https://homosaurus.org/v3/homoit0003619

LGBTQ+ events
type: Concept
issued: 2019-05-14
modified: 2025-02-23
replaces: LGBTQEvents
comment: Organized public or social occasions for LGBTQ+ people and communities.
alternative label: LGBTQ events
change note: Version 3.7.0
in scheme: v3
narrower: https://homosaurus.org/v3/homoit0000368
narrower: https://homosaurus.org/v3/homoit0000607
narrower: https://homosaurus.org/v3/homoit0000949
narrower: https://homosaurus.org/v3/homoit0003080
narrower: https://homosaurus.org/v3/homoit0003106
narrower: https://homosaurus.org/v3/homoit0003359
narrower: https://homosaurus.org/v3/homoit0003360
narrower: https://homosaurus.org/v3/homoit0003594
narrower: https://homosaurus.org/v3/homoit0003595
narrower: https://homosaurus.org/v3/homoit0003596
narrower: https://homosaurus.org/v3/homoit0003597
narrower: https://homosaurus.org/v3/homoit0003598
narrower: https://homosaurus.org/v3/homoit0003599
narrower: https://homosaurus.org/v3/homoit0003600
narrower: https://homosaurus.org/v3/homoit0003602
narrower: https://homosaurus.org/v3/homoit0003603
narrower: https://homosaurus.org/v3/homoit0003604
narrower: https://homosaurus.org/v3/homoit0003605
narrower: https://homosaurus.org/v3/homoit0003606
narrower: https://homosaurus.org/v3/homoit0003651
narrower: https://homosaurus.org/v3/homoit0003656
narrower: https://homosaurus.org/v3/homoit0003734
narrower: https://homosaurus.org/v3/homoit0003735
related: https://homosaurus.org/v3/homoit0000853
related: https://homosaurus.org/v3/homoit0000900
related: https://homosaurus.org/v3/homoit0002157
related: https://homosaurus.org/v3/homoit0002166
related: https://homosaurus.org/v3/homoit0002202
related: https://homosaurus.org/v3/homoit0003601
related: https://homosaurus.org/v3/homoit0003607

LGBTQ+ cultural heritage institutions
type: Concept
issued: 2021-11-23
modified: 2025-02-23
comment: A broad grouping term for galleries, libraries, archives, museums, and special collections (GLAMS) that hold materials primarily pertaining to LGBTQ+ people or intended for use by LGBTQ+ people.
alternative label: Cultural heritage institutions (LGBTQ)
alternative label: GLAM (LGBTQ)
alternative label: GLAMS (LGBTQ)
alternative label: LGBTQ+ GLAM
alternative label: LGBTQ+ GLAMS
change note: Version 3.7.0
in scheme: v3
narrower: https://homosaurus.org/v3/homoit0000066
narrower: https://homosaurus.org/v3/homoit0000968
narrower: https://homosaurus.org/v3/homoit0001030
narrower: https://homosaurus.org/v3/homoit0001813
related: https://homosaurus.org/v3/homoit0000070
related: https://homosaurus.org/v3/homoit0000816
related: https://homosaurus.org/v3/homoit0000972
related: https://homosaurus.org/v3/homoit0001363
related: https://homosaurus.org/v3/homoit0001831
related: https://homosaurus.org/v3/homoit0002260

Youth
type: Concept
issued: 2019-05-14
modified: 2025-02-23
replaces: youth
comment: The time period between childhood and adulthood.
change note: Version 3.7.0
in scheme: v3
narrower: https://homosaurus.org/v3/homoit0000630
narrower: https://homosaurus.org/v3/homoit0000674
narrower: https://homosaurus.org/v3/homoit0001521
narrower: https://homosaurus.org/v3/homoit0002281
narrower: https://homosaurus.org/v3/homoit0002711
related: https://homosaurus.org/v3/homoit0000255
related: https://homosaurus.org/v3/homoit0002151

LGBTQ+ relationships
type: Concept
issued: 2019-05-14
modified: 2025-02-23
replaces: relationshipsLGBTQ
comment: Ongoing connections (romantic, sexual, or platonic) between two or more LGBTQ+ people.
alternative label: Relationships (LGBTQ)
change note: Version 3.7.0
in scheme: v3
narrower: https://homosaurus.org/v3/homoit0000182
narrower: https://homosaurus.org/v3/homoit0000230
narrower: https://homosaurus.org/v3/homoit0000310
narrower: https://homosaurus.org/v3/homoit0000315
narrower: https://homosaurus.org/v3/homoit0000455
narrower: https://homosaurus.org/v3/homoit0000529
narrower: https://homosaurus.org/v3/homoit0000628
narrower: https://homosaurus.org/v3/homoit0000663
narrower: https://homosaurus.org/v3/homoit0000773
narrower: https://homosaurus.org/v3/homoit0001205
narrower: https://homosaurus.org/v3/homoit0001302
narrower: https://homosaurus.org/v3/homoit0001442
narrower: https://homosaurus.org/v3/homoit0002514
narrower: https://homosaurus.org/v3/homoit0002807
narrower: https://homosaurus.org/v3/homoit0002939
narrower: https://homosaurus.org/v3/homoit0003592
narrower: https://homosaurus.org/v3/homoit0003821
related: https://homosaurus.org/v3/homoit0000067
related: https://homosaurus.org/v3/homoit0000362
related: https://homosaurus.org/v3/homoit0000894
related: https://homosaurus.org/v3/homoit0000937
related: https://homosaurus.org/v3/homoit0001083
related: https://homosaurus.org/v3/homoit0001311
related: https://homosaurus.org/v3/homoit0001636
related: https://homosaurus.org/v3/homoit0002189
related: https://homosaurus.org/v3/homoit0002722

LGBTQ+ communities
type: Concept
issued: 2019-05-14
modified: 2025-02-23
replaces: communitiesLGBTQ
comment: Groups of LGBTQ+ people who share interests or interact regularly, typically living in some proximity.
alternative label: Communities (LGBTQ)
change note: Version 3.7.0
in scheme: v3
narrower: https://homosaurus.org/v3/homoit0000103
narrower: https://homosaurus.org/v3/homoit0000143
narrower: https://homosaurus.org/v3/homoit0000370
narrower: https://homosaurus.org/v3/homoit0000485
narrower: https://homosaurus.org/v3/homoit0000705
narrower: https://homosaurus.org/v3/homoit0000733
narrower: https://homosaurus.org/v3/homoit0000842
narrower: https://homosaurus.org/v3/homoit0001170
narrower: https://homosaurus.org/v3/homoit0001247
narrower: https://homosaurus.org/v3/homoit0001403
narrower: https://homosaurus.org/v3/homoit0001878
narrower: https://homosaurus.org/v3/homoit0002773
narrower: https://homosaurus.org/v3/homoit0002931
narrower: https://homosaurus.org/v3/homoit0003032
narrower: https://homosaurus.org/v3/homoit0003698
related: https://homosaurus.org/v3/homoit0000298
related: https://homosaurus.org/v3/homoit0000558
related: https://homosaurus.org/v3/homoit0001811
related: https://homosaurus.org/v3/homoit0003699

Sexual identity
type: Concept
issued: 2019-05-14
modified: 2025-02-23
replaces: sexualIdentity
comment: How an individual understands their identity in relation to their romantic or sexual attraction to other people.
change note: Version 3.7.0
in scheme: v3
narrower: https://homosaurus.org/v3/homoit0000095
narrower: https://homosaurus.org/v3/homoit0000105
narrower: https://homosaurus.org/v3/homoit0000153
narrower: https://homosaurus.org/v3/homoit0000219
narrower: https://homosaurus.org/v3/homoit0000231
narrower: https://homosaurus.org/v3/homoit0000267
narrower: https://homosaurus.org/v3/homoit0000326
narrower: https://homosaurus.org/v3/homoit0000344
narrower: https://homosaurus.org/v3/homoit0000415
narrower: https://homosaurus.org/v3/homoit0000440
narrower: https://homosaurus.org/v3/homoit0000496
narrower: https://homosaurus.org/v3/homoit0000624
narrower: https://homosaurus.org/v3/homoit0000744
narrower: https://homosaurus.org/v3/homoit0000999
narrower: https://homosaurus.org/v3/homoit0001018
narrower: https://homosaurus.org/v3/homoit0001063
narrower: https://homosaurus.org/v3/homoit0001094
narrower: https://homosaurus.org/v3/homoit0001145
narrower: https://homosaurus.org/v3/homoit0001178
narrower: https://homosaurus.org/v3/homoit0001254
narrower: https://homosaurus.org/v3/homoit0001318
narrower: https://homosaurus.org/v3/homoit0001327
narrower: https://homosaurus.org/v3/homoit0001340
narrower: https://homosaurus.org/v3/homoit0001353
narrower: https://homosaurus.org/v3/homoit0001376
narrower: https://homosaurus.org/v3/homoit0001479
narrower: https://homosaurus.org/v3/homoit0001508
narrower: https://homosaurus.org/v3/homoit0001558
narrower: https://homosaurus.org/v3/homoit0001632
narrower: https://homosaurus.org/v3/homoit0001779
narrower: https://homosaurus.org/v3/homoit0001898
narrower: https://homosaurus.org/v3/homoit0001926
narrower: https://homosaurus.org/v3/homoit0002276
narrower: https://homosaurus.org/v3/homoit0003084
narrower: https://homosaurus.org/v3/homoit0003506
related: https://homosaurus.org/v3/homoit0000036
related: https://homosaurus.org/v3/homoit0000092
related: https://homosaurus.org/v3/homoit0000115
related: https://homosaurus.org/v3/homoit0000230
related: https://homosaurus.org/v3/homoit0000315
related: https://homosaurus.org/v3/homoit0000322
related: https://homosaurus.org/v3/homoit0000338
related: https://homosaurus.org/v3/homoit0000382
related: https://homosaurus.org/v3/homoit0000442
related: https://homosaurus.org/v3/homoit0000458
related: https://homosaurus.org/v3/homoit0000487
related: https://homosaurus.org/v3/homoit0000571
related: https://homosaurus.org/v3/homoit0000663
related: https://homosaurus.org/v3/homoit0000997
related: https://homosaurus.org/v3/homoit0001019
related: https://homosaurus.org/v3/homoit0001081
related: https://homosaurus.org/v3/homoit0001123
related: https://homosaurus.org/v3/homoit0001124
related: https://homosaurus.org/v3/homoit0001241
related: https://homosaurus.org/v3/homoit0001242
related: https://homosaurus.org/v3/homoit0001250
related: https://homosaurus.org/v3/homoit0001290
related: https://homosaurus.org/v3/homoit0001298
related: https://homosaurus.org/v3/homoit0001300
related: https://homosaurus.org/v3/homoit0001304
related: https://homosaurus.org/v3/homoit0001406
related: https://homosaurus.org/v3/homoit0001556
related: https://homosaurus.org/v3/homoit0001901
related: https://homosaurus.org/v3/homoit0001915

Sex industry
type: Concept
issued: 2019-05-14
modified: 2025-02-23
replaces: sexIndustry
comment: Businesses that either directly or indirectly provide sexual services, sex-related products, and/or erotic entertainment.
alternative label: Adult entertainment industry
alternative label: Commercial sex
alternative label: Sex trade
change note: Version 3.7.0
in scheme: v3
narrower: https://homosaurus.org/v3/homoit0000012
narrower: https://homosaurus.org/v3/homoit0000014
narrower: https://homosaurus.org/v3/homoit0000475
narrower: https://homosaurus.org/v3/homoit0001096
narrower: https://homosaurus.org/v3/homoit0001126
narrower: https://homosaurus.org/v3/homoit0001270
narrower: https://homosaurus.org/v3/homoit0001275
narrower: https://homosaurus.org/v3/homoit0001276
narrower: https://homosaurus.org/v3/homoit0003796
narrower: https://homosaurus.org/v3/homoit0003799
narrower: https://homosaurus.org/v3/homoit0001128

Law
type: Concept
issued: 2019-05-14
modified: 2025-02-23
replaces: law
comment: System of rules or conduct recognized and legally enforced within a country or community.
alternative label: Legislation
change note: Version 3.7.0
in scheme: v3
narrower: https://homosaurus.org/v3/homoit0000053
narrower: https://homosaurus.org/v3/homoit0000311
narrower: https://homosaurus.org/v3/homoit0000313
narrower: https://homosaurus.org/v3/homoit0000918
narrower: https://homosaurus.org/v3/homoit0001139
narrower: https://homosaurus.org/v3/homoit0001492
narrower: https://homosaurus.org/v3/homoit0003499
narrower: https://homosaurus.org/v3/homoit0003772
related: https://homosaurus.org/v3/homoit0000712
related: https://homosaurus.org/v3/homoit0000893
related: https://homosaurus.org/v3/homoit0001482

LGBTQ+ press
type: Concept
issued: 2019-05-14
modified: 2025-02-23
replaces: pressLGBTQ
comment: Newspapers, magazines, or other publishing outlets aimed at LGBTQ+ audiences and/or operated by LGBTQ+ people.
alternative label: Press (LGBTQ)
change note: Version 3.7.0
in scheme: v3
narrower: https://homosaurus.org/v3/homoit0000177
narrower: https://homosaurus.org/v3/homoit0000521
narrower: https://homosaurus.org/v3/homoit0000766
narrower: https://homosaurus.org/v3/homoit0000896
narrower: https://homosaurus.org/v3/homoit0000923
narrower: https://homosaurus.org/v3/homoit0000965
narrower: https://homosaurus.org/v3/homoit0001041
narrower: https://homosaurus.org/v3/homoit0001042
narrower: https://homosaurus.org/v3/homoit0001200
narrower: https://homosaurus.org/v3/homoit0001436
narrower: https://homosaurus.org/v3/homoit0002804
narrower: https://homosaurus.org/v3/homoit0002936
related: https://homosaurus.org/v3/homoit0000031
related: https://homosaurus.org/v3/homoit0000216
related: https://homosaurus.org/v3/homoit0000827
related: https://homosaurus.org/v3/homoit0000972
related: https://homosaurus.org/v3/homoit0002719

Sex accessories
type: Concept
issued: 2019-05-14
modified: 2025-02-23
replaces: sexAccessories
comment: Objects, devices, or articles of clothing used for sexual stimulation or to enhance sexual pleasure and experiences.
change note: Version 3.7.0
in scheme: v3
narrower: https://homosaurus.org/v3/homoit0000041
narrower: https://homosaurus.org/v3/homoit0000093
narrower: https://homosaurus.org/v3/homoit0000209
narrower: https://homosaurus.org/v3/homoit0000213
narrower: https://homosaurus.org/v3/homoit0000233
narrower: https://homosaurus.org/v3/homoit0000279
narrower: https://homosaurus.org/v3/homoit0000292
narrower: https://homosaurus.org/v3/homoit0000293
narrower: https://homosaurus.org/v3/homoit0000294
narrower: https://homosaurus.org/v3/homoit0000299
narrower: https://homosaurus.org/v3/homoit0000346
narrower: https://homosaurus.org/v3/homoit0000354
narrower: https://homosaurus.org/v3/homoit0000355
narrower: https://homosaurus.org/v3/homoit0000448
narrower: https://homosaurus.org/v3/homoit0000612
narrower: https://homosaurus.org/v3/homoit0000700
narrower: https://homosaurus.org/v3/homoit0000704
narrower: https://homosaurus.org/v3/homoit0000970
narrower: https://homosaurus.org/v3/homoit0000977
narrower: https://homosaurus.org/v3/homoit0001045
narrower: https://homosaurus.org/v3/homoit0001068
narrower: https://homosaurus.org/v3/homoit0001238
narrower: https://homosaurus.org/v3/homoit0001243
narrower: https://homosaurus.org/v3/homoit0001337
narrower: https://homosaurus.org/v3/homoit0001491
narrower: https://homosaurus.org/v3/homoit0001503
narrower: https://homosaurus.org/v3/homoit0003050
narrower: https://homosaurus.org/v3/homoit0003100
narrower: https://homosaurus.org/v3/homoit0003107
narrower: https://homosaurus.org/v3/homoit0003111
narrower: https://homosaurus.org/v3/homoit0003112
narrower: https://homosaurus.org/v3/homoit0003134
narrower: https://homosaurus.org/v3/homoit0003143
narrower: https://homosaurus.org/v3/homoit0003144
narrower: https://homosaurus.org/v3/homoit0003146
narrower: https://homosaurus.org/v3/homoit0003178
related: https://homosaurus.org/v3/homoit0000012
related: https://homosaurus.org/v3/homoit0001267
related: https://homosaurus.org/v3/homoit0001299
related: https://homosaurus.org/v3/homoit0001306
related: https://homosaurus.org/v3/homoit0003059

Pronouns
type: Concept
issued: 2019-05-14
modified: 2025-02-23
replaces: pronouns
comment: Words used in place of a noun. Typically used in the context of "personal pronouns," or pronouns used to describe people (e.g., she, he, they, ze).
alternative label: Personal pronouns
change note: Version 3.7.0
in scheme: v3
narrower: https://homosaurus.org/v3/homoit0001673
narrower: https://homosaurus.org/v3/homoit0001674
narrower: https://homosaurus.org/v3/homoit0001675
narrower: https://homosaurus.org/v3/homoit0001676
narrower: https://homosaurus.org/v3/homoit0001677
narrower: https://homosaurus.org/v3/homoit0001678
narrower: https://homosaurus.org/v3/homoit0001679
narrower: https://homosaurus.org/v3/homoit0001680
narrower: https://homosaurus.org/v3/homoit0001681
narrower: https://homosaurus.org/v3/homoit0001682
narrower: https://homosaurus.org/v3/homoit0001683
narrower: https://homosaurus.org/v3/homoit0001684
narrower: https://homosaurus.org/v3/homoit0001685
narrower: https://homosaurus.org/v3/homoit0001686
narrower: https://homosaurus.org/v3/homoit0001687
narrower: https://homosaurus.org/v3/homoit0001688
narrower: https://homosaurus.org/v3/homoit0001689
narrower: https://homosaurus.org/v3/homoit0001690
narrower: https://homosaurus.org/v3/homoit0001691
narrower: https://homosaurus.org/v3/homoit0001692
narrower: https://homosaurus.org/v3/homoit0001693
narrower: https://homosaurus.org/v3/homoit0001694
narrower: https://homosaurus.org/v3/homoit0001695
narrower: https://homosaurus.org/v3/homoit0001696
narrower: https://homosaurus.org/v3/homoit0001697
narrower: https://homosaurus.org/v3/homoit0001698
narrower: https://homosaurus.org/v3/homoit0001699
narrower: https://homosaurus.org/v3/homoit0001700
narrower: https://homosaurus.org/v3/homoit0001701
narrower: https://homosaurus.org/v3/homoit0001702
narrower: https://homosaurus.org/v3/homoit0001703
narrower: https://homosaurus.org/v3/homoit0001704
narrower: https://homosaurus.org/v3/homoit0001705
narrower: https://homosaurus.org/v3/homoit0001706
narrower: https://homosaurus.org/v3/homoit0001707
narrower: https://homosaurus.org/v3/homoit0001708
narrower: https://homosaurus.org/v3/homoit0001709
narrower: https://homosaurus.org/v3/homoit0001710
narrower: https://homosaurus.org/v3/homoit0001711
narrower: https://homosaurus.org/v3/homoit0001712
narrower: https://homosaurus.org/v3/homoit0001713
narrower: https://homosaurus.org/v3/homoit0001714
narrower: https://homosaurus.org/v3/homoit0001715
narrower: https://homosaurus.org/v3/homoit0001716
related: https://homosaurus.org/v3/homoit0001016
related: https://homosaurus.org/v3/homoit0001672
related: https://homosaurus.org/v3/homoit0002259

LGBTQ+ families
type: Concept
issued: 2019-05-14
modified: 2025-02-23
replaces: familiesLGBTQ
comment: Families, whether biological, adoptive, or chosen, in which one or more individuals identify as LGBTQ+.
alternative label: Families (LGBTQ)
change note: Version 3.7.0
in scheme: v3
narrower: https://homosaurus.org/v3/homoit0000150
narrower: https://homosaurus.org/v3/homoit0000371
narrower: https://homosaurus.org/v3/homoit0000491
narrower: https://homosaurus.org/v3/homoit0000740
narrower: https://homosaurus.org/v3/homoit0000810
narrower: https://homosaurus.org/v3/homoit0000812
narrower: https://homosaurus.org/v3/homoit0000819
narrower: https://homosaurus.org/v3/homoit0000834
narrower: https://homosaurus.org/v3/homoit0000870
narrower: https://homosaurus.org/v3/homoit0000872
narrower: https://homosaurus.org/v3/homoit0000943
narrower: https://homosaurus.org/v3/homoit0001075
narrower: https://homosaurus.org/v3/homoit0001083
narrower: https://homosaurus.org/v3/homoit0001176
narrower: https://homosaurus.org/v3/homoit0001412
narrower: https://homosaurus.org/v3/homoit0001757
narrower: https://homosaurus.org/v3/homoit0001758
narrower: https://homosaurus.org/v3/homoit0001759
narrower: https://homosaurus.org/v3/homoit0002586
related: https://homosaurus.org/v3/homoit0000809
related: https://homosaurus.org/v3/homoit0000811
related: https://homosaurus.org/v3/homoit0000864
related: https://homosaurus.org/v3/homoit0000871
related: https://homosaurus.org/v3/homoit0000914
related: https://homosaurus.org/v3/homoit0000945
related: https://homosaurus.org/v3/homoit0001310
related: https://homosaurus.org/v3/homoit0002584
related: https://homosaurus.org/v3/homoit0002585

Medical care
type: Concept
issued: 2019-05-14
modified: 2025-02-23
replaces: medicalCare
comment: Organized measures taken for the maintenance or improvement of health via the prevention, diagnosis, treatment, or cure of disease, illness, injury, or other condition.
change note: Version 3.7.0
in scheme: v3
narrower: https://homosaurus.org/v3/homoit0000029
narrower: https://homosaurus.org/v3/homoit0000561
narrower: https://homosaurus.org/v3/homoit0001006
narrower: https://homosaurus.org/v3/homoit0001366
related: https://homosaurus.org/v3/homoit0000364
related: https://homosaurus.org/v3/homoit0001005
related: https://homosaurus.org/v3/homoit0002844

Sex (Act)
type: Concept
issued: 2019-05-14
modified: 2025-02-23
replaces: sexAct
comment: The act of engaging in a physical and/or mental interaction with another person or object with the specific intent to elicit sexual arousal or climax.
change note: Version 3.7.0
in scheme: v3
narrower: https://homosaurus.org/v3/homoit0000043
narrower: https://homosaurus.org/v3/homoit0000049
narrower: https://homosaurus.org/v3/homoit0000075
narrower: https://homosaurus.org/v3/homoit0000081
narrower: https://homosaurus.org/v3/homoit0000212
narrower: https://homosaurus.org/v3/homoit0000239
narrower: https://homosaurus.org/v3/homoit0000280
narrower: https://homosaurus.org/v3/homoit0000293
narrower: https://homosaurus.org/v3/homoit0000309
narrower: https://homosaurus.org/v3/homoit0000319
narrower: https://homosaurus.org/v3/homoit0000402
narrower: https://homosaurus.org/v3/homoit0000456
narrower: https://homosaurus.org/v3/homoit0000459
narrower: https://homosaurus.org/v3/homoit0000588
narrower: https://homosaurus.org/v3/homoit0000593
narrower: https://homosaurus.org/v3/homoit0000597
narrower: https://homosaurus.org/v3/homoit0000662
narrower: https://homosaurus.org/v3/homoit0000691
narrower: https://homosaurus.org/v3/homoit0000988
narrower: https://homosaurus.org/v3/homoit0001000
narrower: https://homosaurus.org/v3/homoit0001028
narrower: https://homosaurus.org/v3/homoit0001033
narrower: https://homosaurus.org/v3/homoit0001039
narrower: https://homosaurus.org/v3/homoit0001046
narrower: https://homosaurus.org/v3/homoit0001109
narrower: https://homosaurus.org/v3/homoit0001110
narrower: https://homosaurus.org/v3/homoit0001242
narrower: https://homosaurus.org/v3/homoit0001246
narrower: https://homosaurus.org/v3/homoit0001251
narrower: https://homosaurus.org/v3/homoit0001257
narrower: https://homosaurus.org/v3/homoit0001281
narrower: https://homosaurus.org/v3/homoit0001282
narrower: https://homosaurus.org/v3/homoit0001342
narrower: https://homosaurus.org/v3/homoit0001487
narrower: https://homosaurus.org/v3/homoit0001667
narrower: https://homosaurus.org/v3/homoit0001669
narrower: https://homosaurus.org/v3/homoit0002289
narrower: https://homosaurus.org/v3/homoit0003073
narrower: https://homosaurus.org/v3/homoit0003124
narrower: https://homosaurus.org/v3/homoit0003132
narrower: https://homosaurus.org/v3/homoit0003133
narrower: https://homosaurus.org/v3/homoit0003147
related: https://homosaurus.org/v3/homoit0000302
related: https://homosaurus.org/v3/homoit0000442
related: https://homosaurus.org/v3/homoit0000609
related: https://homosaurus.org/v3/homoit0000967
related: https://homosaurus.org/v3/homoit0000974
related: https://homosaurus.org/v3/homoit0001062
related: https://homosaurus.org/v3/homoit0001266
related: https://homosaurus.org/v3/homoit0001284
related: https://homosaurus.org/v3/homoit0001292
related: https://homosaurus.org/v3/homoit0001306
related: https://homosaurus.org/v3/homoit0001315
related: https://homosaurus.org/v3/homoit0001325
related: https://homosaurus.org/v3/homoit0002219

Eroticism
type: Concept
issued: 2019-05-14
modified: 2025-02-23
replaces: eroticism
comment: The quality of being erotic, or causing sexual attraction, arousal, or desire.
change note: Version 3.7.0
in scheme: v3
narrower: https://homosaurus.org/v3/homoit0000442
narrower: https://homosaurus.org/v3/homoit0001806
related: https://homosaurus.org/v3/homoit0001112
related: https://homosaurus.org/v3/homoit0001284
related: https://homosaurus.org/v3/homoit0001306

Sex (Body)
type: Concept
issued: 2019-05-14
modified: 2025-02-23
replaces: sexBody
comment: The category assigned to an individual to describe their body and its role in sexual reproduction, usually based on external anatomy, but also including chromosomes, gene expression, hormones, and internal and external reproductive/sexual organs. Although sex is often described as binary, it exists as a spectrum with significant variation in the biological attributes that comprise sex and the way it is defined in different cultural contexts.
change note: Version 3.7.0
in scheme: v3
narrower: https://homosaurus.org/v3/homoit0000266
narrower: https://homosaurus.org/v3/homoit0000352
narrower: https://homosaurus.org/v3/homoit0000585
narrower: https://homosaurus.org/v3/homoit0000600
narrower: https://homosaurus.org/v3/homoit0000651
narrower: https://homosaurus.org/v3/homoit0001259
narrower: https://homosaurus.org/v3/homoit0001648
narrower: https://homosaurus.org/v3/homoit0001896
related: https://homosaurus.org/v3/homoit0000560

LGBTQ+ religious people
type: Concept
issued: 2019-05-14
modified: 2025-02-23
replaces: LGBTQReligions
comment: LGBTQ+ people who belong to a religion or hold religious beliefs. For LGBTQ+ people who hold spiritual beliefs or engage in spiritual practices but do not belong to an organized religion, use the term "LGBTQ+ spiritual people."
alternative label: LGBTQ+ religions
change note: Version 3.7.0
in scheme: v3
narrower: https://homosaurus.org/v3/homoit0000225
narrower: https://homosaurus.org/v3/homoit0000265
narrower: https://homosaurus.org/v3/homoit0000300
narrower: https://homosaurus.org/v3/homoit0000633
narrower: https://homosaurus.org/v3/homoit0000682
narrower: https://homosaurus.org/v3/homoit0000939
narrower: https://homosaurus.org/v3/homoit0000940
narrower: https://homosaurus.org/v3/homoit0000955
narrower: https://homosaurus.org/v3/homoit0001032
narrower: https://homosaurus.org/v3/homoit0001069
narrower: https://homosaurus.org/v3/homoit0003347
related: https://homosaurus.org/v3/homoit0000082
related: https://homosaurus.org/v3/homoit0000948
related: https://homosaurus.org/v3/homoit0001218
related: https://homosaurus.org/v3/homoit0003609

Family members
type: Concept
issued: 2019-05-14
modified: 2025-02-23
replaces: familyMembers
comment: A group of people in kinship through adoption, biology, or choice.
change note: Version 3.7.0
in scheme: v3
narrower: https://homosaurus.org/v3/homoit0000255
narrower: https://homosaurus.org/v3/homoit0000423
narrower: https://homosaurus.org/v3/homoit0000601
narrower: https://homosaurus.org/v3/homoit0000602
narrower: https://homosaurus.org/v3/homoit0001021
narrower: https://homosaurus.org/v3/homoit0001310
narrower: https://homosaurus.org/v3/homoit0002293
narrower: https://homosaurus.org/v3/homoit0002294
narrower: https://homosaurus.org/v3/homoit0002351
narrower: https://homosaurus.org/v3/homoit0002353
narrower: https://homosaurus.org/v3/homoit0002360
narrower: https://homosaurus.org/v3/homoit0002361
narrower: https://homosaurus.org/v3/homoit0002372

Gender
type: Concept
issued: 2019-05-14
modified: 2025-02-23
replaces: gender
comment: A socially constructed system that gives meaning to masculinity and femininity and that unevenly distributes power and opportunity according to cultural interpretations of sex. As an element of personal identity, a gender is developed through the interaction of social roles and expectations, one’s response to those expectations, one’s physiology, and one’s internal sense of self. Gender is culturally specific, meaning that different cultures have different understandings of what gender means and how many genders should be recognized.
change note: Version 3.7.0
in scheme: v3
narrower: https://homosaurus.org/v3/homoit0000078
narrower: https://homosaurus.org/v3/homoit0000568
narrower: https://homosaurus.org/v3/homoit0000571
narrower: https://homosaurus.org/v3/homoit0003824
related: https://homosaurus.org/v3/homoit0000288
related: https://homosaurus.org/v3/homoit0000561
related: https://homosaurus.org/v3/homoit0000563
related: https://homosaurus.org/v3/homoit0000565
related: https://homosaurus.org/v3/homoit0000566
related: https://homosaurus.org/v3/homoit0000575
related: https://homosaurus.org/v3/homoit0000578
related: https://homosaurus.org/v3/homoit0000579
related: https://homosaurus.org/v3/homoit0000580
related: https://homosaurus.org/v3/homoit0001090
related: https://homosaurus.org/v3/homoit0001269
related: https://homosaurus.org/v3/homoit0001463
related: https://homosaurus.org/v3/homoit0001816
related: https://homosaurus.org/v3/homoit0001817
related: https://homosaurus.org/v3/homoit0001899

Subcultures
type: Concept
issued: 2019-05-14
modified: 2025-02-23
replaces: subcultures
comment: Groups of people belonging to cultures that differentiate them from the larger culture to which they belong. Subcultures develop their own norms and values regarding cultural, political, and sexual matters.
change note: Version 3.7.0
in scheme: v3
narrower: https://homosaurus.org/v3/homoit0000092
narrower: https://homosaurus.org/v3/homoit0000327
narrower: https://homosaurus.org/v3/homoit0000338
narrower: https://homosaurus.org/v3/homoit0000705
narrower: https://homosaurus.org/v3/homoit0001247
narrower: https://homosaurus.org/v3/homoit0001654
narrower: https://homosaurus.org/v3/homoit0001831
narrower: https://homosaurus.org/v3/homoit0002156
narrower: https://homosaurus.org/v3/homoit0003123

LGBTQ+ people
type: Concept
issued: 2019-05-14
modified: 2025-02-23
replaces: LGBTQPeople
comment: Self-identified lesbians, gay men, bisexual people, transgender people, queer people, and other sexual and gender minorities.
alternative label: Gay people
alternative label: LGBTQ people
alternative label: People (LGBTQ)
change note: Version 3.7.0
in scheme: v3
narrower: https://homosaurus.org/v3/homoit0000007
narrower: https://homosaurus.org/v3/homoit0000008
narrower: https://homosaurus.org/v3/homoit0000070
narrower: https://homosaurus.org/v3/homoit0000082
narrower: https://homosaurus.org/v3/homoit0000108
narrower: https://homosaurus.org/v3/homoit0000170
narrower: https://homosaurus.org/v3/homoit0000312
narrower: https://homosaurus.org/v3/homoit0000330
narrower: https://homosaurus.org/v3/homoit0000379
narrower: https://homosaurus.org/v3/homoit0000393
narrower: https://homosaurus.org/v3/homoit0000506
narrower: https://homosaurus.org/v3/homoit0000556
narrower: https://homosaurus.org/v3/homoit0000618
narrower: https://homosaurus.org/v3/homoit0000860
narrower: https://homosaurus.org/v3/homoit0000862
narrower: https://homosaurus.org/v3/homoit0000879
narrower: https://homosaurus.org/v3/homoit0000887
narrower: https://homosaurus.org/v3/homoit0000895
narrower: https://homosaurus.org/v3/homoit0000902
narrower: https://homosaurus.org/v3/homoit0000908
narrower: https://homosaurus.org/v3/homoit0000927
narrower: https://homosaurus.org/v3/homoit0000961
narrower: https://homosaurus.org/v3/homoit0001009
narrower: https://homosaurus.org/v3/homoit0001073
narrower: https://homosaurus.org/v3/homoit0001195
narrower: https://homosaurus.org/v3/homoit0001329
narrower: https://homosaurus.org/v3/homoit0001352
narrower: https://homosaurus.org/v3/homoit0001378
narrower: https://homosaurus.org/v3/homoit0001482
narrower: https://homosaurus.org/v3/homoit0001510
narrower: https://homosaurus.org/v3/homoit0001549
narrower: https://homosaurus.org/v3/homoit0001550
narrower: https://homosaurus.org/v3/homoit0001771
narrower: https://homosaurus.org/v3/homoit0001783
narrower: https://homosaurus.org/v3/homoit0001815
narrower: https://homosaurus.org/v3/homoit0001853
narrower: https://homosaurus.org/v3/homoit0001854
narrower: https://homosaurus.org/v3/homoit0001879
narrower: https://homosaurus.org/v3/homoit0001919
narrower: https://homosaurus.org/v3/homoit0001929
narrower: https://homosaurus.org/v3/homoit0001989
narrower: https://homosaurus.org/v3/homoit0002181
narrower: https://homosaurus.org/v3/homoit0002226
narrower: https://homosaurus.org/v3/homoit0002227
narrower: https://homosaurus.org/v3/homoit0002228
narrower: https://homosaurus.org/v3/homoit0002277
narrower: https://homosaurus.org/v3/homoit0002278
narrower: https://homosaurus.org/v3/homoit0002279
narrower: https://homosaurus.org/v3/homoit0002336
narrower: https://homosaurus.org/v3/homoit0002349
narrower: https://homosaurus.org/v3/homoit0002356
narrower: https://homosaurus.org/v3/homoit0002358
narrower: https://homosaurus.org/v3/homoit0002360
narrower: https://homosaurus.org/v3/homoit0002585
narrower: https://homosaurus.org/v3/homoit0003247
narrower: https://homosaurus.org/v3/homoit0003263
narrower: https://homosaurus.org/v3/homoit0003370
narrower: https://homosaurus.org/v3/homoit0003533
narrower: https://homosaurus.org/v3/homoit0001101
narrower: https://homosaurus.org/v3/homoit0003637
narrower: https://homosaurus.org/v3/homoit0003677
narrower: https://homosaurus.org/v3/homoit0003696
narrower: https://homosaurus.org/v3/homoit0003697
narrower: https://homosaurus.org/v3/homoit0003739
narrower: https://homosaurus.org/v3/homoit0003740
narrower: https://homosaurus.org/v3/homoit0003741
narrower: https://homosaurus.org/v3/homoit0001277
narrower: https://homosaurus.org/v3/homoit0001723
related: https://homosaurus.org/v3/homoit0001297